maven-notifications mailing list archives

Site index · List index
Message view « Date » · « Thread »
Top « Date » · « Thread »
From Apache Jenkins Server <jenk...@builds.apache.org>
Subject Build failed in Jenkins: Maven TLP » maven-war-plugin » MWAR-413 #1
Date Sun, 01 Apr 2018 17:21:07 GMT
See https://builds.apache.org/job/maven-box/job/maven-war-plugin/job/MWAR-413/1/

No changes.

No tests ran.

Build log:
[...truncated 1.28 MB...]
[linux-jdk9] [INFO] Downloaded from central: https://repo.maven.apache.org/maven2/org/tukaani/xz/1.5/xz-1.5.jar
(100 kB at 3.7 MB/s)
[linux-jdk9] [INFO] Downloaded from central: https://repo.maven.apache.org/maven2/org/apache/commons/commons-compress/1.11/commons-compress-1.11.jar
(426 kB at 12 MB/s)
[linux-jdk9] [INFO] Building jar: /home/jenkins/jenkins-slave/workspace/x_maven-war-plugin_MWAR-413-DPUU256GBI3BW5K4VNAWDOJ57Y2JFIKA3HHY6S6USKZUKQJQD4SA/m/target/maven-war-plugin-3.2.1-SNAPSHOT.jar
[linux-jdk9] [INFO] 
[linux-jdk9] [INFO] --- maven-plugin-plugin:3.5.1:addPluginArtifactMetadata (default-addPluginArtifactMetadata)
@ maven-war-plugin ---
[linux-jdk9] [INFO] 
[linux-jdk9] [INFO] --- maven-site-plugin:3.7:attach-descriptor (attach-descriptor) @ maven-war-plugin
---
[linux-jdk9] [INFO] Downloading from central: https://repo.maven.apache.org/maven2/org/apache/maven/reporting/maven-reporting-exec/1.4/maven-reporting-exec-1.4.pom
[linux-jdk9] [INFO] Downloaded from central: https://repo.maven.apache.org/maven2/org/apache/maven/reporting/maven-reporting-exec/1.4/maven-reporting-exec-1.4.pom
(12 kB at 1.1 MB/s)
[linux-jdk9] [INFO] Downloading from central: https://repo.maven.apache.org/maven2/org/apache/maven/shared/maven-shared-utils/0.3/maven-shared-utils-0.3.pom
[linux-jdk9] [INFO] Downloaded from central: https://repo.maven.apache.org/maven2/org/apache/maven/shared/maven-shared-utils/0.3/maven-shared-utils-0.3.pom
(4.0 kB at 368 kB/s)
[linux-jdk9] [INFO] Downloading from central: https://repo.maven.apache.org/maven2/org/codehaus/plexus/plexus-i18n/1.0-beta-10/plexus-i18n-1.0-beta-10.pom
[linux-jdk9] [INFO] Downloaded from central: https://repo.maven.apache.org/maven2/org/codehaus/plexus/plexus-i18n/1.0-beta-10/plexus-i18n-1.0-beta-10.pom
(2.1 kB at 189 kB/s)
[linux-jdk9] [INFO] Downloading from central: https://repo.maven.apache.org/maven2/org/codehaus/plexus/plexus-classworlds/2.5.2/plexus-classworlds-2.5.2.pom
[linux-jdk9] [INFO] Downloaded from central: https://repo.maven.apache.org/maven2/org/codehaus/plexus/plexus-classworlds/2.5.2/plexus-classworlds-2.5.2.pom
(7.3 kB at 664 kB/s)
[linux-jdk9] [INFO] Downloading from central: https://repo.maven.apache.org/maven2/org/apache/maven/doxia/doxia-sink-api/1.8/doxia-sink-api-1.8.pom
[linux-jdk9] [INFO] Downloaded from central: https://repo.maven.apache.org/maven2/org/apache/maven/doxia/doxia-sink-api/1.8/doxia-sink-api-1.8.pom
(1.5 kB at 153 kB/s)
[linux-jdk9] [INFO] Downloading from central: https://repo.maven.apache.org/maven2/org/apache/maven/doxia/doxia/1.8/doxia-1.8.pom
[linux-jdk9] [INFO] Downloaded from central: https://repo.maven.apache.org/maven2/org/apache/maven/doxia/doxia/1.8/doxia-1.8.pom
(18 kB at 1.7 MB/s)
[linux-jdk9] [INFO] Downloading from central: https://repo.maven.apache.org/maven2/org/apache/maven/doxia/doxia-logging-api/1.8/doxia-logging-api-1.8.pom
[linux-jdk9] [INFO] Downloaded from central: https://repo.maven.apache.org/maven2/org/apache/maven/doxia/doxia-logging-api/1.8/doxia-logging-api-1.8.pom
(1.5 kB at 140 kB/s)
[linux-jdk9] [INFO] Downloading from central: https://repo.maven.apache.org/maven2/org/codehaus/plexus/plexus-container-default/1.7.1/plexus-container-default-1.7.1.pom
[linux-jdk9] [INFO] Downloaded from central: https://repo.maven.apache.org/maven2/org/codehaus/plexus/plexus-container-default/1.7.1/plexus-container-default-1.7.1.pom
(2.8 kB at 250 kB/s)
[linux-jdk9] [INFO] Downloading from central: https://repo.maven.apache.org/maven2/org/codehaus/plexus/plexus-classworlds/2.5.1/plexus-classworlds-2.5.1.pom
[linux-jdk9] [INFO] Downloaded from central: https://repo.maven.apache.org/maven2/org/codehaus/plexus/plexus-classworlds/2.5.1/plexus-classworlds-2.5.1.pom
(5.0 kB at 455 kB/s)
[linux-jdk9] [INFO] Downloading from central: https://repo.maven.apache.org/maven2/org/apache/xbean/xbean-reflect/3.7/xbean-reflect-3.7.pom
[linux-jdk9] [INFO] Downloaded from central: https://repo.maven.apache.org/maven2/org/apache/xbean/xbean-reflect/3.7/xbean-reflect-3.7.pom
(5.1 kB at 392 kB/s)
[linux-jdk9] [INFO] Downloading from central: https://repo.maven.apache.org/maven2/org/apache/xbean/xbean/3.7/xbean-3.7.pom
[linux-jdk9] [INFO] Downloaded from central: https://repo.maven.apache.org/maven2/org/apache/xbean/xbean/3.7/xbean-3.7.pom
(15 kB at 1.3 MB/s)
[linux-jdk9] [INFO] Downloading from central: https://repo.maven.apache.org/maven2/org/apache/geronimo/genesis/genesis-java5-flava/2.0/genesis-java5-flava-2.0.pom
[linux-jdk9] [INFO] Downloaded from central: https://repo.maven.apache.org/maven2/org/apache/geronimo/genesis/genesis-java5-flava/2.0/genesis-java5-flava-2.0.pom
(5.5 kB at 498 kB/s)
[linux-jdk9] [INFO] Downloading from central: https://repo.maven.apache.org/maven2/org/apache/geronimo/genesis/genesis-default-flava/2.0/genesis-default-flava-2.0.pom
[linux-jdk9] [INFO] Downloaded from central: https://repo.maven.apache.org/maven2/org/apache/geronimo/genesis/genesis-default-flava/2.0/genesis-default-flava-2.0.pom
(18 kB at 1.5 MB/s)
[linux-jdk9] [INFO] Downloading from central: https://repo.maven.apache.org/maven2/org/apache/geronimo/genesis/genesis/2.0/genesis-2.0.pom
[linux-jdk9] [INFO] Downloaded from central: https://repo.maven.apache.org/maven2/org/apache/geronimo/genesis/genesis/2.0/genesis-2.0.pom
(18 kB at 1.7 MB/s)
[linux-jdk9] [INFO] Downloading from central: https://repo.maven.apache.org/maven2/org/apache/maven/doxia/doxia-module-xhtml/1.8/doxia-module-xhtml-1.8.pom
[linux-jdk9] [INFO] Downloaded from central: https://repo.maven.apache.org/maven2/org/apache/maven/doxia/doxia-module-xhtml/1.8/doxia-module-xhtml-1.8.pom
(1.9 kB at 174 kB/s)
[linux-jdk9] [INFO] Downloading from central: https://repo.maven.apache.org/maven2/org/apache/maven/doxia/doxia-modules/1.8/doxia-modules-1.8.pom
[linux-jdk9] [INFO] Downloaded from central: https://repo.maven.apache.org/maven2/org/apache/maven/doxia/doxia-modules/1.8/doxia-modules-1.8.pom
(2.6 kB at 262 kB/s)
[linux-jdk9] [INFO] Downloading from central: https://repo.maven.apache.org/maven2/org/apache/maven/doxia/doxia-core/1.8/doxia-core-1.8.pom
[linux-jdk9] Sending interrupt signal to process
[windows-jdk7] [INFO] Exploding webapp
[windows-jdk7] [INFO] Assembling webapp [maven-war-plugin-test] in [f:\jenkins\jenkins-slave\workspace\x_maven-war-plugin_MWAR-413-DPUU256GBI3BW5K4VNAWDOJ57Y2JFIKA3HHY6S6USKZUKQJQD4SA\m\target\test-classes\unit\waroverlays\scenario-one-overlay-settings]
[windows-jdk7] [INFO] Processing war project
[windows-jdk7] [INFO] Copying webapp resources [f:\jenkins\jenkins-slave\workspace\x_maven-war-plugin_MWAR-413-DPUU256GBI3BW5K4VNAWDOJ57Y2JFIKA3HHY6S6USKZUKQJQD4SA\m\target\test-classes\unit\waroverlays\scenario-one-overlay-settings-test-data\source]
[windows-jdk7] [INFO] Processing overlay [ id wartests:overlay-full-1]
[windows-jdk7] [INFO] Processing overlay [ id wartests:overlay-full-2]
[windows-jdk7] [INFO] Processing overlay [ id wartests:overlay-full-3]
[windows-jdk7] [INFO] Webapp assembled in [69 msecs]
[windows-jdk7] [INFO] Exploding webapp
[windows-jdk7] [INFO] Assembling webapp [maven-war-plugin-test] in [f:\jenkins\jenkins-slave\workspace\x_maven-war-plugin_MWAR-413-DPUU256GBI3BW5K4VNAWDOJ57Y2JFIKA3HHY6S6USKZUKQJQD4SA\m\target\test-classes\unit\waroverlays\scenario-one-full-settings]
[windows-jdk7] [INFO] Processing war project
[windows-jdk7] [INFO] Copying webapp resources [f:\jenkins\jenkins-slave\workspace\x_maven-war-plugin_MWAR-413-DPUU256GBI3BW5K4VNAWDOJ57Y2JFIKA3HHY6S6USKZUKQJQD4SA\m\target\test-classes\unit\waroverlays\scenario-one-full-settings-test-data\source]
[windows-jdk7] [INFO] Processing overlay [ id wartests:overlay-full-1]
[windows-jdk7] [INFO] Processing overlay [ id wartests:overlay-full-2]
[windows-jdk7] [INFO] Processing overlay [ id wartests:overlay-full-3]
[windows-jdk7] [INFO] Webapp assembled in [82 msecs]
[windows-jdk7] [INFO] Exploding webapp
[windows-jdk7] [INFO] Assembling webapp [maven-war-plugin-test] in [f:\jenkins\jenkins-slave\workspace\x_maven-war-plugin_MWAR-413-DPUU256GBI3BW5K4VNAWDOJ57Y2JFIKA3HHY6S6USKZUKQJQD4SA\m\target\test-classes\unit\waroverlays\overlays-includes-excludes-multiple-defs]
[windows-jdk7] [INFO] Processing overlay [ id wartests:overlay-full-3]
[windows-jdk7] [INFO] Processing overlay [ id wartests:overlay-full-1]
[windows-jdk7] [INFO] Processing overlay [ id wartests:overlay-full-3]
[windows-jdk7] [INFO] Processing war project
[windows-jdk7] [INFO] Copying webapp resources [f:\jenkins\jenkins-slave\workspace\x_maven-war-plugin_MWAR-413-DPUU256GBI3BW5K4VNAWDOJ57Y2JFIKA3HHY6S6USKZUKQJQD4SA\m\target\test-classes\unit\waroverlays\overlays-includes-excludes-multiple-defs-test-data\source]
[windows-jdk7] [INFO] Processing overlay [ id wartests:overlay-full-2]
[windows-jdk7] [INFO] Webapp assembled in [79 msecs]
[windows-jdk7] [INFO] Exploding webapp
[windows-jdk7] [INFO] Assembling webapp [maven-war-plugin-test] in [f:\jenkins\jenkins-slave\workspace\x_maven-war-plugin_MWAR-413-DPUU256GBI3BW5K4VNAWDOJ57Y2JFIKA3HHY6S6USKZUKQJQD4SA\m\target\test-classes\unit\waroverlays\cache-removed-overlay]
[windows-jdk7] [INFO] Processing war project
[windows-jdk7] [INFO] Copying webapp resources [f:\jenkins\jenkins-slave\workspace\x_maven-war-plugin_MWAR-413-DPUU256GBI3BW5K4VNAWDOJ57Y2JFIKA3HHY6S6USKZUKQJQD4SA\m\target\test-classes\unit\waroverlays\cache-removed-overlay-test-data\source]
[windows-jdk7] [INFO] Processing overlay [ id wartests:overlay-one]
[windows-jdk7] [INFO] Processing overlay [ id wartests:overlay-two]
[windows-jdk7] [INFO] Webapp assembled in [35 msecs]
[windows-jdk7] [INFO] Exploding webapp
[windows-jdk7] [INFO] Assembling webapp [maven-war-plugin-test] in [f:\jenkins\jenkins-slave\workspace\x_maven-war-plugin_MWAR-413-DPUU256GBI3BW5K4VNAWDOJ57Y2JFIKA3HHY6S6USKZUKQJQD4SA\m\target\test-classes\unit\waroverlays\cache-removed-overlay]
[windows-jdk7] [WARNING] Dependency [Dependency {groupId=wartests, artifactId=overlay-one,
version=0.0-Test, type=war}] has been removed from the project. If it was included in the
build as an overlay, consider cleaning the target directory of the project (mvn clean)
[windows-jdk7] [INFO] Processing war project
[windows-jdk7] [INFO] Copying webapp resources [f:\jenkins\jenkins-slave\workspace\x_maven-war-plugin_MWAR-413-DPUU256GBI3BW5K4VNAWDOJ57Y2JFIKA3HHY6S6USKZUKQJQD4SA\m\target\test-classes\unit\waroverlays\cache-removed-overlay-test-data\source]
[windows-jdk7] [INFO] Processing overlay [ id wartests:overlay-two]
[windows-jdk7] [WARNING] File [index.jsp] belonged to overlay [wartests:overlay-one] which
does not exist anymore in the current project. It is recommended to invoke clean if the dependencies
of the project changed.
[windows-jdk7] [WARNING] File [WEB-INF/web.xml] belonged to overlay [wartests:overlay-one]
which does not exist anymore in the current project. It is recommended to invoke clean if
the dependencies of the project changed.
[windows-jdk7] [INFO] Webapp assembled in [5 msecs]
[windows-jdk7] [INFO] Tests run: 11, Failures: 0, Errors: 0, Skipped: 0, Time elapsed: 1.941
s - in org.apache.maven.plugins.war.WarOverlaysTest
[windows-jdk7] [INFO] Running org.apache.maven.plugins.war.WarZipTest
[windows-jdk7] [INFO] Packaging webapp
[windows-jdk7] [INFO] Assembling webapp [maven-war-plugin-test] in [f:\jenkins\jenkins-slave\workspace\x_maven-war-plugin_MWAR-413-DPUU256GBI3BW5K4VNAWDOJ57Y2JFIKA3HHY6S6USKZUKQJQD4SA\m\target\test-classes\unit\warziptest\one-zip-overlay-skip]
[windows-jdk7] [INFO] Processing war project
[windows-jdk7] [INFO] Copying webapp resources [f:\jenkins\jenkins-slave\workspace\x_maven-war-plugin_MWAR-413-DPUU256GBI3BW5K4VNAWDOJ57Y2JFIKA3HHY6S6USKZUKQJQD4SA\m\target\test-classes\unit\warziptest\one-zip-overlay-skip-test-data\source]
[windows-jdk7] [INFO] Webapp assembled in [8 msecs]
[windows-jdk7] [INFO] Building war: f:\jenkins\jenkins-slave\workspace\x_maven-war-plugin_MWAR-413-DPUU256GBI3BW5K4VNAWDOJ57Y2JFIKA3HHY6S6USKZUKQJQD4SA\m\target\test-classes\unit\warziptest\one-zip-overlay-skip-output\simple.war
[linux-jdk8] [INFO] run post-build script verify.bsh
[linux-jdk8] [INFO]           MWAR-396_servlet30/pom.xml ....................... FAILED (4.1
s)
[linux-jdk8] [INFO]   The post-build script returned false.
[linux-jdk8] [INFO] Building: MWAR-240/pom.xml
[linux-jdk8] Terminated
[linux-jdk9] [INFO] Downloaded from central: https://repo.maven.apache.org/maven2/org/apache/maven/doxia/doxia-core/1.8/doxia-core-1.8.pom
(4.2 kB at 384 kB/s)
[linux-jdk9] [INFO] Downloading from central: https://repo.maven.apache.org/maven2/org/apache/commons/commons-lang3/3.5/commons-lang3-3.5.pom
[linux-jdk9] [INFO] Downloaded from central: https://repo.maven.apache.org/maven2/org/apache/commons/commons-lang3/3.5/commons-lang3-3.5.pom
(23 kB at 1.9 MB/s)
[linux-jdk9] [INFO] Downloading from central: https://repo.maven.apache.org/maven2/org/apache/commons/commons-parent/41/commons-parent-41.pom
[linux-jdk9] [INFO] Downloaded from central: https://repo.maven.apache.org/maven2/org/apache/commons/commons-parent/41/commons-parent-41.pom
(65 kB at 5.0 MB/s)
[linux-jdk9] [INFO] Downloading from central: https://repo.maven.apache.org/maven2/org/apache/maven/doxia/doxia-module-apt/1.8/doxia-module-apt-1.8.pom
[linux-jdk9] [INFO] Downloaded from central: https://repo.maven.apache.org/maven2/org/apache/maven/doxia/doxia-module-apt/1.8/doxia-module-apt-1.8.pom
(2.0 kB at 167 kB/s)
[linux-jdk9] [INFO] Downloading from central: https://repo.maven.apache.org/maven2/org/apache/maven/doxia/doxia-module-xdoc/1.8/doxia-module-xdoc-1.8.pom
[linux-jdk9] [INFO] Downloaded from central: https://repo.maven.apache.org/maven2/org/apache/maven/doxia/doxia-module-xdoc/1.8/doxia-module-xdoc-1.8.pom
(4.7 kB at 430 kB/s)
[linux-jdk9] [INFO] Downloading from central: https://repo.maven.apache.org/maven2/org/apache/maven/doxia/doxia-module-fml/1.8/doxia-module-fml-1.8.pom
[linux-jdk9] [INFO] Downloaded from central: https://repo.maven.apache.org/maven2/org/apache/maven/doxia/doxia-module-fml/1.8/doxia-module-fml-1.8.pom
(4.6 kB at 386 kB/s)
[linux-jdk9] [INFO] Downloading from central: https://repo.maven.apache.org/maven2/org/apache/maven/doxia/doxia-module-markdown/1.8/doxia-module-markdown-1.8.pom
[linux-jdk9] [INFO] Downloaded from central: https://repo.maven.apache.org/maven2/org/apache/maven/doxia/doxia-module-markdown/1.8/doxia-module-markdown-1.8.pom
(2.4 kB at 222 kB/s)
[linux-jdk9] [INFO] Downloading from central: https://repo.maven.apache.org/maven2/com/vladsch/flexmark/flexmark-all/0.18.4/flexmark-all-0.18.4.pom
[linux-jdk9] [INFO] Downloaded from central: https://repo.maven.apache.org/maven2/com/vladsch/flexmark/flexmark-all/0.18.4/flexmark-all-0.18.4.pom
(7.4 kB at 670 kB/s)
[linux-jdk9] [INFO] Downloading from central: https://repo.maven.apache.org/maven2/com/vladsch/flexmark/flexmark-java/0.18.4/flexmark-java-0.18.4.pom
[linux-jdk9] [INFO] Downloaded from central: https://repo.maven.apache.org/maven2/com/vladsch/flexmark/flexmark-java/0.18.4/flexmark-java-0.18.4.pom
(17 kB at 1.6 MB/s)
[linux-jdk9] [INFO] Downloading from central: https://repo.maven.apache.org/maven2/com/vladsch/flexmark/flexmark/0.18.4/flexmark-0.18.4.pom
[linux-jdk9] [INFO] Downloaded from central: https://repo.maven.apache.org/maven2/com/vladsch/flexmark/flexmark/0.18.4/flexmark-0.18.4.pom
(2.3 kB at 107 kB/s)
[linux-jdk9] [INFO] Downloading from central: https://repo.maven.apache.org/maven2/com/vladsch/flexmark/flexmark-util/0.18.4/flexmark-util-0.18.4.pom
[linux-jdk9] [INFO] Downloaded from central: https://repo.maven.apache.org/maven2/com/vladsch/flexmark/flexmark-util/0.18.4/flexmark-util-0.18.4.pom
(791 B at 79 kB/s)
[linux-jdk9] [INFO] Downloading from central: https://repo.maven.apache.org/maven2/com/vladsch/flexmark/flexmark-ext-abbreviation/0.18.4/flexmark-ext-abbreviation-0.18.4.pom
[linux-jdk9] [INFO] Downloaded from central: https://repo.maven.apache.org/maven2/com/vladsch/flexmark/flexmark-ext-abbreviation/0.18.4/flexmark-ext-abbreviation-0.18.4.pom
(1.8 kB at 159 kB/s)
[linux-jdk9] [INFO] Downloading from central: https://repo.maven.apache.org/maven2/com/vladsch/flexmark/flexmark-ext-autolink/0.18.4/flexmark-ext-autolink-0.18.4.pom
[linux-jdk9] [INFO] Downloaded from central: https://repo.maven.apache.org/maven2/com/vladsch/flexmark/flexmark-ext-autolink/0.18.4/flexmark-ext-autolink-0.18.4.pom
(1.6 kB at 146 kB/s)
[linux-jdk9] [INFO] Downloading from central: https://repo.maven.apache.org/maven2/org/nibor/autolink/autolink/0.6.0/autolink-0.6.0.pom
[linux-jdk9] [INFO] Downloaded from central: https://repo.maven.apache.org/maven2/org/nibor/autolink/autolink/0.6.0/autolink-0.6.0.pom
(9.2 kB at 833 kB/s)
[linux-jdk9] [INFO] Downloading from central: https://repo.maven.apache.org/maven2/com/vladsch/flexmark/flexmark-formatter/0.18.4/flexmark-formatter-0.18.4.pom
[linux-jdk9] [INFO] Downloaded from central: https://repo.maven.apache.org/maven2/com/vladsch/flexmark/flexmark-formatter/0.18.4/flexmark-formatter-0.18.4.pom
(1.1 kB at 94 kB/s)
[linux-jdk9] [INFO] Downloading from central: https://repo.maven.apache.org/maven2/com/vladsch/flexmark/flexmark-ext-typographic/0.18.4/flexmark-ext-typographic-0.18.4.pom
[linux-jdk9] [INFO] Downloaded from central: https://repo.maven.apache.org/maven2/com/vladsch/flexmark/flexmark-ext-typographic/0.18.4/flexmark-ext-typographic-0.18.4.pom
(1.3 kB at 118 kB/s)
[linux-jdk9] [INFO] Downloading from central: https://repo.maven.apache.org/maven2/com/vladsch/flexmark/flexmark-ext-anchorlink/0.18.4/flexmark-ext-anchorlink-0.18.4.pom
[linux-jdk9] [INFO] Downloaded from central: https://repo.maven.apache.org/maven2/com/vladsch/flexmark/flexmark-ext-anchorlink/0.18.4/flexmark-ext-anchorlink-0.18.4.pom
(1.6 kB at 160 kB/s)
[linux-jdk9] [INFO] Downloading from central: https://repo.maven.apache.org/maven2/com/vladsch/flexmark/flexmark-ext-aside/0.18.4/flexmark-ext-aside-0.18.4.pom
[linux-jdk9] [INFO] Downloaded from central: https://repo.maven.apache.org/maven2/com/vladsch/flexmark/flexmark-ext-aside/0.18.4/flexmark-ext-aside-0.18.4.pom
(1.5 kB at 147 kB/s)
[linux-jdk9] [INFO] Downloading from central: https://repo.maven.apache.org/maven2/com/vladsch/flexmark/flexmark-jira-converter/0.18.4/flexmark-jira-converter-0.18.4.pom
[linux-jdk9] [INFO] Downloaded from central: https://repo.maven.apache.org/maven2/com/vladsch/flexmark/flexmark-jira-converter/0.18.4/flexmark-jira-converter-0.18.4.pom
(2.1 kB at 211 kB/s)
[windows-jdk7] [INFO] Packaging webapp
[windows-jdk7] [INFO] Assembling webapp [maven-war-plugin-test] in [f:\jenkins\jenkins-slave\workspace\x_maven-war-plugin_MWAR-413-DPUU256GBI3BW5K4VNAWDOJ57Y2JFIKA3HHY6S6USKZUKQJQD4SA\m\target\test-classes\unit\warziptest\one-zip-overlay-skip]
[windows-jdk7] [INFO] Processing war project
[windows-jdk7] [INFO] Copying webapp resources [f:\jenkins\jenkins-slave\workspace\x_maven-war-plugin_MWAR-413-DPUU256GBI3BW5K4VNAWDOJ57Y2JFIKA3HHY6S6USKZUKQJQD4SA\m\target\test-classes\unit\warziptest\one-zip-overlay-skip-test-data\source]
[windows-jdk7] [INFO] Skipping overlay [ id zipGroupId:zipId]
[windows-jdk7] [INFO] Webapp assembled in [7 msecs]
[windows-jdk7] [INFO] Building war: f:\jenkins\jenkins-slave\workspace\x_maven-war-plugin_MWAR-413-DPUU256GBI3BW5K4VNAWDOJ57Y2JFIKA3HHY6S6USKZUKQJQD4SA\m\target\test-classes\unit\warziptest\one-zip-overlay-skip-output\simple.war
[windows-jdk7] [INFO] Packaging webapp
[windows-jdk7] [INFO] Assembling webapp [maven-war-plugin-test] in [f:\jenkins\jenkins-slave\workspace\x_maven-war-plugin_MWAR-413-DPUU256GBI3BW5K4VNAWDOJ57Y2JFIKA3HHY6S6USKZUKQJQD4SA\m\target\test-classes\unit\warziptest\one-zip-overlay-targetPath]
[windows-jdk7] [INFO] Processing war project
[windows-jdk7] [INFO] Copying webapp resources [f:\jenkins\jenkins-slave\workspace\x_maven-war-plugin_MWAR-413-DPUU256GBI3BW5K4VNAWDOJ57Y2JFIKA3HHY6S6USKZUKQJQD4SA\m\target\test-classes\unit\warziptest\one-zip-overlay-targetPath-test-data\source]
[windows-jdk7] [INFO] Processing overlay [ id zipGroupId:zipId]
[windows-jdk7] [INFO] Webapp assembled in [18 msecs]
[windows-jdk7] [INFO] Building war: f:\jenkins\jenkins-slave\workspace\x_maven-war-plugin_MWAR-413-DPUU256GBI3BW5K4VNAWDOJ57Y2JFIKA3HHY6S6USKZUKQJQD4SA\m\target\test-classes\unit\warziptest\one-zip-overlay-targetPath-output\simple.war
[windows-jdk7] [INFO] Packaging webapp
[windows-jdk7] [INFO] Assembling webapp [maven-war-plugin-test] in [f:\jenkins\jenkins-slave\workspace\x_maven-war-plugin_MWAR-413-DPUU256GBI3BW5K4VNAWDOJ57Y2JFIKA3HHY6S6USKZUKQJQD4SA\m\target\test-classes\unit\warziptest\one-zip]
[windows-jdk7] [INFO] Processing war project
[windows-jdk7] [INFO] Copying webapp resources [f:\jenkins\jenkins-slave\workspace\x_maven-war-plugin_MWAR-413-DPUU256GBI3BW5K4VNAWDOJ57Y2JFIKA3HHY6S6USKZUKQJQD4SA\m\target\test-classes\unit\warziptest\one-zip-test-data\source]
[windows-jdk7] [INFO] Processing overlay [ id zipGroupId:zipId]
[windows-jdk7] [INFO] Webapp assembled in [12 msecs]
[windows-jdk7] [INFO] Building war: f:\jenkins\jenkins-slave\workspace\x_maven-war-plugin_MWAR-413-DPUU256GBI3BW5K4VNAWDOJ57Y2JFIKA3HHY6S6USKZUKQJQD4SA\m\target\test-classes\unit\warziptest\one-zip-output\simple.war
[windows-jdk7] [INFO] Tests run: 4, Failures: 0, Errors: 0, Skipped: 0, Time elapsed: 0.537
s - in org.apache.maven.plugins.war.WarZipTest
[windows-jdk7] Sending interrupt signal to process
[windows-jdk7] [INFO] 
[windows-jdk7] [INFO] Results:
[windows-jdk7] [INFO] 
[windows-jdk7] [INFO] Tests run: 76, Failures: 0, Errors: 0, Skipped: 0
[windows-jdk7] [INFO] 
[windows-jdk7] [INFO] 
[windows-jdk7] [INFO] --- maven-jar-plugin:3.0.2:jar (default-jar) @ maven-war-plugin ---
[windows-jdk7] [INFO] Downloading: https://repo.maven.apache.org/maven2/org/apache/maven/maven-archiver/3.1.1/maven-archiver-3.1.1.pom
[windows-jdk7] [INFO] Downloaded: https://repo.maven.apache.org/maven2/org/apache/maven/maven-archiver/3.1.1/maven-archiver-3.1.1.pom
(4.3 kB at 543 kB/s)
[windows-jdk7] [INFO] Downloading: https://repo.maven.apache.org/maven2/org/apache/maven/shared/maven-shared-utils/3.0.1/maven-shared-utils-3.0.1.pom
[windows-jdk7] [INFO] Downloaded: https://repo.maven.apache.org/maven2/org/apache/maven/shared/maven-shared-utils/3.0.1/maven-shared-utils-3.0.1.pom
(4.6 kB at 655 kB/s)
[windows-jdk7] [INFO] Downloading: https://repo.maven.apache.org/maven2/org/codehaus/plexus/plexus-archiver/3.3/plexus-archiver-3.3.pom
[windows-jdk7] [INFO] Downloaded: https://repo.maven.apache.org/maven2/org/codehaus/plexus/plexus-archiver/3.3/plexus-archiver-3.3.pom
(5.3 kB at 666 kB/s)
[windows-jdk7] [INFO] Downloading: https://repo.maven.apache.org/maven2/org/codehaus/plexus/plexus/3.2/plexus-3.2.pom
[windows-jdk7] [INFO] Downloaded: https://repo.maven.apache.org/maven2/org/codehaus/plexus/plexus/3.2/plexus-3.2.pom
(19 kB at 2.1 MB/s)
[windows-jdk7] [INFO] Downloading: https://repo.maven.apache.org/maven2/org/codehaus/plexus/plexus-io/2.7.1/plexus-io-2.7.1.pom
[windows-jdk7] [INFO] Downloaded: https://repo.maven.apache.org/maven2/org/codehaus/plexus/plexus-io/2.7.1/plexus-io-2.7.1.pom
(4.9 kB at 546 kB/s)
[windows-jdk7] [INFO] Downloading: https://repo.maven.apache.org/maven2/org/apache/commons/commons-compress/1.11/commons-compress-1.11.pom
[windows-jdk7] [INFO] Downloaded: https://repo.maven.apache.org/maven2/org/apache/commons/commons-compress/1.11/commons-compress-1.11.pom
(13 kB at 1.6 MB/s)
[windows-jdk7] [INFO] Downloading: https://repo.maven.apache.org/maven2/org/tukaani/xz/1.5/xz-1.5.pom
[windows-jdk7] [INFO] Downloaded: https://repo.maven.apache.org/maven2/org/tukaani/xz/1.5/xz-1.5.pom
(1.9 kB at 190 kB/s)
[windows-jdk7] [INFO] Downloading: https://repo.maven.apache.org/maven2/org/codehaus/plexus/plexus-archiver/3.4/plexus-archiver-3.4.pom
[windows-jdk7] [INFO] Downloaded: https://repo.maven.apache.org/maven2/org/codehaus/plexus/plexus-archiver/3.4/plexus-archiver-3.4.pom
(5.3 kB at 888 kB/s)
[Pipeline] [windows-jdk8] // node
[Pipeline] [windows-jdk9] // node
[Pipeline] [windows-jdk10] // node
[Pipeline] [windows-jdk8] }
[windows-jdk8] Failed in branch windows-jdk8
[Pipeline] [windows-jdk9] }
[windows-jdk9] Failed in branch windows-jdk9
[Pipeline] [windows-jdk10] }
[windows-jdk10] Failed in branch windows-jdk10
[Pipeline] [linux-jdk8] }
[Pipeline] [linux-jdk7] }
[Pipeline] [linux-jdk9] }
[Pipeline] [linux-jdk8] // dir
[Pipeline] [linux-jdk7] // dir
[Pipeline] [linux-jdk9] // dir
[Pipeline] [linux-jdk8] }
[linux-jdk8] [withMaven] One or multiple Maven executions have been ignored by the Jenkins
Pipeline Maven Plugin because they have been interrupted before completion (1). See Pipeline
Maven Plugin FAQ for more details.
[Pipeline] [linux-jdk7] }
[linux-jdk7] [withMaven] One or multiple Maven executions have been ignored by the Jenkins
Pipeline Maven Plugin because they have been interrupted before completion (1). See Pipeline
Maven Plugin FAQ for more details.
[Pipeline] [linux-jdk9] }
[linux-jdk9] [withMaven] One or multiple Maven executions have been ignored by the Jenkins
Pipeline Maven Plugin because they have been interrupted before completion (1). See Pipeline
Maven Plugin FAQ for more details.
[Pipeline] [linux-jdk8] // withMaven
[Pipeline] [linux-jdk7] // withMaven
[Pipeline] [linux-jdk9] // withMaven
[Pipeline] [linux-jdk8] echo
[linux-jdk8] [FAIL FAST] linux-jdk10 had first failure, ignoring script returned exit code
143
[Pipeline] [linux-jdk8] }
[Pipeline] [linux-jdk7] echo
[linux-jdk7] [FAIL FAST] linux-jdk10 had first failure, ignoring script returned exit code
143
[Pipeline] [linux-jdk7] }
[Pipeline] [linux-jdk9] echo
[linux-jdk9] [FAIL FAST] linux-jdk10 had first failure, ignoring script returned exit code
143
[Pipeline] [linux-jdk9] }
[Pipeline] [linux-jdk8] // stage
[Pipeline] [linux-jdk7] // stage
[Pipeline] [linux-jdk9] // stage
[Pipeline] [linux-jdk7] }
[Pipeline] [linux-jdk8] }
[Pipeline] [linux-jdk9] }
[Pipeline] [linux-jdk7] // node
[Pipeline] [linux-jdk8] // node
[Pipeline] [linux-jdk9] // node
[Pipeline] [linux-jdk7] }
[Pipeline] [linux-jdk8] }
[Pipeline] [linux-jdk9] }
[windows-jdk7] After 10s process did not stop
[Pipeline] [windows-jdk7] }
[Pipeline] [windows-jdk7] // dir
[Pipeline] [windows-jdk7] }
[windows-jdk7] [withMaven] One or multiple Maven executions have been ignored by the Jenkins
Pipeline Maven Plugin because they have been interrupted before completion (1). See Pipeline
Maven Plugin FAQ for more details.
[Pipeline] [windows-jdk7] // withMaven
[Pipeline] [windows-jdk7] echo
[windows-jdk7] [FAIL FAST] linux-jdk10 had first failure, ignoring null
[Pipeline] [windows-jdk7] }
[Pipeline] [windows-jdk7] // stage
[Pipeline] [windows-jdk7] }
[Pipeline] [windows-jdk7] // node
[Pipeline] [windows-jdk7] }
[Pipeline] // parallel
[Pipeline] echo
***** FAST FAILURE *****

Fast failure triggered by linux-jdk10

***** FAST FAILURE *****
[Pipeline] stage
[Pipeline] { (Notifications)
[Pipeline] echo
Build result: FAILURE
[Pipeline] jiraIssueSelector
[Pipeline] emailext
Mime
  • Unnamed multipart/mixed (inline, None, 0 bytes)
View raw message