maven-notifications mailing list archives

Site index · List index
Message view « Date » · « Thread »
Top « Date » · « Thread »
From Apache Jenkins Server <jenk...@builds.apache.org>
Subject Build failed in Jenkins: Maven TLP » maven-site-plugin » master #37
Date Tue, 24 Apr 2018 13:23:36 GMT
See https://builds.apache.org/job/maven-box/job/maven-site-plugin/job/master/37/

Changes:

* [MSITE-821] add future 3.7.1
* [MSITE-821] add future 3.7.1
* [MSITE-821] add future 3.7.1
* [MSITE-821] add future 3.7.1
* [MSITE-821] add future 3.7.1
* [MSITE-821] add future 3.7.1

No tests ran.

Build log:
[...truncated 1.84 MB...]
[windows-jdk7] [INFO] Downloading: https://repo.maven.apache.org/maven2/com/google/collections/google-collections/1.0/google-collections-1.0.jar
[windows-jdk7] [INFO] Downloading: https://repo.maven.apache.org/maven2/org/apache/xbean/xbean-reflect/3.7/xbean-reflect-3.7.jar
[windows-jdk7] [INFO] Downloading: https://repo.maven.apache.org/maven2/org/codehaus/plexus/plexus-container-default/1.6/plexus-container-default-1.6.jar
[windows-jdk7] [INFO] Downloading: https://repo.maven.apache.org/maven2/org/codehaus/plexus/plexus-classworlds/2.5.1/plexus-classworlds-2.5.1.jar
[windows-jdk7] [INFO] Downloaded: https://repo.maven.apache.org/maven2/org/codehaus/plexus/plexus-classworlds/2.5.1/plexus-classworlds-2.5.1.jar
(50 kB at 600 kB/s)
[windows-jdk7] [INFO] Downloading: https://repo.maven.apache.org/maven2/org/jdom/jdom/1.1/jdom-1.1.jar
[windows-jdk7] [INFO] Downloaded: https://repo.maven.apache.org/maven2/org/codehaus/plexus/plexus-container-default/1.6/plexus-container-default-1.6.jar
(224 kB at 2.6 MB/s)
[windows-jdk7] [INFO] Downloading: https://repo.maven.apache.org/maven2/org/apache/maven/maven-plugin-api/2.0.9/maven-plugin-api-2.0.9.jar
[windows-jdk7] [INFO] Downloaded: https://repo.maven.apache.org/maven2/com/thoughtworks/qdox/qdox/2.0-M2/qdox-2.0-M2.jar
(292 kB at 3.4 MB/s)
[windows-jdk7] [INFO] Downloading: https://repo.maven.apache.org/maven2/org/apache/maven/maven-model/2.0.9/maven-model-2.0.9.jar
[windows-jdk7] [INFO] Downloaded: https://repo.maven.apache.org/maven2/org/apache/xbean/xbean-reflect/3.7/xbean-reflect-3.7.jar
(148 kB at 1.6 MB/s)
[windows-jdk7] [INFO] Downloading: https://repo.maven.apache.org/maven2/org/apache/maven/maven-project/2.0.9/maven-project-2.0.9.jar
[windows-jdk7] [INFO] Downloaded: https://repo.maven.apache.org/maven2/com/google/collections/google-collections/1.0/google-collections-1.0.jar
(640 kB at 6.7 MB/s)
[windows-jdk7] [INFO] Downloaded: https://repo.maven.apache.org/maven2/org/apache/maven/maven-plugin-api/2.0.9/maven-plugin-api-2.0.9.jar
(13 kB at 134 kB/s)
[windows-jdk7] [INFO] Downloading: https://repo.maven.apache.org/maven2/org/apache/maven/maven-settings/2.0.9/maven-settings-2.0.9.jar
[windows-jdk7] [INFO] Downloading: https://repo.maven.apache.org/maven2/org/apache/maven/maven-profile/2.0.9/maven-profile-2.0.9.jar
[windows-jdk7] [INFO] Downloaded: https://repo.maven.apache.org/maven2/org/apache/maven/maven-model/2.0.9/maven-model-2.0.9.jar
(87 kB at 900 kB/s)
[windows-jdk7] [INFO] Downloading: https://repo.maven.apache.org/maven2/org/apache/maven/maven-artifact-manager/2.0.9/maven-artifact-manager-2.0.9.jar
[windows-jdk7] [INFO] Downloaded: https://repo.maven.apache.org/maven2/org/jdom/jdom/1.1/jdom-1.1.jar
(153 kB at 1.5 MB/s)
[windows-jdk7] [INFO] Downloading: https://repo.maven.apache.org/maven2/org/apache/maven/maven-repository-metadata/2.0.9/maven-repository-metadata-2.0.9.jar
[windows-jdk7] [INFO] Downloaded: https://repo.maven.apache.org/maven2/org/apache/maven/maven-project/2.0.9/maven-project-2.0.9.jar
(122 kB at 1.2 MB/s)
[windows-jdk7] [INFO] Downloading: https://repo.maven.apache.org/maven2/org/apache/maven/maven-plugin-registry/2.0.9/maven-plugin-registry-2.0.9.jar
[windows-jdk7] [INFO] Downloaded: https://repo.maven.apache.org/maven2/org/apache/maven/maven-profile/2.0.9/maven-profile-2.0.9.jar
(35 kB at 330 kB/s)
[windows-jdk7] [INFO] Downloading: https://repo.maven.apache.org/maven2/org/apache/maven/maven-artifact/2.0.9/maven-artifact-2.0.9.jar
[windows-jdk7] [INFO] Downloaded: https://repo.maven.apache.org/maven2/org/apache/maven/maven-artifact-manager/2.0.9/maven-artifact-manager-2.0.9.jar
(58 kB at 541 kB/s)
[windows-jdk7] [INFO] Downloading: https://repo.maven.apache.org/maven2/org/codehaus/plexus/plexus-cli/1.6/plexus-cli-1.6.jar
[windows-jdk7] [INFO] Downloaded: https://repo.maven.apache.org/maven2/org/apache/maven/maven-repository-metadata/2.0.9/maven-repository-metadata-2.0.9.jar
(25 kB at 223 kB/s)
[windows-jdk7] [INFO] Downloading: https://repo.maven.apache.org/maven2/org/ow2/asm/asm-all/5.0.2/asm-all-5.0.2.jar
[windows-jdk7] [INFO] Downloaded: https://repo.maven.apache.org/maven2/org/apache/maven/maven-settings/2.0.9/maven-settings-2.0.9.jar
(49 kB at 423 kB/s)
[windows-jdk7] [INFO] Downloaded: https://repo.maven.apache.org/maven2/org/apache/maven/maven-plugin-registry/2.0.9/maven-plugin-registry-2.0.9.jar
(29 kB at 251 kB/s)
[windows-jdk7] [INFO] Downloaded: https://repo.maven.apache.org/maven2/org/codehaus/plexus/plexus-cli/1.6/plexus-cli-1.6.jar
(7.4 kB at 62 kB/s)
[windows-jdk7] [INFO] Downloaded: https://repo.maven.apache.org/maven2/org/apache/maven/maven-artifact/2.0.9/maven-artifact-2.0.9.jar
(89 kB at 747 kB/s)
[windows-jdk7] [INFO] Downloaded: https://repo.maven.apache.org/maven2/org/ow2/asm/asm-all/5.0.2/asm-all-5.0.2.jar
(242 kB at 1.9 MB/s)
[windows-jdk7] [INFO] 
[windows-jdk7] [INFO] --- maven-resources-plugin:3.0.2:testResources (default-testResources)
@ maven-site-plugin ---
[windows-jdk7] [INFO] Using 'UTF-8' encoding to copy filtered resources.
[windows-jdk7] [INFO] Copying 3 resources
[windows-jdk7] [INFO] Copying 3 resources
[windows-jdk7] [INFO] 
[windows-jdk7] [INFO] --- maven-compiler-plugin:3.7.0:testCompile (default-testCompile) @
maven-site-plugin ---
[windows-jdk7] [INFO] Changes detected - recompiling the module!
[windows-jdk7] [INFO] Compiling 7 source files to f:\jenkins\jenkins-slave\workspace\ox_maven-site-plugin_master-LZWAKOPRMO5JAZW5HRA2IQ56LLTFU3PLKDIE2JNFFXEGASBYKK3Q\m\target\test-classes
[windows-jdk8] [INFO] Downloaded: https://repo.maven.apache.org/maven2/org/apache/maven/surefire/surefire-logger-api/2.20.1/surefire-logger-api-2.20.1.jar
(13 kB at 40 kB/s)
[windows-jdk8] [INFO] Downloading: https://repo.maven.apache.org/maven2/junit/junit/4.12/junit-4.12.jar
[windows-jdk8] [INFO] Downloaded: https://repo.maven.apache.org/maven2/org/apache/maven/surefire/surefire-booter/2.20.1/surefire-booter-2.20.1.jar
(268 kB at 791 kB/s)
[windows-jdk8] [INFO] Downloaded: https://repo.maven.apache.org/maven2/org/apache/maven/surefire/maven-surefire-common/2.20.1/maven-surefire-common-2.20.1.jar
(509 kB at 1.4 MB/s)
[windows-jdk8] [INFO] Downloaded: https://repo.maven.apache.org/maven2/junit/junit/4.12/junit-4.12.jar
(315 kB at 872 kB/s)
[windows-jdk8] [INFO] Downloaded: https://repo.maven.apache.org/maven2/org/apache/maven/surefire/surefire-api/2.20.1/surefire-api-2.20.1.jar
(183 kB at 498 kB/s)
[windows-jdk8] [INFO] Downloaded: https://repo.maven.apache.org/maven2/org/apache/maven/plugin-tools/maven-plugin-annotations/3.3/maven-plugin-annotations-3.3.jar
(14 kB at 37 kB/s)
[windows-jdk8] [INFO] Downloading: https://repo.maven.apache.org/maven2/org/apache/maven/surefire/surefire-junit4/2.20.1/surefire-junit4-2.20.1.pom
[windows-jdk8] [INFO] Downloaded: https://repo.maven.apache.org/maven2/org/apache/maven/surefire/surefire-junit4/2.20.1/surefire-junit4-2.20.1.pom
(3.3 kB at 327 kB/s)
[windows-jdk8] [INFO] Downloading: https://repo.maven.apache.org/maven2/org/apache/maven/surefire/surefire-providers/2.20.1/surefire-providers-2.20.1.pom
[windows-jdk8] [INFO] Downloaded: https://repo.maven.apache.org/maven2/org/apache/maven/surefire/surefire-providers/2.20.1/surefire-providers-2.20.1.pom
(2.6 kB at 378 kB/s)
[windows-jdk8] [INFO] Downloading: https://repo.maven.apache.org/maven2/org/apache/maven/surefire/surefire-junit4/2.20.1/surefire-junit4-2.20.1.jar
[windows-jdk8] [INFO] Downloaded: https://repo.maven.apache.org/maven2/org/apache/maven/surefire/surefire-junit4/2.20.1/surefire-junit4-2.20.1.jar
(82 kB at 3.0 MB/s)
[windows-jdk8] [INFO] 
[windows-jdk8] [INFO] -------------------------------------------------------
[windows-jdk8] [INFO]  T E S T S
[windows-jdk8] [INFO] -------------------------------------------------------
[windows-jdk9] [INFO] Running org.apache.maven.plugins.site.deploy.SiteDeployMojoTest
[linux-jdk9] [INFO] java-annotations mojo extractor found 9 mojo descriptors.
[windows-jdk7] [INFO] /f:/jenkins/jenkins-slave/workspace/ox_maven-site-plugin_master-LZWAKOPRMO5JAZW5HRA2IQ56LLTFU3PLKDIE2JNFFXEGASBYKK3Q/m/src/test/java/org/apache/maven/plugins/site/deploy/SiteDeployMojoTest.java:
Some input files use or override a deprecated API.
[windows-jdk7] [INFO] /f:/jenkins/jenkins-slave/workspace/ox_maven-site-plugin_master-LZWAKOPRMO5JAZW5HRA2IQ56LLTFU3PLKDIE2JNFFXEGASBYKK3Q/m/src/test/java/org/apache/maven/plugins/site/deploy/SiteDeployMojoTest.java:
Recompile with -Xlint:deprecation for details.
[windows-jdk7] [INFO] 
[windows-jdk7] [INFO] --- maven-surefire-plugin:2.20.1:test (default-test) @ maven-site-plugin
---
[windows-jdk7] [INFO] Downloading: https://repo.maven.apache.org/maven2/org/apache/maven/surefire/maven-surefire-common/2.20.1/maven-surefire-common-2.20.1.pom
[windows-jdk7] [INFO] Downloaded: https://repo.maven.apache.org/maven2/org/apache/maven/surefire/maven-surefire-common/2.20.1/maven-surefire-common-2.20.1.pom
(9.3 kB at 424 kB/s)
[windows-jdk7] [INFO] Downloading: https://repo.maven.apache.org/maven2/org/apache/maven/plugin-tools/maven-plugin-annotations/3.3/maven-plugin-annotations-3.3.pom
[windows-jdk7] [INFO] Downloaded: https://repo.maven.apache.org/maven2/org/apache/maven/plugin-tools/maven-plugin-annotations/3.3/maven-plugin-annotations-3.3.pom
(1.6 kB at 272 kB/s)
[windows-jdk7] [INFO] Downloading: https://repo.maven.apache.org/maven2/org/apache/maven/plugin-tools/maven-plugin-tools/3.3/maven-plugin-tools-3.3.pom
[windows-jdk7] [INFO] Downloaded: https://repo.maven.apache.org/maven2/org/apache/maven/plugin-tools/maven-plugin-tools/3.3/maven-plugin-tools-3.3.pom
(13 kB at 1.8 MB/s)
[windows-jdk7] [INFO] Downloading: https://repo.maven.apache.org/maven2/org/apache/maven/surefire/surefire-api/2.20.1/surefire-api-2.20.1.pom
[windows-jdk7] [INFO] Downloaded: https://repo.maven.apache.org/maven2/org/apache/maven/surefire/surefire-api/2.20.1/surefire-api-2.20.1.pom
(3.7 kB at 406 kB/s)
[windows-jdk7] [INFO] Downloading: https://repo.maven.apache.org/maven2/org/apache/maven/surefire/surefire-logger-api/2.20.1/surefire-logger-api-2.20.1.pom
[windows-jdk7] [INFO] Downloaded: https://repo.maven.apache.org/maven2/org/apache/maven/surefire/surefire-logger-api/2.20.1/surefire-logger-api-2.20.1.pom
(2.0 kB at 251 kB/s)
[windows-jdk7] [INFO] Downloading: https://repo.maven.apache.org/maven2/org/apache/maven/surefire/surefire-booter/2.20.1/surefire-booter-2.20.1.pom
[windows-jdk7] [INFO] Downloaded: https://repo.maven.apache.org/maven2/org/apache/maven/surefire/surefire-booter/2.20.1/surefire-booter-2.20.1.pom
(8.5 kB at 445 kB/s)
[windows-jdk7] [INFO] Downloading: https://repo.maven.apache.org/maven2/org/apache/maven/surefire/maven-surefire-common/2.20.1/maven-surefire-common-2.20.1.jar
[windows-jdk7] [INFO] Downloading: https://repo.maven.apache.org/maven2/org/apache/maven/surefire/surefire-booter/2.20.1/surefire-booter-2.20.1.jar
[windows-jdk7] [INFO] Downloading: https://repo.maven.apache.org/maven2/org/apache/maven/plugin-tools/maven-plugin-annotations/3.3/maven-plugin-annotations-3.3.jar
[windows-jdk7] [INFO] Downloading: https://repo.maven.apache.org/maven2/org/apache/maven/surefire/surefire-logger-api/2.20.1/surefire-logger-api-2.20.1.jar
[windows-jdk7] [INFO] Downloading: https://repo.maven.apache.org/maven2/org/apache/maven/surefire/surefire-api/2.20.1/surefire-api-2.20.1.jar
[windows-jdk7] [INFO] Downloaded: https://repo.maven.apache.org/maven2/org/apache/maven/plugin-tools/maven-plugin-annotations/3.3/maven-plugin-annotations-3.3.jar
(14 kB at 702 kB/s)
[windows-jdk7] [INFO] Downloading: https://repo.maven.apache.org/maven2/junit/junit/4.12/junit-4.12.jar
[windows-jdk7] [INFO] Downloaded: https://repo.maven.apache.org/maven2/org/apache/maven/surefire/surefire-api/2.20.1/surefire-api-2.20.1.jar
(183 kB at 8.7 MB/s)
[windows-jdk7] [INFO] Downloaded: https://repo.maven.apache.org/maven2/org/apache/maven/surefire/surefire-logger-api/2.20.1/surefire-logger-api-2.20.1.jar
(13 kB at 617 kB/s)
[windows-jdk7] [INFO] Downloaded: https://repo.maven.apache.org/maven2/org/apache/maven/surefire/surefire-booter/2.20.1/surefire-booter-2.20.1.jar
(268 kB at 11 MB/s)
[windows-jdk7] [INFO] Downloaded: https://repo.maven.apache.org/maven2/org/apache/maven/surefire/maven-surefire-common/2.20.1/maven-surefire-common-2.20.1.jar
(509 kB at 13 MB/s)
[windows-jdk7] [INFO] Downloaded: https://repo.maven.apache.org/maven2/junit/junit/4.12/junit-4.12.jar
(315 kB at 7.9 MB/s)
[windows-jdk7] Sending interrupt signal to process
[windows-jdk7] [INFO] Downloading: https://repo.maven.apache.org/maven2/org/apache/maven/surefire/surefire-junit4/2.20.1/surefire-junit4-2.20.1.pom
[windows-jdk7] [INFO] Downloaded: https://repo.maven.apache.org/maven2/org/apache/maven/surefire/surefire-junit4/2.20.1/surefire-junit4-2.20.1.pom
(3.3 kB at 102 kB/s)
[windows-jdk7] [INFO] Downloading: https://repo.maven.apache.org/maven2/org/apache/maven/surefire/surefire-providers/2.20.1/surefire-providers-2.20.1.pom
[windows-jdk7] [INFO] Downloaded: https://repo.maven.apache.org/maven2/org/apache/maven/surefire/surefire-providers/2.20.1/surefire-providers-2.20.1.pom
(2.6 kB at 265 kB/s)
[windows-jdk7] [INFO] Downloading: https://repo.maven.apache.org/maven2/org/apache/maven/surefire/surefire-junit4/2.20.1/surefire-junit4-2.20.1.jar
[windows-jdk7] [INFO] Downloaded: https://repo.maven.apache.org/maven2/org/apache/maven/surefire/surefire-junit4/2.20.1/surefire-junit4-2.20.1.jar
(82 kB at 4.1 MB/s)
[windows-jdk8] [INFO] Running org.apache.maven.plugins.site.deploy.SiteDeployMojoTest
[windows-jdk9] Sending interrupt signal to process
[windows-jdk9] [INFO] Tests run: 1, Failures: 0, Errors: 0, Skipped: 0, Time elapsed: 1.407
s - in org.apache.maven.plugins.site.deploy.SiteDeployMojoTest
[windows-jdk9] [INFO] Running org.apache.maven.plugins.site.deploy.SiteDeployWebDavTest
[windows-jdk9] 301 [main] INFO org.mortbay.log - Logging to org.slf4j.impl.SimpleLogger(org.mortbay.log)
via org.mortbay.log.Slf4jLog
[windows-jdk9] 327 [main] INFO org.mortbay.log - jetty-6.1.x
[windows-jdk8] Sending interrupt signal to process
[windows-jdk8] [INFO] 
[windows-jdk8] [INFO] Results:
[windows-jdk8] [INFO] 
[windows-jdk8] [INFO] Tests run: 0, Failures: 0, Errors: 0, Skipped: 0
[windows-jdk8] [INFO] 
[windows-jdk8] [ERROR] There are test failures.
[windows-jdk8] 
[windows-jdk8] Please refer to f:\jenkins\jenkins-slave\workspace\ox_maven-site-plugin_master-LZWAKOPRMO5JAZW5HRA2IQ56LLTFU3PLKDIE2JNFFXEGASBYKK3Q@2\m\target\surefire-reports
for the individual test results.
[windows-jdk8] Please refer to dump files (if any exist) [date]-jvmRun[N].dump, [date].dumpstream
and [date]-jvmRun[N].dumpstream.
[windows-jdk8] The forked VM terminated without properly saying goodbye. VM crash or System.exit
called?
[windows-jdk8] Command was cmd.exe /X /C "f:\jenkins\tools\java\latest1.8\jre\bin\java -jar
C:\Users\jenkins\AppData\Local\Temp\1\surefire5109773503599752401\surefirebooter2017782866121241529.jar
C:\Users\jenkins\AppData\Local\Temp\1\surefire5109773503599752401 2018-04-24T13-23-22_401-jvmRun1
surefire8153983225000518414tmp surefire_01309546030967161986tmp"
[windows-jdk8] Error occurred in starting fork, check output in log
[windows-jdk8] Process Exit Code: -1
[windows-jdk8] Crashed tests:
[windows-jdk8] org.apache.maven.plugins.site.deploy.SiteDeployMojoTest
[windows-jdk8] org.apache.maven.surefire.booter.SurefireBooterForkException: The forked VM
terminated without properly saying goodbye. VM crash or System.exit called?
[windows-jdk8] Command was cmd.exe /X /C "f:\jenkins\tools\java\latest1.8\jre\bin\java -jar
C:\Users\jenkins\AppData\Local\Temp\1\surefire5109773503599752401\surefirebooter2017782866121241529.jar
C:\Users\jenkins\AppData\Local\Temp\1\surefire5109773503599752401 2018-04-24T13-23-22_401-jvmRun1
surefire8153983225000518414tmp surefire_01309546030967161986tmp"
[windows-jdk8] Error occurred in starting fork, check output in log
[windows-jdk8] Process Exit Code: -1
[windows-jdk8] Crashed tests:
[windows-jdk8] org.apache.maven.plugins.site.deploy.SiteDeployMojoTest
[windows-jdk8] 	at org.apache.maven.plugin.surefire.booterclient.ForkStarter.fork(ForkStarter.java:686)
[windows-jdk8] 	at org.apache.maven.plugin.surefire.booterclient.ForkStarter.fork(ForkStarter.java:535)
[windows-jdk8] 	at org.apache.maven.plugin.surefire.booterclient.ForkStarter.run(ForkStarter.java:280)
[windows-jdk8] 	at org.apache.maven.plugin.surefire.booterclient.ForkStarter.run(ForkStarter.java:245)
[windows-jdk8] 	at org.apache.maven.plugin.surefire.AbstractSurefireMojo.executeProvider(AbstractSurefireMojo.java:1124)
[windows-jdk8] 	at org.apache.maven.plugin.surefire.AbstractSurefireMojo.executeAfterPreconditionsChecked(AbstractSurefireMojo.java:954)
[windows-jdk8] 	at org.apache.maven.plugin.surefire.AbstractSurefireMojo.execute(AbstractSurefireMojo.java:832)
[windows-jdk8] 	at org.apache.maven.plugin.DefaultBuildPluginManager.executeMojo(DefaultBuildPluginManager.java:134)
[windows-jdk8] 	at org.apache.maven.lifecycle.internal.MojoExecutor.execute(MojoExecutor.java:208)
[windows-jdk8] 	at org.apache.maven.lifecycle.internal.MojoExecutor.execute(MojoExecutor.java:154)
[windows-jdk8] 	at org.apache.maven.lifecycle.internal.MojoExecutor.execute(MojoExecutor.java:146)
[windows-jdk8] 	at org.apache.maven.lifecycle.internal.LifecycleModuleBuilder.buildProject(LifecycleModuleBuilder.java:117)
[windows-jdk8] 	at org.apache.maven.lifecycle.internal.LifecycleModuleBuilder.buildProject(LifecycleModuleBuilder.java:81)
[windows-jdk8] 	at org.apache.maven.lifecycle.internal.builder.singlethreaded.SingleThreadedBuilder.build(SingleThreadedBuilder.java:51)
[windows-jdk8] 	at org.apache.maven.lifecycle.internal.LifecycleStarter.execute(LifecycleStarter.java:128)
[windows-jdk8] 	at org.apache.maven.DefaultMaven.doExecute(DefaultMaven.java:309)
[windows-jdk8] 	at org.apache.maven.DefaultMaven.doExecute(DefaultMaven.java:194)
[windows-jdk8] 	at org.apache.maven.DefaultMaven.execute(DefaultMaven.java:107)
[windows-jdk8] 	at org.apache.maven.cli.MavenCli.execute(MavenCli.java:993)
[windows-jdk8] 	at org.apache.maven.cli.MavenCli.doMain(MavenCli.java:345)
[windows-jdk8] 	at org.apache.maven.cli.MavenCli.main(MavenCli.java:191)
[windows-jdk8] 	at sun.reflect.NativeMethodAccessorImpl.invoke0(Native Method)
[windows-jdk8] 	at sun.reflect.NativeMethodAccessorImpl.invoke(NativeMethodAccessorImpl.java:62)
[windows-jdk8] 	at sun.reflect.DelegatingMethodAccessorImpl.invoke(DelegatingMethodAccessorImpl.java:43)
[windows-jdk8] 	at java.lang.reflect.Method.invoke(Method.java:498)
[windows-jdk8] 	at org.codehaus.plexus.classworlds.launcher.Launcher.launchEnhanced(Launcher.java:289)
[windows-jdk8] 	at org.codehaus.plexus.classworlds.launcher.Launcher.launch(Launcher.java:229)
[windows-jdk8] 	at org.codehaus.plexus.classworlds.launcher.Launcher.mainWithExitCode(Launcher.java:415)
[windows-jdk8] 	at org.codehaus.plexus.classworlds.launcher.Launcher.main(Launcher.java:356)
[windows-jdk8] 
[windows-jdk8] [INFO] 
[windows-jdk8] [INFO] --- maven-jar-plugin:3.0.2:jar (default-jar) @ maven-site-plugin ---
[windows-jdk8] [INFO] Downloading: https://repo.maven.apache.org/maven2/org/apache/maven/shared/maven-shared-utils/3.0.1/maven-shared-utils-3.0.1.jar
[windows-jdk8] [INFO] Downloaded: https://repo.maven.apache.org/maven2/org/apache/maven/shared/maven-shared-utils/3.0.1/maven-shared-utils-3.0.1.jar
(154 kB at 7.4 MB/s)
[Pipeline] [windows-jdk10] // node
[Pipeline] [windows-jdk10] }
[windows-jdk10] Failed in branch windows-jdk10
[Pipeline] [linux-jdk7] }
[Pipeline] [linux-jdk8] }
[Pipeline] [linux-jdk9] }
[Pipeline] [windows-jdk9] }
[Pipeline] [linux-jdk7] // dir
[Pipeline] [linux-jdk8] // dir
[Pipeline] [linux-jdk9] // dir
[Pipeline] [linux-jdk7] }
[linux-jdk7] [withMaven] One or multiple Maven executions have been ignored by the Jenkins
Pipeline Maven Plugin because they have been interrupted before completion (1). See Pipeline
Maven Plugin FAQ for more details.
[Pipeline] [linux-jdk8] }
[linux-jdk8] [withMaven] One or multiple Maven executions have been ignored by the Jenkins
Pipeline Maven Plugin because they have been interrupted before completion (1). See Pipeline
Maven Plugin FAQ for more details.
[Pipeline] [linux-jdk9] }
[linux-jdk9] [withMaven] One or multiple Maven executions have been ignored by the Jenkins
Pipeline Maven Plugin because they have been interrupted before completion (1). See Pipeline
Maven Plugin FAQ for more details.
[Pipeline] [windows-jdk9] // dir
[Pipeline] [windows-jdk9] }
[windows-jdk9] [withMaven] One or multiple Maven executions have been ignored by the Jenkins
Pipeline Maven Plugin because they have been interrupted before completion (1). See Pipeline
Maven Plugin FAQ for more details.
[Pipeline] [linux-jdk7] // withMaven
[Pipeline] [linux-jdk8] // withMaven
[Pipeline] [linux-jdk9] // withMaven
[Pipeline] [linux-jdk7] echo
[linux-jdk7] [FAIL FAST] linux-jdk10 had first failure, ignoring script returned exit code
143
[Pipeline] [linux-jdk7] }
[Pipeline] [linux-jdk8] echo
[linux-jdk8] [FAIL FAST] linux-jdk10 had first failure, ignoring script returned exit code
143
[Pipeline] [linux-jdk8] }
[Pipeline] [linux-jdk9] echo
[linux-jdk9] [FAIL FAST] linux-jdk10 had first failure, ignoring script returned exit code
143
[Pipeline] [linux-jdk9] }
[Pipeline] [windows-jdk9] // withMaven
[Pipeline] [windows-jdk9] echo
[windows-jdk9] [FAIL FAST] linux-jdk10 had first failure, ignoring script returned exit code
-1
[Pipeline] [windows-jdk9] }
[Pipeline] [linux-jdk7] // stage
[Pipeline] [linux-jdk8] // stage
[Pipeline] [linux-jdk9] // stage
[Pipeline] [linux-jdk7] }
[Pipeline] [linux-jdk8] }
[Pipeline] [linux-jdk9] }
[Pipeline] [windows-jdk9] // stage
[Pipeline] [windows-jdk9] }
[Pipeline] [linux-jdk7] // node
[Pipeline] [linux-jdk8] // node
[Pipeline] [linux-jdk9] // node
[Pipeline] [linux-jdk7] }
[Pipeline] [linux-jdk8] }
[Pipeline] [linux-jdk9] }
[Pipeline] [windows-jdk9] // node
[Pipeline] [windows-jdk9] }
[windows-jdk7] After 10s process did not stop
[Pipeline] [windows-jdk7] }
[Pipeline] [windows-jdk7] // dir
[Pipeline] [windows-jdk7] }
[windows-jdk7] [withMaven] One or multiple Maven executions have been ignored by the Jenkins
Pipeline Maven Plugin because they have been interrupted before completion (1). See Pipeline
Maven Plugin FAQ for more details.
[Pipeline] [windows-jdk7] // withMaven
[Pipeline] [windows-jdk7] echo
[windows-jdk7] [FAIL FAST] linux-jdk10 had first failure, ignoring null
[Pipeline] [windows-jdk7] }
[Pipeline] [windows-jdk7] // stage
[Pipeline] [windows-jdk7] }
[Pipeline] [windows-jdk7] // node
[Pipeline] [windows-jdk7] }
[windows-jdk8] After 10s process did not stop
[Pipeline] [windows-jdk8] }
[Pipeline] [windows-jdk8] // dir
[Pipeline] [windows-jdk8] }
[windows-jdk8] [withMaven] One or multiple Maven executions have been ignored by the Jenkins
Pipeline Maven Plugin because they have been interrupted before completion (1). See Pipeline
Maven Plugin FAQ for more details.
[Pipeline] [windows-jdk8] // withMaven
[Pipeline] [windows-jdk8] echo
[windows-jdk8] [FAIL FAST] linux-jdk10 had first failure, ignoring null
[Pipeline] [windows-jdk8] }
[Pipeline] [windows-jdk8] // stage
[Pipeline] [windows-jdk8] }
[Pipeline] [windows-jdk8] // node
[Pipeline] [windows-jdk8] }
[Pipeline] // parallel
[Pipeline] echo
***** FAST FAILURE *****

Fast failure triggered by linux-jdk10

***** FAST FAILURE *****
[Pipeline] stage
[Pipeline] { (Notifications)
[Pipeline] echo
Build result: FAILURE
[Pipeline] jiraIssueSelector
[Pipeline] jiraComment
[Pipeline] emailext
Mime
  • Unnamed multipart/mixed (inline, None, 0 bytes)
View raw message