maven-notifications mailing list archives

Site index · List index
Message view « Date » · « Thread »
Top « Date » · « Thread »
From Apache Jenkins Server <jenk...@builds.apache.org>
Subject Build failed in Jenkins: Maven TLP » maven-site-plugin » master #32
Date Mon, 23 Apr 2018 17:08:41 GMT
See https://builds.apache.org/job/maven-box/job/maven-site-plugin/job/master/32/

Changes:

* [MSITE-818] locale -> language when only language is used
* [MSITE-818] locale -> language when only language is used
* [MSITE-818] locale -> language when only language is used

No tests ran.

Build log:
[...truncated 434.14 KB...]
[windows-jdk10] [INFO] Downloaded: https://repo.maven.apache.org/maven2/org/codehaus/plexus/plexus-compiler-api/2.8.2/plexus-compiler-api-2.8.2.pom
(867 B at 96 kB/s)
[windows-jdk10] [INFO] Downloading: https://repo.maven.apache.org/maven2/org/codehaus/plexus/plexus-compiler/2.8.2/plexus-compiler-2.8.2.pom
[windows-jdk10] [INFO] Downloaded: https://repo.maven.apache.org/maven2/org/codehaus/plexus/plexus-compiler/2.8.2/plexus-compiler-2.8.2.pom
(4.9 kB at 697 kB/s)
[windows-jdk10] [INFO] Downloading: https://repo.maven.apache.org/maven2/org/codehaus/plexus/plexus-compiler-manager/2.8.2/plexus-compiler-manager-2.8.2.pom
[windows-jdk10] [INFO] Downloaded: https://repo.maven.apache.org/maven2/org/codehaus/plexus/plexus-compiler-manager/2.8.2/plexus-compiler-manager-2.8.2.pom
(692 B at 86 kB/s)
[windows-jdk10] [INFO] Downloading: https://repo.maven.apache.org/maven2/org/codehaus/plexus/plexus-compiler-javac/2.8.2/plexus-compiler-javac-2.8.2.pom
[windows-jdk10] [INFO] Downloaded: https://repo.maven.apache.org/maven2/org/codehaus/plexus/plexus-compiler-javac/2.8.2/plexus-compiler-javac-2.8.2.pom
(771 B at 96 kB/s)
[windows-jdk10] [INFO] Downloading: https://repo.maven.apache.org/maven2/org/codehaus/plexus/plexus-compilers/2.8.2/plexus-compilers-2.8.2.pom
[windows-jdk10] [INFO] Downloaded: https://repo.maven.apache.org/maven2/org/codehaus/plexus/plexus-compilers/2.8.2/plexus-compilers-2.8.2.pom
(1.3 kB at 224 kB/s)
[windows-jdk10] [INFO] Downloading: https://repo.maven.apache.org/maven2/org/codehaus/plexus/plexus-java/0.9.2/plexus-java-0.9.2.jar
[windows-jdk10] [INFO] Downloading: https://repo.maven.apache.org/maven2/org/codehaus/plexus/plexus-compiler-api/2.8.2/plexus-compiler-api-2.8.2.jar
[windows-jdk10] [INFO] Downloading: https://repo.maven.apache.org/maven2/org/apache/maven/shared/maven-shared-incremental/1.1/maven-shared-incremental-1.1.jar
[windows-jdk10] [INFO] Downloading: https://repo.maven.apache.org/maven2/com/thoughtworks/qdox/qdox/2.0-M7/qdox-2.0-M7.jar
[windows-jdk10] [INFO] Downloading: https://repo.maven.apache.org/maven2/org/ow2/asm/asm/6.0_BETA/asm-6.0_BETA.jar
[windows-jdk10] [INFO] Downloaded: https://repo.maven.apache.org/maven2/org/ow2/asm/asm/6.0_BETA/asm-6.0_BETA.jar
(56 kB at 3.1 MB/s)
[windows-jdk10] [INFO] Downloading: https://repo.maven.apache.org/maven2/org/codehaus/plexus/plexus-compiler-manager/2.8.2/plexus-compiler-manager-2.8.2.jar
[windows-jdk10] [INFO] Downloaded: https://repo.maven.apache.org/maven2/org/apache/maven/shared/maven-shared-incremental/1.1/maven-shared-incremental-1.1.jar
(14 kB at 645 kB/s)
[windows-jdk10] [INFO] Downloading: https://repo.maven.apache.org/maven2/org/codehaus/plexus/plexus-compiler-javac/2.8.2/plexus-compiler-javac-2.8.2.jar
[windows-jdk10] [INFO] Downloaded: https://repo.maven.apache.org/maven2/org/codehaus/plexus/plexus-java/0.9.2/plexus-java-0.9.2.jar
(31 kB at 1.4 MB/s)
[windows-jdk10] [INFO] Downloaded: https://repo.maven.apache.org/maven2/org/codehaus/plexus/plexus-compiler-api/2.8.2/plexus-compiler-api-2.8.2.jar
(26 kB at 1.2 MB/s)
[windows-jdk10] [INFO] Downloaded: https://repo.maven.apache.org/maven2/com/thoughtworks/qdox/qdox/2.0-M7/qdox-2.0-M7.jar
(315 kB at 13 MB/s)
[windows-jdk10] [INFO] Downloaded: https://repo.maven.apache.org/maven2/org/codehaus/plexus/plexus-compiler-manager/2.8.2/plexus-compiler-manager-2.8.2.jar
(4.7 kB at 146 kB/s)
[windows-jdk10] [INFO] Downloaded: https://repo.maven.apache.org/maven2/org/codehaus/plexus/plexus-compiler-javac/2.8.2/plexus-compiler-javac-2.8.2.jar
(20 kB at 557 kB/s)
[windows-jdk10] [INFO] Changes detected - recompiling the module!
[windows-jdk10] [INFO] Compiling 22 source files to f:\jenkins\jenkins-slave\workspace\ox_maven-site-plugin_master-LZWAKOPRMO5JAZW5HRA2IQ56LLTFU3PLKDIE2JNFFXEGASBYKK3Q@2\m\target\classes
[windows-jdk9] [INFO] run post-build script verify.bsh
[windows-jdk9] [INFO]           inheritedReports\pom.xml ......................... SUCCESS
(8.7 s)
[windows-jdk9] [INFO] Building: it-plugin-test\pom.xml
[windows-jdk10] [INFO] /f:/jenkins/jenkins-slave/workspace/ox_maven-site-plugin_master-LZWAKOPRMO5JAZW5HRA2IQ56LLTFU3PLKDIE2JNFFXEGASBYKK3Q@2/m/src/main/java/org/apache/maven/plugins/site/deploy/AbstractDeployMojo.java:
Some input files use or override a deprecated API.
[windows-jdk10] [INFO] /f:/jenkins/jenkins-slave/workspace/ox_maven-site-plugin_master-LZWAKOPRMO5JAZW5HRA2IQ56LLTFU3PLKDIE2JNFFXEGASBYKK3Q@2/m/src/main/java/org/apache/maven/plugins/site/deploy/AbstractDeployMojo.java:
Recompile with -Xlint:deprecation for details.
[windows-jdk10] [INFO] /f:/jenkins/jenkins-slave/workspace/ox_maven-site-plugin_master-LZWAKOPRMO5JAZW5HRA2IQ56LLTFU3PLKDIE2JNFFXEGASBYKK3Q@2/m/src/main/java/org/apache/maven/plugins/site/run/SiteRunMojo.java:
Some input files use unchecked or unsafe operations.
[windows-jdk10] [INFO] /f:/jenkins/jenkins-slave/workspace/ox_maven-site-plugin_master-LZWAKOPRMO5JAZW5HRA2IQ56LLTFU3PLKDIE2JNFFXEGASBYKK3Q@2/m/src/main/java/org/apache/maven/plugins/site/run/SiteRunMojo.java:
Recompile with -Xlint:unchecked for details.
[windows-jdk10] [INFO] 
[windows-jdk10] [INFO] --- maven-plugin-plugin:3.5.1:descriptor (default-descriptor) @ maven-site-plugin
---
[windows-jdk10] [INFO] Using 'UTF-8' encoding to read mojo source files.
[windows-jdk10] [INFO] java-javadoc mojo extractor found 0 mojo descriptor.
[windows-jdk10] [INFO] java-annotations mojo extractor found 9 mojo descriptors.
[windows-jdk10] [INFO] 
[windows-jdk10] [INFO] --- plexus-component-metadata:1.6:generate-metadata (default) @ maven-site-plugin
---
[windows-jdk10] [INFO] Downloading: https://repo.maven.apache.org/maven2/org/codehaus/plexus/plexus-container-default/1.6/plexus-container-default-1.6.pom
[windows-jdk10] [INFO] Downloaded: https://repo.maven.apache.org/maven2/org/codehaus/plexus/plexus-container-default/1.6/plexus-container-default-1.6.pom
(2.7 kB at 70 kB/s)
[windows-jdk10] [INFO] Downloading: https://repo.maven.apache.org/maven2/com/thoughtworks/qdox/qdox/2.0-M2/qdox-2.0-M2.pom
[windows-jdk10] [INFO] Downloaded: https://repo.maven.apache.org/maven2/com/thoughtworks/qdox/qdox/2.0-M2/qdox-2.0-M2.pom
(18 kB at 1.2 MB/s)
[windows-jdk10] [INFO] Downloading: https://repo.maven.apache.org/maven2/org/codehaus/codehaus-parent/4/codehaus-parent-4.pom
[windows-jdk10] [INFO] Downloaded: https://repo.maven.apache.org/maven2/org/codehaus/codehaus-parent/4/codehaus-parent-4.pom
(4.8 kB at 402 kB/s)
[windows-jdk10] [INFO] Downloading: https://repo.maven.apache.org/maven2/jdom/jdom/1.1/jdom-1.1.pom
[windows-jdk10] [INFO] Downloaded: https://repo.maven.apache.org/maven2/jdom/jdom/1.1/jdom-1.1.pom
(526 B at 75 kB/s)
[windows-jdk10] [INFO] Downloading: https://repo.maven.apache.org/maven2/org/jdom/jdom/1.1/jdom-1.1.pom
[windows-jdk10] [INFO] Downloaded: https://repo.maven.apache.org/maven2/org/jdom/jdom/1.1/jdom-1.1.pom
(2.2 kB at 109 kB/s)
[windows-jdk10] [INFO] Downloading: https://repo.maven.apache.org/maven2/org/apache/maven/maven-plugin-api/2.0.9/maven-plugin-api-2.0.9.pom
[windows-jdk10] [INFO] Downloaded: https://repo.maven.apache.org/maven2/org/apache/maven/maven-plugin-api/2.0.9/maven-plugin-api-2.0.9.pom
(1.5 kB at 187 kB/s)
[windows-jdk10] [INFO] Downloading: https://repo.maven.apache.org/maven2/org/apache/maven/maven/2.0.9/maven-2.0.9.pom
[windows-jdk10] [INFO] Downloaded: https://repo.maven.apache.org/maven2/org/apache/maven/maven/2.0.9/maven-2.0.9.pom
(19 kB at 1.1 MB/s)
[windows-jdk10] [INFO] Downloading: https://repo.maven.apache.org/maven2/org/apache/maven/maven-parent/8/maven-parent-8.pom
[windows-jdk10] [INFO] Downloaded: https://repo.maven.apache.org/maven2/org/apache/maven/maven-parent/8/maven-parent-8.pom
(24 kB at 1.5 MB/s)
[windows-jdk10] [INFO] Downloading: https://repo.maven.apache.org/maven2/org/apache/maven/maven-model/2.0.9/maven-model-2.0.9.pom
[windows-jdk10] [INFO] Downloaded: https://repo.maven.apache.org/maven2/org/apache/maven/maven-model/2.0.9/maven-model-2.0.9.pom
(3.1 kB at 449 kB/s)
[windows-jdk10] [INFO] Downloading: https://repo.maven.apache.org/maven2/org/apache/maven/maven-project/2.0.9/maven-project-2.0.9.pom
[windows-jdk10] [INFO] Downloaded: https://repo.maven.apache.org/maven2/org/apache/maven/maven-project/2.0.9/maven-project-2.0.9.pom
(2.7 kB at 387 kB/s)
[windows-jdk10] [INFO] Downloading: https://repo.maven.apache.org/maven2/org/apache/maven/maven-settings/2.0.9/maven-settings-2.0.9.pom
[windows-jdk10] [INFO] Downloaded: https://repo.maven.apache.org/maven2/org/apache/maven/maven-settings/2.0.9/maven-settings-2.0.9.pom
(2.1 kB at 294 kB/s)
[windows-jdk10] [INFO] Downloading: https://repo.maven.apache.org/maven2/org/apache/maven/maven-profile/2.0.9/maven-profile-2.0.9.pom
[windows-jdk10] [INFO] Downloaded: https://repo.maven.apache.org/maven2/org/apache/maven/maven-profile/2.0.9/maven-profile-2.0.9.pom
(2.0 kB at 342 kB/s)
[windows-jdk10] [INFO] Downloading: https://repo.maven.apache.org/maven2/org/apache/maven/maven-artifact-manager/2.0.9/maven-artifact-manager-2.0.9.pom
[windows-jdk10] [INFO] Downloaded: https://repo.maven.apache.org/maven2/org/apache/maven/maven-artifact-manager/2.0.9/maven-artifact-manager-2.0.9.pom
(2.7 kB at 450 kB/s)
[windows-jdk10] [INFO] Downloading: https://repo.maven.apache.org/maven2/org/apache/maven/maven-repository-metadata/2.0.9/maven-repository-metadata-2.0.9.pom
[windows-jdk10] [INFO] Downloaded: https://repo.maven.apache.org/maven2/org/apache/maven/maven-repository-metadata/2.0.9/maven-repository-metadata-2.0.9.pom
(1.9 kB at 317 kB/s)
[windows-jdk10] [INFO] Downloading: https://repo.maven.apache.org/maven2/org/apache/maven/maven-artifact/2.0.9/maven-artifact-2.0.9.pom
[windows-jdk10] [INFO] Downloaded: https://repo.maven.apache.org/maven2/org/apache/maven/maven-artifact/2.0.9/maven-artifact-2.0.9.pom
(1.6 kB at 231 kB/s)
[windows-jdk10] [INFO] Downloading: https://repo.maven.apache.org/maven2/org/apache/maven/maven-plugin-registry/2.0.9/maven-plugin-registry-2.0.9.pom
[windows-jdk10] [INFO] Downloaded: https://repo.maven.apache.org/maven2/org/apache/maven/maven-plugin-registry/2.0.9/maven-plugin-registry-2.0.9.pom
(2.0 kB at 328 kB/s)
[windows-jdk10] [INFO] Downloading: https://repo.maven.apache.org/maven2/org/codehaus/plexus/plexus-cli/1.6/plexus-cli-1.6.pom
[windows-jdk10] [INFO] Downloaded: https://repo.maven.apache.org/maven2/org/codehaus/plexus/plexus-cli/1.6/plexus-cli-1.6.pom
(1.4 kB at 235 kB/s)
[windows-jdk10] [INFO] Downloading: https://repo.maven.apache.org/maven2/org/ow2/asm/asm-all/5.0.2/asm-all-5.0.2.pom
[windows-jdk10] [INFO] Downloaded: https://repo.maven.apache.org/maven2/org/ow2/asm/asm-all/5.0.2/asm-all-5.0.2.pom
(2.0 kB at 197 kB/s)
[windows-jdk10] [INFO] Downloading: https://repo.maven.apache.org/maven2/org/ow2/asm/asm-parent/5.0.2/asm-parent-5.0.2.pom
[windows-jdk10] [INFO] Downloaded: https://repo.maven.apache.org/maven2/org/ow2/asm/asm-parent/5.0.2/asm-parent-5.0.2.pom
(5.5 kB at 366 kB/s)
[windows-jdk10] [INFO] Downloading: https://repo.maven.apache.org/maven2/com/google/collections/google-collections/1.0/google-collections-1.0.jar
[windows-jdk10] [INFO] Downloading: https://repo.maven.apache.org/maven2/org/codehaus/plexus/plexus-container-default/1.6/plexus-container-default-1.6.jar
[windows-jdk10] [INFO] Downloading: https://repo.maven.apache.org/maven2/com/thoughtworks/qdox/qdox/2.0-M2/qdox-2.0-M2.jar
[windows-jdk10] [INFO] Downloading: https://repo.maven.apache.org/maven2/org/codehaus/plexus/plexus-classworlds/2.5.1/plexus-classworlds-2.5.1.jar
[windows-jdk10] [INFO] Downloading: https://repo.maven.apache.org/maven2/org/apache/xbean/xbean-reflect/3.7/xbean-reflect-3.7.jar
[windows-jdk10] [INFO] Downloaded: https://repo.maven.apache.org/maven2/org/codehaus/plexus/plexus-classworlds/2.5.1/plexus-classworlds-2.5.1.jar
(50 kB at 2.2 MB/s)
[windows-jdk10] [INFO] Downloading: https://repo.maven.apache.org/maven2/org/jdom/jdom/1.1/jdom-1.1.jar
[windows-jdk10] [INFO] Downloaded: https://repo.maven.apache.org/maven2/org/apache/xbean/xbean-reflect/3.7/xbean-reflect-3.7.jar
(148 kB at 4.9 MB/s)
[windows-jdk10] [INFO] Downloaded: https://repo.maven.apache.org/maven2/com/thoughtworks/qdox/qdox/2.0-M2/qdox-2.0-M2.jar
(292 kB at 9.7 MB/s)
[windows-jdk10] [INFO] Downloading: https://repo.maven.apache.org/maven2/org/apache/maven/maven-plugin-api/2.0.9/maven-plugin-api-2.0.9.jar
[windows-jdk10] [INFO] Downloading: https://repo.maven.apache.org/maven2/org/apache/maven/maven-model/2.0.9/maven-model-2.0.9.jar
[windows-jdk10] [INFO] Downloaded: https://repo.maven.apache.org/maven2/com/google/collections/google-collections/1.0/google-collections-1.0.jar
(640 kB at 21 MB/s)
[windows-jdk10] [INFO] Downloading: https://repo.maven.apache.org/maven2/org/apache/maven/maven-project/2.0.9/maven-project-2.0.9.jar
[windows-jdk10] [INFO] Downloaded: https://repo.maven.apache.org/maven2/org/jdom/jdom/1.1/jdom-1.1.jar
(153 kB at 3.9 MB/s)
[windows-jdk10] [INFO] Downloading: https://repo.maven.apache.org/maven2/org/apache/maven/maven-settings/2.0.9/maven-settings-2.0.9.jar
[windows-jdk10] [INFO] Downloaded: https://repo.maven.apache.org/maven2/org/codehaus/plexus/plexus-container-default/1.6/plexus-container-default-1.6.jar
(224 kB at 5.3 MB/s)
[windows-jdk10] [INFO] Downloading: https://repo.maven.apache.org/maven2/org/apache/maven/maven-profile/2.0.9/maven-profile-2.0.9.jar
[windows-jdk10] [INFO] Downloaded: https://repo.maven.apache.org/maven2/org/apache/maven/maven-project/2.0.9/maven-project-2.0.9.jar
(122 kB at 2.8 MB/s)
[windows-jdk10] [INFO] Downloading: https://repo.maven.apache.org/maven2/org/apache/maven/maven-artifact-manager/2.0.9/maven-artifact-manager-2.0.9.jar
[windows-jdk10] [INFO] Downloaded: https://repo.maven.apache.org/maven2/org/apache/maven/maven-model/2.0.9/maven-model-2.0.9.jar
(87 kB at 1.9 MB/s)
[windows-jdk10] [INFO] Downloading: https://repo.maven.apache.org/maven2/org/apache/maven/maven-repository-metadata/2.0.9/maven-repository-metadata-2.0.9.jar
[windows-jdk8] [INFO] run post-build script verify.bsh
[windows-jdk8] [INFO]           inheritedMenus\pom.xml ........................... SUCCESS
(9.7 s)
[windows-jdk8] [INFO] Building: inheritedReports\pom.xml
[windows-jdk10] [INFO] Downloaded: https://repo.maven.apache.org/maven2/org/apache/maven/maven-plugin-api/2.0.9/maven-plugin-api-2.0.9.jar
(13 kB at 258 kB/s)
[windows-jdk10] [INFO] Downloading: https://repo.maven.apache.org/maven2/org/apache/maven/maven-plugin-registry/2.0.9/maven-plugin-registry-2.0.9.jar
[windows-jdk10] [INFO] Downloaded: https://repo.maven.apache.org/maven2/org/apache/maven/maven-settings/2.0.9/maven-settings-2.0.9.jar
(49 kB at 963 kB/s)
[windows-jdk10] [INFO] Downloading: https://repo.maven.apache.org/maven2/org/apache/maven/maven-artifact/2.0.9/maven-artifact-2.0.9.jar
[windows-jdk10] [INFO] Downloaded: https://repo.maven.apache.org/maven2/org/apache/maven/maven-profile/2.0.9/maven-profile-2.0.9.jar
(35 kB at 680 kB/s)
[windows-jdk10] [INFO] Downloading: https://repo.maven.apache.org/maven2/org/codehaus/plexus/plexus-cli/1.6/plexus-cli-1.6.jar
[windows-jdk10] [INFO] Downloaded: https://repo.maven.apache.org/maven2/org/apache/maven/maven-artifact-manager/2.0.9/maven-artifact-manager-2.0.9.jar
(58 kB at 1.1 MB/s)
[windows-jdk10] [INFO] Downloading: https://repo.maven.apache.org/maven2/org/ow2/asm/asm-all/5.0.2/asm-all-5.0.2.jar
[windows-jdk10] [INFO] Downloaded: https://repo.maven.apache.org/maven2/org/apache/maven/maven-repository-metadata/2.0.9/maven-repository-metadata-2.0.9.jar
(25 kB at 431 kB/s)
[windows-jdk10] [INFO] Downloaded: https://repo.maven.apache.org/maven2/org/apache/maven/maven-plugin-registry/2.0.9/maven-plugin-registry-2.0.9.jar
(29 kB at 493 kB/s)
[windows-jdk10] [INFO] Downloaded: https://repo.maven.apache.org/maven2/org/codehaus/plexus/plexus-cli/1.6/plexus-cli-1.6.jar
(7.4 kB at 121 kB/s)
[windows-jdk10] [INFO] Downloaded: https://repo.maven.apache.org/maven2/org/apache/maven/maven-artifact/2.0.9/maven-artifact-2.0.9.jar
(89 kB at 1.4 MB/s)
[windows-jdk10] [INFO] Downloaded: https://repo.maven.apache.org/maven2/org/ow2/asm/asm-all/5.0.2/asm-all-5.0.2.jar
(242 kB at 3.1 MB/s)
[windows-jdk10] [INFO] 
[windows-jdk10] [INFO] --- maven-resources-plugin:3.0.2:testResources (default-testResources)
@ maven-site-plugin ---
[windows-jdk10] [INFO] Using 'UTF-8' encoding to copy filtered resources.
[windows-jdk10] [INFO] Copying 3 resources
[windows-jdk10] [INFO] Copying 3 resources
[windows-jdk10] [INFO] 
[windows-jdk10] [INFO] --- maven-compiler-plugin:3.7.0:testCompile (default-testCompile) @
maven-site-plugin ---
[windows-jdk10] [INFO] Changes detected - recompiling the module!
[windows-jdk10] [INFO] Compiling 7 source files to f:\jenkins\jenkins-slave\workspace\ox_maven-site-plugin_master-LZWAKOPRMO5JAZW5HRA2IQ56LLTFU3PLKDIE2JNFFXEGASBYKK3Q@2\m\target\test-classes
[windows-jdk10] [INFO] /f:/jenkins/jenkins-slave/workspace/ox_maven-site-plugin_master-LZWAKOPRMO5JAZW5HRA2IQ56LLTFU3PLKDIE2JNFFXEGASBYKK3Q@2/m/src/test/java/org/apache/maven/plugins/site/deploy/SiteDeployMojoTest.java:
Some input files use or override a deprecated API.
[windows-jdk10] [INFO] /f:/jenkins/jenkins-slave/workspace/ox_maven-site-plugin_master-LZWAKOPRMO5JAZW5HRA2IQ56LLTFU3PLKDIE2JNFFXEGASBYKK3Q@2/m/src/test/java/org/apache/maven/plugins/site/deploy/SiteDeployMojoTest.java:
Recompile with -Xlint:deprecation for details.
[windows-jdk10] [INFO] 
[windows-jdk10] [INFO] --- maven-surefire-plugin:2.20.1:test (default-test) @ maven-site-plugin
---
[windows-jdk10] [INFO] Downloading: https://repo.maven.apache.org/maven2/org/apache/maven/surefire/maven-surefire-common/2.20.1/maven-surefire-common-2.20.1.pom
[windows-jdk10] [INFO] Downloaded: https://repo.maven.apache.org/maven2/org/apache/maven/surefire/maven-surefire-common/2.20.1/maven-surefire-common-2.20.1.pom
(9.3 kB at 582 kB/s)
[windows-jdk10] [INFO] Downloading: https://repo.maven.apache.org/maven2/org/apache/maven/plugin-tools/maven-plugin-annotations/3.3/maven-plugin-annotations-3.3.pom
[windows-jdk10] [INFO] Downloaded: https://repo.maven.apache.org/maven2/org/apache/maven/plugin-tools/maven-plugin-annotations/3.3/maven-plugin-annotations-3.3.pom
(1.6 kB at 181 kB/s)
[windows-jdk10] [INFO] Downloading: https://repo.maven.apache.org/maven2/org/apache/maven/plugin-tools/maven-plugin-tools/3.3/maven-plugin-tools-3.3.pom
[windows-jdk10] [INFO] Downloaded: https://repo.maven.apache.org/maven2/org/apache/maven/plugin-tools/maven-plugin-tools/3.3/maven-plugin-tools-3.3.pom
(13 kB at 1.8 MB/s)
[windows-jdk10] [INFO] Downloading: https://repo.maven.apache.org/maven2/org/apache/maven/surefire/surefire-api/2.20.1/surefire-api-2.20.1.pom
[windows-jdk10] [INFO] Downloaded: https://repo.maven.apache.org/maven2/org/apache/maven/surefire/surefire-api/2.20.1/surefire-api-2.20.1.pom
(3.7 kB at 522 kB/s)
[windows-jdk10] [INFO] Downloading: https://repo.maven.apache.org/maven2/org/apache/maven/surefire/surefire-logger-api/2.20.1/surefire-logger-api-2.20.1.pom
[windows-jdk10] [INFO] Downloaded: https://repo.maven.apache.org/maven2/org/apache/maven/surefire/surefire-logger-api/2.20.1/surefire-logger-api-2.20.1.pom
(2.0 kB at 287 kB/s)
[windows-jdk10] [INFO] Downloading: https://repo.maven.apache.org/maven2/org/apache/maven/surefire/surefire-booter/2.20.1/surefire-booter-2.20.1.pom
[windows-jdk10] [INFO] Downloaded: https://repo.maven.apache.org/maven2/org/apache/maven/surefire/surefire-booter/2.20.1/surefire-booter-2.20.1.pom
(8.5 kB at 704 kB/s)
[windows-jdk10] [INFO] Downloading: https://repo.maven.apache.org/maven2/org/apache/maven/surefire/maven-surefire-common/2.20.1/maven-surefire-common-2.20.1.jar
[windows-jdk10] [INFO] Downloading: https://repo.maven.apache.org/maven2/org/apache/maven/surefire/surefire-booter/2.20.1/surefire-booter-2.20.1.jar
[windows-jdk10] [INFO] Downloading: https://repo.maven.apache.org/maven2/org/apache/maven/plugin-tools/maven-plugin-annotations/3.3/maven-plugin-annotations-3.3.jar
[windows-jdk10] [INFO] Downloading: https://repo.maven.apache.org/maven2/org/apache/maven/surefire/surefire-logger-api/2.20.1/surefire-logger-api-2.20.1.jar
[windows-jdk10] [INFO] Downloading: https://repo.maven.apache.org/maven2/org/apache/maven/surefire/surefire-api/2.20.1/surefire-api-2.20.1.jar
[windows-jdk10] [INFO] Downloaded: https://repo.maven.apache.org/maven2/org/apache/maven/surefire/surefire-api/2.20.1/surefire-api-2.20.1.jar
(183 kB at 4.4 MB/s)
[windows-jdk10] [INFO] Downloading: https://repo.maven.apache.org/maven2/junit/junit/4.12/junit-4.12.jar
[windows-jdk10] [INFO] Downloaded: https://repo.maven.apache.org/maven2/org/apache/maven/surefire/surefire-booter/2.20.1/surefire-booter-2.20.1.jar
(268 kB at 5.2 MB/s)
[windows-jdk10] [INFO] Downloaded: https://repo.maven.apache.org/maven2/org/apache/maven/surefire/surefire-logger-api/2.20.1/surefire-logger-api-2.20.1.jar
(13 kB at 196 kB/s)
[windows-jdk10] [INFO] Downloaded: https://repo.maven.apache.org/maven2/org/apache/maven/plugin-tools/maven-plugin-annotations/3.3/maven-plugin-annotations-3.3.jar
(14 kB at 206 kB/s)
[windows-jdk10] [INFO] Downloaded: https://repo.maven.apache.org/maven2/org/apache/maven/surefire/maven-surefire-common/2.20.1/maven-surefire-common-2.20.1.jar
(509 kB at 5.9 MB/s)
[windows-jdk10] [INFO] Downloaded: https://repo.maven.apache.org/maven2/junit/junit/4.12/junit-4.12.jar
(315 kB at 3.3 MB/s)
[windows-jdk10] [INFO] ------------------------------------------------------------------------
[windows-jdk10] [INFO] BUILD FAILURE
[windows-jdk10] [INFO] ------------------------------------------------------------------------
[windows-jdk10] [INFO] Total time: 35.563 s
[windows-jdk10] [INFO] Finished at: 2018-04-23T17:08:27Z
[windows-jdk10] [INFO] Final Memory: 42M/147M
[windows-jdk10] [INFO] ------------------------------------------------------------------------
[windows-jdk10] [INFO] [jenkins-event-spy] Generated F:\jenkins\jenkins-slave\workspace\ox_maven-site-plugin_master-LZWAKOPRMO5JAZW5HRA2IQ56LLTFU3PLKDIE2JNFFXEGASBYKK3Q@2@tmp\withMavene589fd06\maven-spy-20180423-170751-22512642143652355536419.log
[windows-jdk10] [ERROR] Failed to execute goal org.apache.maven.plugins:maven-surefire-plugin:2.20.1:test
(default-test) on project maven-site-plugin: Execution default-test of goal org.apache.maven.plugins:maven-surefire-plugin:2.20.1:test
failed. NullPointerException -> [Help 1]
[windows-jdk10] [ERROR] 
[windows-jdk10] [ERROR] To see the full stack trace of the errors, re-run Maven with the -e
switch.
[windows-jdk10] [ERROR] Re-run Maven using the -X switch to enable full debug logging.
[windows-jdk10] [ERROR] 
[windows-jdk10] [ERROR] For more information about the errors and possible solutions, please
read the following articles:
[windows-jdk10] [ERROR] [Help 1] http://cwiki.apache.org/confluence/display/MAVEN/PluginExecutionException
[Pipeline] [windows-jdk10] }
[Pipeline] [windows-jdk10] // dir
[Pipeline] [windows-jdk10] }
[windows-jdk10] [withMaven] junitPublisher - Archive test results for Maven artifact org.apache.maven.plugins:maven-site-plugin:3.7.1-SNAPSHOT
generated by maven-surefire-plugin:test (default-test): m\target\surefire-reports\*.xml
[windows-jdk10] Recording test results
[windows-jdk10] None of the test reports contained any result
[Pipeline] [windows-jdk10] // withMaven
[Pipeline] [windows-jdk10] echo
[windows-jdk10] [FAIL FAST] This is the first failure and likely root cause
[Pipeline] [windows-jdk10] }
[Pipeline] [windows-jdk10] // stage
[Pipeline] [windows-jdk10] }
[Pipeline] [windows-jdk10] // node
[Pipeline] [windows-jdk10] }
[windows-jdk10] Failed in branch windows-jdk10
[windows-jdk7] Sending interrupt signal to process
[windows-jdk8] Sending interrupt signal to process
[windows-jdk9] Sending interrupt signal to process
[Pipeline] [linux-jdk7] // node
[Pipeline] [linux-jdk8] // node
[Pipeline] [linux-jdk9] // node
[Pipeline] [linux-jdk10] // node
[Pipeline] [linux-jdk7] }
[linux-jdk7] Failed in branch linux-jdk7
[Pipeline] [linux-jdk8] }
[linux-jdk8] Failed in branch linux-jdk8
[Pipeline] [linux-jdk9] }
[linux-jdk9] Failed in branch linux-jdk9
[Pipeline] [linux-jdk10] }
[linux-jdk10] Failed in branch linux-jdk10
[windows-jdk7] [INFO] run post-build script verify.groovy
[windows-jdk7] [INFO]           inheritance-interpolation\pom.xml ................ SUCCESS
(15.8 s)
[windows-jdk7] [INFO] Building: inheritedMenus\pom.xml
[Pipeline] [windows-jdk7] }
[Pipeline] [windows-jdk7] // dir
[Pipeline] [windows-jdk7] }
[windows-jdk7] [withMaven] One or multiple Maven executions have been ignored by the Jenkins
Pipeline Maven Plugin because they have been interrupted before completion (1). See Pipeline
Maven Plugin FAQ for more details.
[Pipeline] [windows-jdk7] // withMaven
[Pipeline] [windows-jdk7] }
[Pipeline] [windows-jdk7] // stage
[Pipeline] [windows-jdk7] }
[Pipeline] [windows-jdk7] // node
[Pipeline] [windows-jdk7] }
[windows-jdk8] After 10s process did not stop
[Pipeline] [windows-jdk8] }
[Pipeline] [windows-jdk8] // dir
[Pipeline] [windows-jdk8] }
[windows-jdk8] [withMaven] One or multiple Maven executions have been ignored by the Jenkins
Pipeline Maven Plugin because they have been interrupted before completion (1). See Pipeline
Maven Plugin FAQ for more details.
[Pipeline] [windows-jdk8] // withMaven
[Pipeline] [windows-jdk8] echo
[windows-jdk8] [FAIL FAST] windows-jdk10 had first failure, ignoring null
[Pipeline] [windows-jdk8] }
[Pipeline] [windows-jdk8] // stage
[Pipeline] [windows-jdk8] }
[Pipeline] [windows-jdk8] // node
[Pipeline] [windows-jdk8] }
[windows-jdk9] After 10s process did not stop
[Pipeline] [windows-jdk9] }
[Pipeline] [windows-jdk9] // dir
[Pipeline] [windows-jdk9] }
[windows-jdk9] [withMaven] One or multiple Maven executions have been ignored by the Jenkins
Pipeline Maven Plugin because they have been interrupted before completion (1). See Pipeline
Maven Plugin FAQ for more details.
[Pipeline] [windows-jdk9] // withMaven
[Pipeline] [windows-jdk9] echo
[windows-jdk9] [FAIL FAST] windows-jdk10 had first failure, ignoring null
[Pipeline] [windows-jdk9] }
[Pipeline] [windows-jdk9] // stage
[Pipeline] [windows-jdk9] }
[Pipeline] [windows-jdk9] // node
[Pipeline] [windows-jdk9] }
[Pipeline] // parallel
[Pipeline] echo
***** FAST FAILURE *****

Fast failure triggered by windows-jdk10

***** FAST FAILURE *****
[Pipeline] stage
[Pipeline] { (Notifications)
[Pipeline] echo
Build result: FAILURE
[Pipeline] jiraIssueSelector
[Pipeline] jiraComment
[Pipeline] emailext
Mime
  • Unnamed multipart/mixed (inline, None, 0 bytes)
View raw message