maven-notifications mailing list archives

Site index · List index
Message view « Date » · « Thread »
Top « Date » · « Thread »
From Apache Jenkins Server <jenk...@builds.apache.org>
Subject Build failed in Jenkins: Maven TLP » maven-wagon » dependency-upgrades #2
Date Thu, 05 Apr 2018 22:15:20 GMT
See https://builds.apache.org/job/maven-box/job/maven-wagon/job/dependency-upgrades/2/

Changes:

* [WAGON-513] Upgrade HttpClient to 4.5.5
* [WAGON-514] Upgrade HttpCore to 4.4.9
* [WAGON-513] Upgrade HttpClient to 4.5.5
* [WAGON-514] Upgrade HttpCore to 4.4.9
* [WAGON-513] Upgrade HttpClient to 4.5.5
* [WAGON-514] Upgrade HttpCore to 4.4.9
* [WAGON-513] Upgrade HttpClient to 4.5.5
* [WAGON-514] Upgrade HttpCore to 4.4.9

No tests ran.

Build log:
[...truncated 47.25 KB...]
[windows-jdk9] [INFO] 
[windows-jdk9] [INFO] Apache Maven Wagon
[windows-jdk9] [INFO] Apache Maven Wagon :: API
[windows-jdk9] [INFO] Apache Maven Wagon :: Provider Test
[windows-jdk9] [INFO] Apache Maven Wagon :: Providers
[windows-jdk9] [INFO] Apache Maven Wagon :: Providers :: File Provider
[windows-jdk9] [INFO] Apache Maven Wagon :: Providers :: FTP Provider
[windows-jdk9] [INFO] Apache Maven Wagon :: Providers :: HTTP Shared Library
[windows-jdk9] [INFO] Apache Maven Wagon :: Test Compatibility Kits
[windows-jdk9] [INFO] Apache Maven Wagon :: HTTP Test Compatibility Kit
[windows-jdk9] [INFO] Apache Maven Wagon :: Providers :: HTTP Provider
[windows-jdk9] [INFO] Apache Maven Wagon :: Providers :: Lightweight HTTP Provider
[windows-jdk9] [INFO] Apache Maven Wagon :: Providers :: SCM Provider
[windows-jdk9] [INFO] Apache Maven Wagon :: Providers :: SSH Common Library
[windows-jdk9] [INFO] Apache Maven Wagon :: Providers :: SSH Common Tests
[windows-jdk9] [INFO] Apache Maven Wagon :: Providers :: SSH External Provider
[windows-jdk9] [INFO] Apache Maven Wagon :: Providers :: SSH Provider
[windows-jdk9] [INFO] Apache Maven Wagon :: Providers :: WebDAV Provider
[windows-jdk9] [INFO] 
[windows-jdk9] [INFO] ------------------------------------------------------------------------
[windows-jdk9] [INFO] Building Apache Maven Wagon 3.0.1-SNAPSHOT
[windows-jdk9] [INFO] ------------------------------------------------------------------------
[windows-jdk8] [INFO] [jenkins-event-spy] Generate F:\jenkins\jenkins-slave\workspace\n-wagon_dependency-upgrades-LO4H735IU5X7U7RB3SMZ4SJKEBU4NJZSE7R52EPXMP65CFJWM6NA@tmp\withMaven656f18cf\maven-spy-20180405-221505-6276924769974816817182.log.tmp
...
[windows-jdk8] [INFO] Scanning for projects...
[windows-jdk7] [INFO] ------------------------------------------------------------------------
[windows-jdk7] [INFO] Reactor Build Order:
[windows-jdk7] [INFO] 
[windows-jdk7] [INFO] Apache Maven Wagon
[windows-jdk7] [INFO] Apache Maven Wagon :: API
[windows-jdk7] [INFO] Apache Maven Wagon :: Provider Test
[windows-jdk7] [INFO] Apache Maven Wagon :: Providers
[windows-jdk7] [INFO] Apache Maven Wagon :: Providers :: File Provider
[windows-jdk7] [INFO] Apache Maven Wagon :: Providers :: FTP Provider
[windows-jdk7] [INFO] Apache Maven Wagon :: Providers :: HTTP Shared Library
[windows-jdk7] [INFO] Apache Maven Wagon :: Test Compatibility Kits
[windows-jdk7] [INFO] Apache Maven Wagon :: HTTP Test Compatibility Kit
[windows-jdk7] [INFO] Apache Maven Wagon :: Providers :: HTTP Provider
[windows-jdk7] [INFO] Apache Maven Wagon :: Providers :: Lightweight HTTP Provider
[windows-jdk7] [INFO] Apache Maven Wagon :: Providers :: SCM Provider
[windows-jdk7] [INFO] Apache Maven Wagon :: Providers :: SSH Common Library
[windows-jdk7] [INFO] Apache Maven Wagon :: Providers :: SSH Common Tests
[windows-jdk7] [INFO] Apache Maven Wagon :: Providers :: SSH External Provider
[windows-jdk7] [INFO] Apache Maven Wagon :: Providers :: SSH Provider
[windows-jdk7] [INFO] Apache Maven Wagon :: Providers :: WebDAV Provider
[windows-jdk7] [INFO] 
[windows-jdk7] [INFO] ------------------------------------------------------------------------
[windows-jdk7] [INFO] Building Apache Maven Wagon 3.0.1-SNAPSHOT
[windows-jdk7] [INFO] ------------------------------------------------------------------------
[windows-jdk7] [INFO] 
[windows-jdk7] [INFO] --- maven-clean-plugin:3.0.0:clean (default-clean) @ wagon ---
[windows-jdk10] [INFO] Final Memory: 14M/54M
[windows-jdk10] [INFO] ------------------------------------------------------------------------
[windows-jdk10] [WARNING] The requested profile "run-its" could not be activated because it
does not exist.
[windows-jdk10] [INFO] [jenkins-event-spy] Generated F:\jenkins\jenkins-slave\workspace\n-wagon_dependency-upgrades-LO4H735IU5X7U7RB3SMZ4SJKEBU4NJZSE7R52EPXMP65CFJWM6NA@tmp\withMaven78759124\maven-spy-20180405-221505-2119704465589680850713.log
[windows-jdk10] [ERROR] Failed to execute goal org.apache.maven.plugins:maven-enforcer-plugin:1.4.1:enforce
(default) on project wagon: Execution default of goal org.apache.maven.plugins:maven-enforcer-plugin:1.4.1:enforce
failed: An API incompatibility was encountered while executing org.apache.maven.plugins:maven-enforcer-plugin:1.4.1:enforce:
java.lang.ExceptionInInitializerError: null
[windows-jdk10] [ERROR] -----------------------------------------------------
[windows-jdk10] [ERROR] realm =    plugin>org.apache.maven.plugins:maven-enforcer-plugin:1.4.1
[windows-jdk10] [ERROR] strategy = org.codehaus.plexus.classworlds.strategy.SelfFirstStrategy
[windows-jdk10] [ERROR] urls[0] = file:/f:/jenkins/jenkins-slave/workspace/n-wagon_dependency-upgrades-LO4H735IU5X7U7RB3SMZ4SJKEBU4NJZSE7R52EPXMP65CFJWM6NA/.repository/org/apache/maven/plugins/maven-enforcer-plugin/1.4.1/maven-enforcer-plugin-1.4.1.jar
[windows-jdk10] [ERROR] urls[1] = file:/f:/jenkins/jenkins-slave/workspace/n-wagon_dependency-upgrades-LO4H735IU5X7U7RB3SMZ4SJKEBU4NJZSE7R52EPXMP65CFJWM6NA/.repository/org/codehaus/mojo/extra-enforcer-rules/1.0-beta-7/extra-enforcer-rules-1.0-beta-7.jar
[windows-jdk10] [ERROR] urls[2] = file:/f:/jenkins/jenkins-slave/workspace/n-wagon_dependency-upgrades-LO4H735IU5X7U7RB3SMZ4SJKEBU4NJZSE7R52EPXMP65CFJWM6NA/.repository/org/apache/maven/shared/maven-dependency-tree/2.2/maven-dependency-tree-2.2.jar
[windows-jdk10] [ERROR] urls[3] = file:/f:/jenkins/jenkins-slave/workspace/n-wagon_dependency-upgrades-LO4H735IU5X7U7RB3SMZ4SJKEBU4NJZSE7R52EPXMP65CFJWM6NA/.repository/org/codehaus/plexus/plexus-component-annotations/1.5.5/plexus-component-annotations-1.5.5.jar
[windows-jdk10] [ERROR] urls[4] = file:/f:/jenkins/jenkins-slave/workspace/n-wagon_dependency-upgrades-LO4H735IU5X7U7RB3SMZ4SJKEBU4NJZSE7R52EPXMP65CFJWM6NA/.repository/org/eclipse/aether/aether-util/0.9.0.M2/aether-util-0.9.0.M2.jar
[windows-jdk10] [ERROR] urls[5] = file:/f:/jenkins/jenkins-slave/workspace/n-wagon_dependency-upgrades-LO4H735IU5X7U7RB3SMZ4SJKEBU4NJZSE7R52EPXMP65CFJWM6NA/.repository/org/apache/maven/shared/maven-common-artifact-filters/1.4/maven-common-artifact-filters-1.4.jar
[windows-jdk10] [ERROR] urls[6] = file:/f:/jenkins/jenkins-slave/workspace/n-wagon_dependency-upgrades-LO4H735IU5X7U7RB3SMZ4SJKEBU4NJZSE7R52EPXMP65CFJWM6NA/.repository/com/ibm/icu/icu4j/56.1/icu4j-56.1.jar
[windows-jdk10] [ERROR] urls[7] = file:/f:/jenkins/jenkins-slave/workspace/n-wagon_dependency-upgrades-LO4H735IU5X7U7RB3SMZ4SJKEBU4NJZSE7R52EPXMP65CFJWM6NA/.repository/backport-util-concurrent/backport-util-concurrent/3.1/backport-util-concurrent-3.1.jar
[windows-jdk10] [ERROR] urls[8] = file:/f:/jenkins/jenkins-slave/workspace/n-wagon_dependency-upgrades-LO4H735IU5X7U7RB3SMZ4SJKEBU4NJZSE7R52EPXMP65CFJWM6NA/.repository/org/codehaus/plexus/plexus-interpolation/1.11/plexus-interpolation-1.11.jar
[windows-jdk10] [ERROR] urls[9] = file:/f:/jenkins/jenkins-slave/workspace/n-wagon_dependency-upgrades-LO4H735IU5X7U7RB3SMZ4SJKEBU4NJZSE7R52EPXMP65CFJWM6NA/.repository/org/slf4j/slf4j-jdk14/1.5.6/slf4j-jdk14-1.5.6.jar
[windows-jdk10] [ERROR] urls[10] = file:/f:/jenkins/jenkins-slave/workspace/n-wagon_dependency-upgrades-LO4H735IU5X7U7RB3SMZ4SJKEBU4NJZSE7R52EPXMP65CFJWM6NA/.repository/org/slf4j/jcl-over-slf4j/1.5.6/jcl-over-slf4j-1.5.6.jar
[windows-jdk10] [ERROR] urls[11] = file:/f:/jenkins/jenkins-slave/workspace/n-wagon_dependency-upgrades-LO4H735IU5X7U7RB3SMZ4SJKEBU4NJZSE7R52EPXMP65CFJWM6NA/.repository/org/apache/maven/reporting/maven-reporting-api/2.2.1/maven-reporting-api-2.2.1.jar
[windows-jdk10] [ERROR] urls[12] = file:/f:/jenkins/jenkins-slave/workspace/n-wagon_dependency-upgrades-LO4H735IU5X7U7RB3SMZ4SJKEBU4NJZSE7R52EPXMP65CFJWM6NA/.repository/org/apache/maven/doxia/doxia-sink-api/1.1/doxia-sink-api-1.1.jar
[windows-jdk10] [ERROR] urls[13] = file:/f:/jenkins/jenkins-slave/workspace/n-wagon_dependency-upgrades-LO4H735IU5X7U7RB3SMZ4SJKEBU4NJZSE7R52EPXMP65CFJWM6NA/.repository/org/apache/maven/doxia/doxia-logging-api/1.1/doxia-logging-api-1.1.jar
[windows-jdk10] [ERROR] urls[14] = file:/f:/jenkins/jenkins-slave/workspace/n-wagon_dependency-upgrades-LO4H735IU5X7U7RB3SMZ4SJKEBU4NJZSE7R52EPXMP65CFJWM6NA/.repository/commons-cli/commons-cli/1.2/commons-cli-1.2.jar
[windows-jdk10] [ERROR] urls[15] = file:/f:/jenkins/jenkins-slave/workspace/n-wagon_dependency-upgrades-LO4H735IU5X7U7RB3SMZ4SJKEBU4NJZSE7R52EPXMP65CFJWM6NA/.repository/org/codehaus/plexus/plexus-interactivity-api/1.0-alpha-4/plexus-interactivity-api-1.0-alpha-4.jar
[windows-jdk10] [ERROR] urls[16] = file:/f:/jenkins/jenkins-slave/workspace/n-wagon_dependency-upgrades-LO4H735IU5X7U7RB3SMZ4SJKEBU4NJZSE7R52EPXMP65CFJWM6NA/.repository/org/sonatype/plexus/plexus-sec-dispatcher/1.3/plexus-sec-dispatcher-1.3.jar
[windows-jdk10] [ERROR] urls[17] = file:/f:/jenkins/jenkins-slave/workspace/n-wagon_dependency-upgrades-LO4H735IU5X7U7RB3SMZ4SJKEBU4NJZSE7R52EPXMP65CFJWM6NA/.repository/org/sonatype/plexus/plexus-cipher/1.4/plexus-cipher-1.4.jar
[windows-jdk10] [ERROR] urls[18] = file:/f:/jenkins/jenkins-slave/workspace/n-wagon_dependency-upgrades-LO4H735IU5X7U7RB3SMZ4SJKEBU4NJZSE7R52EPXMP65CFJWM6NA/.repository/org/codehaus/plexus/plexus-utils/3.0.22/plexus-utils-3.0.22.jar
[windows-jdk10] [ERROR] urls[19] = file:/f:/jenkins/jenkins-slave/workspace/n-wagon_dependency-upgrades-LO4H735IU5X7U7RB3SMZ4SJKEBU4NJZSE7R52EPXMP65CFJWM6NA/.repository/commons-lang/commons-lang/2.3/commons-lang-2.3.jar
[windows-jdk10] [ERROR] urls[20] = file:/f:/jenkins/jenkins-slave/workspace/n-wagon_dependency-upgrades-LO4H735IU5X7U7RB3SMZ4SJKEBU4NJZSE7R52EPXMP65CFJWM6NA/.repository/org/apache/maven/enforcer/enforcer-api/1.4.1/enforcer-api-1.4.1.jar
[windows-jdk10] [ERROR] urls[21] = file:/f:/jenkins/jenkins-slave/workspace/n-wagon_dependency-upgrades-LO4H735IU5X7U7RB3SMZ4SJKEBU4NJZSE7R52EPXMP65CFJWM6NA/.repository/org/apache/maven/enforcer/enforcer-rules/1.4.1/enforcer-rules-1.4.1.jar
[windows-jdk10] [ERROR] urls[22] = file:/f:/jenkins/jenkins-slave/workspace/n-wagon_dependency-upgrades-LO4H735IU5X7U7RB3SMZ4SJKEBU4NJZSE7R52EPXMP65CFJWM6NA/.repository/org/beanshell/bsh/2.0b4/bsh-2.0b4.jar
[windows-jdk10] [ERROR] urls[23] = file:/f:/jenkins/jenkins-slave/workspace/n-wagon_dependency-upgrades-LO4H735IU5X7U7RB3SMZ4SJKEBU4NJZSE7R52EPXMP65CFJWM6NA/.repository/org/codehaus/plexus/plexus-i18n/1.0-beta-6/plexus-i18n-1.0-beta-6.jar
[windows-jdk10] [ERROR] urls[24] = file:/f:/jenkins/jenkins-slave/workspace/n-wagon_dependency-upgrades-LO4H735IU5X7U7RB3SMZ4SJKEBU4NJZSE7R52EPXMP65CFJWM6NA/.repository/org/apache/maven/plugin-testing/maven-plugin-testing-harness/1.3/maven-plugin-testing-harness-1.3.jar
[windows-jdk10] [ERROR] urls[25] = file:/f:/jenkins/jenkins-slave/workspace/n-wagon_dependency-upgrades-LO4H735IU5X7U7RB3SMZ4SJKEBU4NJZSE7R52EPXMP65CFJWM6NA/.repository/org/codehaus/plexus/plexus-archiver/2.2/plexus-archiver-2.2.jar
[windows-jdk10] [ERROR] urls[26] = file:/f:/jenkins/jenkins-slave/workspace/n-wagon_dependency-upgrades-LO4H735IU5X7U7RB3SMZ4SJKEBU4NJZSE7R52EPXMP65CFJWM6NA/.repository/org/codehaus/plexus/plexus-io/2.0.4/plexus-io-2.0.4.jar
[windows-jdk10] [ERROR] urls[27] = file:/f:/jenkins/jenkins-slave/workspace/n-wagon_dependency-upgrades-LO4H735IU5X7U7RB3SMZ4SJKEBU4NJZSE7R52EPXMP65CFJWM6NA/.repository/junit/junit/4.11/junit-4.11.jar
[windows-jdk10] [ERROR] urls[28] = file:/f:/jenkins/jenkins-slave/workspace/n-wagon_dependency-upgrades-LO4H735IU5X7U7RB3SMZ4SJKEBU4NJZSE7R52EPXMP65CFJWM6NA/.repository/org/hamcrest/hamcrest-core/1.3/hamcrest-core-1.3.jar
[windows-jdk10] [ERROR] Number of foreign imports: 1
[windows-jdk10] [ERROR] import: Entry[import  from realm ClassRealm[maven.api, parent: null]]
[windows-jdk10] [ERROR] 
[windows-jdk10] [ERROR] -----------------------------------------------------: begin 0, end
3, length 2
[windows-jdk10] [ERROR] -> [Help 1]
[windows-jdk10] [ERROR] 
[windows-jdk10] [ERROR] To see the full stack trace of the errors, re-run Maven with the -e
switch.
[windows-jdk10] [ERROR] Re-run Maven using the -X switch to enable full debug logging.
[windows-jdk10] [ERROR] 
[windows-jdk10] [ERROR] For more information about the errors and possible solutions, please
read the following articles:
[windows-jdk10] [ERROR] [Help 1] http://cwiki.apache.org/confluence/display/MAVEN/PluginContainerException
[windows-jdk9] [INFO] 
[windows-jdk9] [INFO] --- maven-clean-plugin:3.0.0:clean (default-clean) @ wagon ---
[Pipeline] [windows-jdk10] }
[Pipeline] [windows-jdk10] // dir
[Pipeline] [windows-jdk10] }
[Pipeline] [windows-jdk10] // withMaven
[Pipeline] [windows-jdk10] echo
[windows-jdk10] [FAIL FAST] This is the first failure and likely root cause
[Pipeline] [windows-jdk10] }
[Pipeline] [windows-jdk10] // stage
[windows-jdk8] [INFO] ------------------------------------------------------------------------
[windows-jdk8] [INFO] Reactor Build Order:
[windows-jdk8] [INFO] 
[windows-jdk8] [INFO] Apache Maven Wagon
[windows-jdk8] [INFO] Apache Maven Wagon :: API
[windows-jdk8] [INFO] Apache Maven Wagon :: Provider Test
[windows-jdk8] [INFO] Apache Maven Wagon :: Providers
[windows-jdk8] [INFO] Apache Maven Wagon :: Providers :: File Provider
[windows-jdk8] [INFO] Apache Maven Wagon :: Providers :: FTP Provider
[windows-jdk8] [INFO] Apache Maven Wagon :: Providers :: HTTP Shared Library
[windows-jdk8] [INFO] Apache Maven Wagon :: Test Compatibility Kits
[windows-jdk8] [INFO] Apache Maven Wagon :: HTTP Test Compatibility Kit
[windows-jdk8] [INFO] Apache Maven Wagon :: Providers :: HTTP Provider
[windows-jdk8] [INFO] Apache Maven Wagon :: Providers :: Lightweight HTTP Provider
[windows-jdk8] [INFO] Apache Maven Wagon :: Providers :: SCM Provider
[windows-jdk8] [INFO] Apache Maven Wagon :: Providers :: SSH Common Library
[windows-jdk8] [INFO] Apache Maven Wagon :: Providers :: SSH Common Tests
[windows-jdk8] [INFO] Apache Maven Wagon :: Providers :: SSH External Provider
[windows-jdk8] [INFO] Apache Maven Wagon :: Providers :: SSH Provider
[windows-jdk8] [INFO] Apache Maven Wagon :: Providers :: WebDAV Provider
[windows-jdk8] [INFO] 
[windows-jdk8] [INFO] ------------------------------------------------------------------------
[Pipeline] [windows-jdk10] }
[windows-jdk8] [INFO] Building Apache Maven Wagon 3.0.1-SNAPSHOT
[windows-jdk8] [INFO] ------------------------------------------------------------------------
[windows-jdk8] [INFO] 
[windows-jdk8] [INFO] --- maven-clean-plugin:3.0.0:clean (default-clean) @ wagon ---
[Pipeline] [windows-jdk10] // node
[Pipeline] [windows-jdk10] }
[windows-jdk7] Sending interrupt signal to process
[windows-jdk10] Failed in branch windows-jdk10
[windows-jdk7] [INFO] 
[windows-jdk7] [INFO] --- maven-enforcer-plugin:1.4.1:enforce (enforce-maven-version) @ wagon
---
[windows-jdk9] [INFO] 
[windows-jdk9] [INFO] --- maven-enforcer-plugin:1.4.1:enforce (enforce-maven-version) @ wagon
---
[windows-jdk9] [INFO] 
[windows-jdk9] [INFO] --- maven-enforcer-plugin:1.4.1:enforce (enforce-bytecode-version) @
wagon ---
[windows-jdk9] [INFO] 
[windows-jdk9] [INFO] --- maven-enforcer-plugin:1.4.1:enforce (ban-known-bad-maven-versions)
@ wagon ---
[windows-jdk9] [INFO] 
[windows-jdk9] [INFO] --- maven-enforcer-plugin:1.4.1:enforce (default) @ wagon ---
[windows-jdk9] [INFO] 
[windows-jdk9] [INFO] --- apache-rat-plugin:0.12:check (rat-check) @ wagon ---
[windows-jdk8] [INFO] 
[windows-jdk8] [INFO] --- maven-enforcer-plugin:1.4.1:enforce (enforce-maven-version) @ wagon
---
[windows-jdk7] [INFO] Downloading: https://repo.maven.apache.org/maven2/org/sonatype/plexus/plexus-sec-dispatcher/1.3/plexus-sec-dispatcher-1.3.jar
[windows-jdk7] [INFO] Downloading: https://repo.maven.apache.org/maven2/org/codehaus/plexus/plexus-i18n/1.0-beta-6/plexus-i18n-1.0-beta-6.jar
[windows-jdk7] [INFO] Downloading: https://repo.maven.apache.org/maven2/org/beanshell/bsh/2.0b4/bsh-2.0b4.jar
[windows-jdk7] [INFO] Downloading: https://repo.maven.apache.org/maven2/org/apache/maven/enforcer/enforcer-api/1.4.1/enforcer-api-1.4.1.jar
[windows-jdk7] [INFO] Downloading: https://repo.maven.apache.org/maven2/org/apache/maven/enforcer/enforcer-rules/1.4.1/enforcer-rules-1.4.1.jar
[windows-jdk9] [INFO] Enabled default license matchers.
[windows-jdk9] [INFO] Will parse SCM ignores for exclusions...
[windows-jdk9] [INFO] Parsing exclusions from f:\jenkins\jenkins-slave\workspace\n-wagon_dependency-upgrades-LO4H735IU5X7U7RB3SMZ4SJKEBU4NJZSE7R52EPXMP65CFJWM6NA@2\m\.gitignore
[windows-jdk9] [INFO] Finished adding exclusions from SCM ignore files.
[windows-jdk9] [INFO] 72 implicit excludes (use -debug for more details).
[windows-jdk9] [INFO] Exclude: .checkstyle
[windows-jdk9] [INFO] Exclude: **/*.odg
[windows-jdk9] [INFO] Exclude: src/test/resources/**
[windows-jdk9] [INFO] Exclude: src/main/resources/default-server-root/**
[windows-jdk9] [INFO] Exclude: src/main/resources/ssh-keys/**
[windows-jdk9] [INFO] Exclude: src/test/ssh-keys/**
[windows-jdk9] [INFO] Exclude: .repository/**
[windows-jdk9] [INFO] Exclude: out/**
[windows-jdk9] [INFO] Exclude: .repository/**
[windows-jdk9] [INFO] Exclude: .maven/spy.log
[windows-jdk9] [INFO] Exclude: dependency-reduced-pom.xml
[windows-jdk9] [INFO] Exclude: .java-version
[windows-jdk9] [INFO] 10 resources included (use -debug for more details)
[windows-jdk9] Sending interrupt signal to process
[windows-jdk8] Sending interrupt signal to process
[windows-jdk8] [INFO] 
[windows-jdk8] [INFO] --- maven-enforcer-plugin:1.4.1:enforce (enforce-bytecode-version) @
wagon ---
[windows-jdk8] [INFO] 
[windows-jdk8] [INFO] --- maven-enforcer-plugin:1.4.1:enforce (ban-known-bad-maven-versions)
@ wagon ---
[windows-jdk8] [INFO] 
[windows-jdk8] [INFO] --- maven-enforcer-plugin:1.4.1:enforce (default) @ wagon ---
[windows-jdk8] [INFO] 
[windows-jdk8] [INFO] --- apache-rat-plugin:0.12:check (rat-check) @ wagon ---
[Pipeline] [linux-jdk7] // node
[Pipeline] [linux-jdk8] // node
[Pipeline] [linux-jdk9] // node
[Pipeline] [linux-jdk10] // node
[Pipeline] [linux-jdk7] }
[linux-jdk7] Failed in branch linux-jdk7
[Pipeline] [linux-jdk8] }
[linux-jdk8] Failed in branch linux-jdk8
[Pipeline] [linux-jdk9] }
[linux-jdk9] Failed in branch linux-jdk9
[Pipeline] [linux-jdk10] }
[linux-jdk10] Failed in branch linux-jdk10
[Pipeline] [windows-jdk8] }
[Pipeline] [windows-jdk8] // dir
[Pipeline] [windows-jdk8] }
[windows-jdk8] [withMaven] One or multiple Maven executions have been ignored by the Jenkins
Pipeline Maven Plugin because they have been interrupted before completion (1). See Pipeline
Maven Plugin FAQ for more details.
[Pipeline] [windows-jdk8] // withMaven
[Pipeline] [windows-jdk8] echo
[windows-jdk8] [FAIL FAST] windows-jdk10 had first failure, ignoring script returned exit
code -1
[Pipeline] [windows-jdk8] }
[Pipeline] [windows-jdk8] // stage
[Pipeline] [windows-jdk8] }
[Pipeline] [windows-jdk8] // node
[Pipeline] [windows-jdk8] }
[windows-jdk7] After 10s process did not stop
[Pipeline] [windows-jdk7] }
[Pipeline] [windows-jdk7] // dir
[Pipeline] [windows-jdk7] }
[windows-jdk7] [withMaven] One or multiple Maven executions have been ignored by the Jenkins
Pipeline Maven Plugin because they have been interrupted before completion (1). See Pipeline
Maven Plugin FAQ for more details.
[Pipeline] [windows-jdk7] // withMaven
[Pipeline] [windows-jdk7] echo
[windows-jdk7] [FAIL FAST] windows-jdk10 had first failure, ignoring null
[Pipeline] [windows-jdk7] }
[Pipeline] [windows-jdk7] // stage
[Pipeline] [windows-jdk7] }
[Pipeline] [windows-jdk7] // node
[Pipeline] [windows-jdk7] }
[windows-jdk9] After 10s process did not stop
[Pipeline] [windows-jdk9] }
[Pipeline] [windows-jdk9] // dir
[Pipeline] [windows-jdk9] }
[windows-jdk9] [withMaven] One or multiple Maven executions have been ignored by the Jenkins
Pipeline Maven Plugin because they have been interrupted before completion (1). See Pipeline
Maven Plugin FAQ for more details.
[Pipeline] [windows-jdk9] // withMaven
[Pipeline] [windows-jdk9] echo
[windows-jdk9] [FAIL FAST] windows-jdk10 had first failure, ignoring null
[Pipeline] [windows-jdk9] }
[Pipeline] [windows-jdk9] // stage
[Pipeline] [windows-jdk9] }
[Pipeline] [windows-jdk9] // node
[Pipeline] [windows-jdk9] }
[Pipeline] // parallel
[Pipeline] echo
***** FAST FAILURE *****

Fast failure triggered by windows-jdk10

***** FAST FAILURE *****
[Pipeline] stage
[Pipeline] { (Notifications)
[Pipeline] echo
Build result: FAILURE
[Pipeline] jiraIssueSelector
[Pipeline] emailext
Mime
  • Unnamed multipart/mixed (inline, None, 0 bytes)
View raw message