maven-notifications mailing list archives

Site index · List index
Message view « Date » · « Thread »
Top « Date » · « Thread »
From Apache Jenkins Server <jenk...@builds.apache.org>
Subject Build failed in Jenkins: Maven TLP » maven-site-plugin » master #39
Date Tue, 24 Apr 2018 15:45:12 GMT
See https://builds.apache.org/job/maven-box/job/maven-site-plugin/job/master/39/

Changes:

* [maven-release-plugin] prepare for next development iteration
* [maven-release-plugin] prepare for next development iteration
* [maven-release-plugin] prepare for next development iteration
* [maven-release-plugin] prepare for next development iteration
* [maven-release-plugin] prepare for next development iteration

No tests ran.

Build log:
[...truncated 1.58 MB...]
[windows-jdk8] Proxy-Authorization : Basic Zm9vOnRpdGk=
[windows-jdk8] 
[windows-jdk8] 1398 [main] INFO org.mortbay.log - Stopped SocketConnector@0.0.0.0:49809
[windows-jdk8] 1645 [main] INFO org.mortbay.log - jetty-6.1.25
[windows-jdk8] 1646 [main] INFO org.mortbay.log - Started SocketConnector@0.0.0.0:49813
[windows-jdk8] [INFO] Pushing src\test\resources\unit\deploy-dav\target\site
[windows-jdk8] [INFO]    >>> to http://localhost:49813/site/./
[windows-jdk8] 1688 [855547146@qtp-1917784974-1] INFO org.apache.maven.plugins.site.deploy.SimpleDavServerHandler
- writing file f:\jenkins\jenkins-slave\workspace\ox_maven-site-plugin_master-LZWAKOPRMO5JAZW5HRA2IQ56LLTFU3PLKDIE2JNFFXEGASBYKK3Q\m\target\siteTargetDeploy\site\css\maven-base.css
[windows-jdk8] 1694 [855547146@qtp-1917784974-1] INFO org.apache.maven.plugins.site.deploy.SimpleDavServerHandler
- writing file f:\jenkins\jenkins-slave\workspace\ox_maven-site-plugin_master-LZWAKOPRMO5JAZW5HRA2IQ56LLTFU3PLKDIE2JNFFXEGASBYKK3Q\m\target\siteTargetDeploy\site\index.html
[windows-jdk8] 1697 [main] INFO org.mortbay.log - Stopped SocketConnector@0.0.0.0:49813
[windows-jdk8] [INFO] Tests run: 3, Failures: 0, Errors: 0, Skipped: 0, Time elapsed: 1.717
s - in org.apache.maven.plugins.site.deploy.SiteDeployWebDavTest
[windows-jdk8] [INFO] Running org.apache.maven.plugins.site.run.WebXmlTest
[windows-jdk10] [INFO] java-annotations mojo extractor found 0 mojo descriptor.
[windows-jdk10] [INFO] 
[windows-jdk10] [INFO] --- maven-remote-resources-plugin:1.5:process (process-resource-bundles)
@ maven-site-plugin ---
[windows-jdk7] 1423 [main] INFO org.apache.commons.httpclient.auth.AuthChallengeProcessor
- basic authentication scheme selected
[windows-jdk7] 1431 [1244207248@qtp-823603072-1] INFO org.apache.maven.plugins.site.deploy.AuthAsyncProxyServlet
- handle 
[windows-jdk7] 1435 [1244207248@qtp-823603072-1] INFO org.apache.maven.plugins.site.deploy.AuthAsyncProxyServlet
- handle 
[windows-jdk7] 1435 [main] INFO org.apache.commons.httpclient.auth.AuthChallengeProcessor
- basic authentication scheme selected
[windows-jdk7] 1437 [1244207248@qtp-823603072-1] INFO org.apache.maven.plugins.site.deploy.AuthAsyncProxyServlet
- handle 
[windows-jdk7] 1438 [1244207248@qtp-823603072-1] INFO org.apache.maven.plugins.site.deploy.AuthAsyncProxyServlet
- writing file f:\jenkins\jenkins-slave\workspace\ox_maven-site-plugin_master-LZWAKOPRMO5JAZW5HRA2IQ56LLTFU3PLKDIE2JNFFXEGASBYKK3Q@2\m\target\siteTargetDeploy\site\css\maven-base.css
[windows-jdk7] 1441 [1244207248@qtp-823603072-1] INFO org.apache.maven.plugins.site.deploy.AuthAsyncProxyServlet
- handle 
[windows-jdk7] 1441 [main] INFO org.apache.commons.httpclient.auth.AuthChallengeProcessor
- basic authentication scheme selected
[windows-jdk7] 1443 [1244207248@qtp-823603072-1] INFO org.apache.maven.plugins.site.deploy.AuthAsyncProxyServlet
- handle 
[windows-jdk7] 1446 [1244207248@qtp-823603072-1] INFO org.apache.maven.plugins.site.deploy.AuthAsyncProxyServlet
- handle 
[windows-jdk7] 1447 [main] INFO org.apache.commons.httpclient.auth.AuthChallengeProcessor
- basic authentication scheme selected
[windows-jdk7] 1451 [1244207248@qtp-823603072-1] INFO org.apache.maven.plugins.site.deploy.AuthAsyncProxyServlet
- handle 
[windows-jdk7] 1451 [1244207248@qtp-823603072-1] INFO org.apache.maven.plugins.site.deploy.AuthAsyncProxyServlet
- writing file f:\jenkins\jenkins-slave\workspace\ox_maven-site-plugin_master-LZWAKOPRMO5JAZW5HRA2IQ56LLTFU3PLKDIE2JNFFXEGASBYKK3Q@2\m\target\siteTargetDeploy\site\index.html
[windows-jdk7] 1456 [main] INFO org.apache.maven.plugins.site.deploy.SiteDeployWebDavTest
- MKCOL path /site/css/
[windows-jdk7] Proxy-Authorization : Basic Zm9vOnRpdGk=
[windows-jdk7] Host : toto.com
[windows-jdk7] Content-Length : 0
[windows-jdk7] Expires : 0
[windows-jdk7] Accept-Encoding : gzip
[windows-jdk7] User-Agent : Jakarta Commons-HttpClient/3.1
[windows-jdk7] Proxy-Connection : Keep-Alive
[windows-jdk7] Pragma : no-cache
[windows-jdk7] Cache-store : no-store
[windows-jdk7] Cache-Control : no-cache
[windows-jdk7] 
[windows-jdk7] 1456 [main] INFO org.apache.maven.plugins.site.deploy.SiteDeployWebDavTest
- PUT path /site//css/maven-base.css
[windows-jdk7] Proxy-Authorization : Basic Zm9vOnRpdGk=
[windows-jdk7] Host : toto.com
[windows-jdk7] Content-Length : 3121
[windows-jdk7] Expires : 0
[windows-jdk7] Accept-Encoding : gzip
[windows-jdk7] User-Agent : Jakarta Commons-HttpClient/3.1
[windows-jdk7] Proxy-Connection : Keep-Alive
[windows-jdk7] Pragma : no-cache
[windows-jdk7] Cache-store : no-store
[windows-jdk7] Cache-Control : no-cache
[windows-jdk7] 
[windows-jdk7] 1456 [main] INFO org.apache.maven.plugins.site.deploy.SiteDeployWebDavTest
- MKCOL path /site/
[windows-jdk7] Proxy-Authorization : Basic Zm9vOnRpdGk=
[windows-jdk7] Host : toto.com
[windows-jdk7] Content-Length : 0
[windows-jdk7] Expires : 0
[windows-jdk7] Accept-Encoding : gzip
[windows-jdk7] User-Agent : Jakarta Commons-HttpClient/3.1
[windows-jdk7] Proxy-Connection : Keep-Alive
[windows-jdk7] Pragma : no-cache
[windows-jdk7] Cache-store : no-store
[windows-jdk7] Cache-Control : no-cache
[windows-jdk7] 
[windows-jdk7] 1456 [main] INFO org.apache.maven.plugins.site.deploy.SiteDeployWebDavTest
- PUT path /site//index.html
[windows-jdk7] Proxy-Authorization : Basic Zm9vOnRpdGk=
[windows-jdk7] Host : toto.com
[windows-jdk7] Content-Length : 21107
[windows-jdk7] Expires : 0
[windows-jdk7] Accept-Encoding : gzip
[windows-jdk7] User-Agent : Jakarta Commons-HttpClient/3.1
[windows-jdk7] Proxy-Connection : Keep-Alive
[windows-jdk7] Pragma : no-cache
[windows-jdk7] Cache-store : no-store
[windows-jdk7] Cache-Control : no-cache
[windows-jdk7] 
[windows-jdk7] 1456 [main] INFO org.mortbay.log - Stopped SocketConnector@0.0.0.0:49805
[windows-jdk7] 1714 [main] INFO org.mortbay.log - jetty-6.1.25
[windows-jdk7] 1715 [main] INFO org.mortbay.log - Started SocketConnector@0.0.0.0:49811
[windows-jdk7] [INFO] Pushing src\test\resources\unit\deploy-dav\target\site
[windows-jdk7] [INFO]    >>> to http://toto.com/site/./
[windows-jdk7] 1770 [402156910@qtp-518287145-1] INFO org.apache.maven.plugins.site.deploy.SimpleDavServerHandler
- writing file f:\jenkins\jenkins-slave\workspace\ox_maven-site-plugin_master-LZWAKOPRMO5JAZW5HRA2IQ56LLTFU3PLKDIE2JNFFXEGASBYKK3Q@2\m\target\siteTargetDeploy\site\css\maven-base.css
[windows-jdk7] 1773 [402156910@qtp-518287145-1] INFO org.apache.maven.plugins.site.deploy.SimpleDavServerHandler
- writing file f:\jenkins\jenkins-slave\workspace\ox_maven-site-plugin_master-LZWAKOPRMO5JAZW5HRA2IQ56LLTFU3PLKDIE2JNFFXEGASBYKK3Q@2\m\target\siteTargetDeploy\site\index.html
[windows-jdk7] 1775 [main] INFO org.apache.maven.plugins.site.deploy.SiteDeployWebDavTest
- MKCOL path /site/css/
[windows-jdk7] Host : toto.com
[windows-jdk7] Content-Length : 0
[windows-jdk7] Expires : 0
[windows-jdk7] Accept-Encoding : gzip
[windows-jdk7] User-Agent : Jakarta Commons-HttpClient/3.1
[windows-jdk7] Proxy-Connection : Keep-Alive
[windows-jdk7] Pragma : no-cache
[windows-jdk7] Cache-store : no-store
[windows-jdk7] Cache-Control : no-cache
[windows-jdk7] 
[windows-jdk7] 1775 [main] INFO org.apache.maven.plugins.site.deploy.SiteDeployWebDavTest
- PUT path /site//css/maven-base.css
[windows-jdk7] Host : toto.com
[windows-jdk7] Content-Length : 3121
[windows-jdk7] Expires : 0
[windows-jdk7] Accept-Encoding : gzip
[windows-jdk7] User-Agent : Jakarta Commons-HttpClient/3.1
[windows-jdk7] Proxy-Connection : Keep-Alive
[windows-jdk7] Pragma : no-cache
[windows-jdk7] Cache-store : no-store
[windows-jdk7] Cache-Control : no-cache
[windows-jdk7] 
[windows-jdk7] 1775 [main] INFO org.apache.maven.plugins.site.deploy.SiteDeployWebDavTest
- MKCOL path /site/
[windows-jdk7] Host : toto.com
[windows-jdk7] Content-Length : 0
[windows-jdk7] Expires : 0
[windows-jdk7] Accept-Encoding : gzip
[windows-jdk7] User-Agent : Jakarta Commons-HttpClient/3.1
[windows-jdk7] Proxy-Connection : Keep-Alive
[windows-jdk7] Pragma : no-cache
[windows-jdk7] Cache-store : no-store
[windows-jdk7] Cache-Control : no-cache
[windows-jdk7] 
[windows-jdk7] 1775 [main] INFO org.apache.maven.plugins.site.deploy.SiteDeployWebDavTest
- PUT path /site//index.html
[windows-jdk7] Host : toto.com
[windows-jdk7] Content-Length : 21107
[windows-jdk7] Expires : 0
[windows-jdk7] Accept-Encoding : gzip
[windows-jdk7] User-Agent : Jakarta Commons-HttpClient/3.1
[windows-jdk7] Proxy-Connection : Keep-Alive
[windows-jdk7] Pragma : no-cache
[windows-jdk7] Cache-store : no-store
[windows-jdk7] Cache-Control : no-cache
[windows-jdk7] 
[windows-jdk7] 1775 [main] INFO org.mortbay.log - Stopped SocketConnector@0.0.0.0:49811
[windows-jdk7] [INFO] Tests run: 3, Failures: 0, Errors: 0, Skipped: 0, Time elapsed: 1.923
s - in org.apache.maven.plugins.site.deploy.SiteDeployWebDavTest
[windows-jdk7] [INFO] Running org.apache.maven.plugins.site.run.WebXmlTest
[linux-jdk9] [INFO]           site-jar/pom.xml ................................. FAILED (0.4
s)
[linux-jdk9] [INFO]   The post-build script returned false.
[linux-jdk9] [INFO] Building: site-sd-top-parent-same-site/pom.xml
[linux-jdk9] Terminated
[windows-jdk8] Sending interrupt signal to process
[windows-jdk8] [INFO] Tests run: 1, Failures: 0, Errors: 0, Skipped: 0, Time elapsed: 0.483
s - in org.apache.maven.plugins.site.run.WebXmlTest
[windows-jdk7] Sending interrupt signal to process
[windows-jdk7] [INFO] Tests run: 1, Failures: 0, Errors: 0, Skipped: 0, Time elapsed: 0.503
s - in org.apache.maven.plugins.site.run.WebXmlTest
[windows-jdk9] Sending interrupt signal to process
[windows-jdk10] [INFO] 
[windows-jdk10] [INFO] --- maven-resources-plugin:3.0.2:resources (default-resources) @ maven-site-plugin
---
[windows-jdk10] [INFO] Using 'UTF-8' encoding to copy filtered resources.
[windows-jdk10] [INFO] Copying 26 resources
[windows-jdk10] [INFO] Copying 3 resources
[windows-jdk10] [INFO] 
[windows-jdk10] [INFO] --- maven-compiler-plugin:3.7.0:compile (default-compile) @ maven-site-plugin
---
[windows-jdk10] Sending interrupt signal to process
[windows-jdk10] [INFO] Changes detected - recompiling the module!
[windows-jdk10] [INFO] Compiling 22 source files to f:\jenkins\jenkins-slave\workspace\ox_maven-site-plugin_master-LZWAKOPRMO5JAZW5HRA2IQ56LLTFU3PLKDIE2JNFFXEGASBYKK3Q@2\m\target\classes
[Pipeline] [linux-jdk7] }
[Pipeline] [linux-jdk8] }
[Pipeline] [linux-jdk9] }
[Pipeline] [windows-jdk10] }
[Pipeline] [linux-jdk7] // dir
[Pipeline] [linux-jdk8] // dir
[Pipeline] [linux-jdk9] // dir
[Pipeline] [windows-jdk10] // dir
[Pipeline] [linux-jdk7] }
[linux-jdk7] [withMaven] One or multiple Maven executions have been ignored by the Jenkins
Pipeline Maven Plugin because they have been interrupted before completion (1). See Pipeline
Maven Plugin FAQ for more details.
[Pipeline] [linux-jdk8] }
[linux-jdk8] [withMaven] One or multiple Maven executions have been ignored by the Jenkins
Pipeline Maven Plugin because they have been interrupted before completion (1). See Pipeline
Maven Plugin FAQ for more details.
[Pipeline] [linux-jdk9] }
[linux-jdk9] [withMaven] One or multiple Maven executions have been ignored by the Jenkins
Pipeline Maven Plugin because they have been interrupted before completion (1). See Pipeline
Maven Plugin FAQ for more details.
[Pipeline] [windows-jdk10] }
[windows-jdk10] [withMaven] One or multiple Maven executions have been ignored by the Jenkins
Pipeline Maven Plugin because they have been interrupted before completion (1). See Pipeline
Maven Plugin FAQ for more details.
[Pipeline] [linux-jdk7] // withMaven
[Pipeline] [linux-jdk8] // withMaven
[Pipeline] [linux-jdk9] // withMaven
[Pipeline] [windows-jdk10] // withMaven
[Pipeline] [linux-jdk7] echo
[linux-jdk7] [FAIL FAST] linux-jdk10 had first failure, ignoring script returned exit code
143
[Pipeline] [linux-jdk7] }
[Pipeline] [linux-jdk8] echo
[linux-jdk8] [FAIL FAST] linux-jdk10 had first failure, ignoring script returned exit code
143
[Pipeline] [linux-jdk8] }
[Pipeline] [linux-jdk9] echo
[linux-jdk9] [FAIL FAST] linux-jdk10 had first failure, ignoring script returned exit code
143
[Pipeline] [linux-jdk9] }
[Pipeline] [windows-jdk10] echo
[windows-jdk10] [FAIL FAST] linux-jdk10 had first failure, ignoring script returned exit code
-1
[Pipeline] [windows-jdk10] }
[Pipeline] [linux-jdk7] // stage
[Pipeline] [linux-jdk8] // stage
[Pipeline] [linux-jdk9] // stage
[Pipeline] [windows-jdk10] // stage
[Pipeline] [linux-jdk7] }
[Pipeline] [linux-jdk8] }
[Pipeline] [linux-jdk9] }
[Pipeline] [windows-jdk10] }
[Pipeline] [linux-jdk7] // node
[Pipeline] [linux-jdk8] // node
[Pipeline] [linux-jdk9] // node
[Pipeline] [windows-jdk10] // node
[Pipeline] [linux-jdk7] }
[Pipeline] [linux-jdk8] }
[Pipeline] [linux-jdk9] }
[Pipeline] [windows-jdk10] }
[windows-jdk7] After 10s process did not stop
[Pipeline] [windows-jdk7] }
[Pipeline] [windows-jdk7] // dir
[Pipeline] [windows-jdk7] }
[windows-jdk7] [withMaven] One or multiple Maven executions have been ignored by the Jenkins
Pipeline Maven Plugin because they have been interrupted before completion (1). See Pipeline
Maven Plugin FAQ for more details.
[Pipeline] [windows-jdk7] // withMaven
[Pipeline] [windows-jdk7] echo
[windows-jdk7] [FAIL FAST] linux-jdk10 had first failure, ignoring null
[Pipeline] [windows-jdk7] }
[Pipeline] [windows-jdk7] // stage
[Pipeline] [windows-jdk7] }
[Pipeline] [windows-jdk7] // node
[Pipeline] [windows-jdk7] }
[windows-jdk8] After 10s process did not stop
[Pipeline] [windows-jdk8] }
[Pipeline] [windows-jdk8] // dir
[Pipeline] [windows-jdk8] }
[windows-jdk8] [withMaven] One or multiple Maven executions have been ignored by the Jenkins
Pipeline Maven Plugin because they have been interrupted before completion (1). See Pipeline
Maven Plugin FAQ for more details.
[Pipeline] [windows-jdk8] // withMaven
[Pipeline] [windows-jdk8] echo
[windows-jdk8] [FAIL FAST] linux-jdk10 had first failure, ignoring null
[Pipeline] [windows-jdk8] }
[Pipeline] [windows-jdk8] // stage
[Pipeline] [windows-jdk8] }
[Pipeline] [windows-jdk8] // node
[Pipeline] [windows-jdk8] }
[windows-jdk9] After 10s process did not stop
[Pipeline] [windows-jdk9] }
[Pipeline] [windows-jdk9] // dir
[Pipeline] [windows-jdk9] }
[windows-jdk9] [withMaven] One or multiple Maven executions have been ignored by the Jenkins
Pipeline Maven Plugin because they have been interrupted before completion (1). See Pipeline
Maven Plugin FAQ for more details.
[Pipeline] [windows-jdk9] // withMaven
[Pipeline] [windows-jdk9] echo
[windows-jdk9] [FAIL FAST] linux-jdk10 had first failure, ignoring null
[Pipeline] [windows-jdk9] }
[Pipeline] [windows-jdk9] // stage
[Pipeline] [windows-jdk9] }
[Pipeline] [windows-jdk9] // node
[Pipeline] [windows-jdk9] }
[Pipeline] // parallel
[Pipeline] echo
***** FAST FAILURE *****

Fast failure triggered by linux-jdk10

***** FAST FAILURE *****
[Pipeline] stage
[Pipeline] { (Notifications)
[Pipeline] echo
Build result: FAILURE
[Pipeline] jiraIssueSelector
[Pipeline] emailext
Mime
  • Unnamed multipart/mixed (inline, None, 0 bytes)
View raw message