maven-notifications mailing list archives

Site index · List index
Message view « Date » · « Thread »
Top « Date » · « Thread »
From Apache Jenkins Server <jenk...@builds.apache.org>
Subject Build failed in Jenkins: Maven TLP » maven-archetype » ARCHETYPE-545 #1
Date Sat, 07 Apr 2018 14:46:19 GMT
See https://builds.apache.org/job/maven-box/job/maven-archetype/job/ARCHETYPE-545/1/

No changes.

No tests ran.

Build log:
[...truncated 2.94 MB...]
[windows-jdk10] main:
[windows-jdk10]     [mkdir] Created dir: F:\jenkins\jenkins-slave\workspace\ven-archetype_ARCHETYPE-545-HILXCDUDGSSEADZWSM37YDQ4AUSZ64CLEBNX225C3MTHM3O3PQ7Q\m\archetype-common\target\test-classes\repositories\central\archetypes\old\1.0
[windows-jdk10]       [jar] Building jar: F:\jenkins\jenkins-slave\workspace\ven-archetype_ARCHETYPE-545-HILXCDUDGSSEADZWSM37YDQ4AUSZ64CLEBNX225C3MTHM3O3PQ7Q\m\archetype-common\target\test-classes\repositories\central\archetypes\old\1.0\old-1.0.jar
[windows-jdk10]      [copy] Copying 1 file to F:\jenkins\jenkins-slave\workspace\ven-archetype_ARCHETYPE-545-HILXCDUDGSSEADZWSM37YDQ4AUSZ64CLEBNX225C3MTHM3O3PQ7Q\m\archetype-common\target\test-classes\repositories\central\archetypes\old\1.0
[windows-jdk10] [INFO] Executed tasks
[windows-jdk10] [INFO] 
[windows-jdk10] [INFO] --- maven-antrun-plugin:1.8:run (archetype-test-fileset) @ archetype-common
---
[windows-jdk10] [INFO] Executing tasks
[windows-jdk10] 
[windows-jdk10] main:
[windows-jdk10]     [mkdir] Created dir: F:\jenkins\jenkins-slave\workspace\ven-archetype_ARCHETYPE-545-HILXCDUDGSSEADZWSM37YDQ4AUSZ64CLEBNX225C3MTHM3O3PQ7Q\m\archetype-common\target\test-classes\repositories\central\archetypes\fileset\1.0
[windows-jdk10]       [jar] Building jar: F:\jenkins\jenkins-slave\workspace\ven-archetype_ARCHETYPE-545-HILXCDUDGSSEADZWSM37YDQ4AUSZ64CLEBNX225C3MTHM3O3PQ7Q\m\archetype-common\target\test-classes\repositories\central\archetypes\fileset\1.0\fileset-1.0.jar
[windows-jdk10]      [copy] Copying 1 file to F:\jenkins\jenkins-slave\workspace\ven-archetype_ARCHETYPE-545-HILXCDUDGSSEADZWSM37YDQ4AUSZ64CLEBNX225C3MTHM3O3PQ7Q\m\archetype-common\target\test-classes\repositories\central\archetypes\fileset\1.0
[windows-jdk10] [INFO] Executed tasks
[windows-jdk10] [INFO] 
[windows-jdk10] [INFO] --- maven-antrun-plugin:1.8:run (archetype-test-fileset-with-postscript)
@ archetype-common ---
[windows-jdk10] [INFO] Executing tasks
[windows-jdk10] 
[windows-jdk10] main:
[windows-jdk10]     [mkdir] Created dir: F:\jenkins\jenkins-slave\workspace\ven-archetype_ARCHETYPE-545-HILXCDUDGSSEADZWSM37YDQ4AUSZ64CLEBNX225C3MTHM3O3PQ7Q\m\archetype-common\target\test-classes\repositories\central\archetypes\fileset_with_postscript\1.0
[windows-jdk10]       [jar] Building jar: F:\jenkins\jenkins-slave\workspace\ven-archetype_ARCHETYPE-545-HILXCDUDGSSEADZWSM37YDQ4AUSZ64CLEBNX225C3MTHM3O3PQ7Q\m\archetype-common\target\test-classes\repositories\central\archetypes\fileset_with_postscript\1.0\fileset_with_postscript-1.0.jar
[windows-jdk10]      [copy] Copying 1 file to F:\jenkins\jenkins-slave\workspace\ven-archetype_ARCHETYPE-545-HILXCDUDGSSEADZWSM37YDQ4AUSZ64CLEBNX225C3MTHM3O3PQ7Q\m\archetype-common\target\test-classes\repositories\central\archetypes\fileset_with_postscript\1.0
[windows-jdk10] [INFO] Executed tasks
[windows-jdk10] [INFO] 
[windows-jdk10] [INFO] --- maven-antrun-plugin:1.8:run (repository-metadata) @ archetype-common
---
[windows-jdk10] [INFO] Executing tasks
[windows-jdk10] 
[windows-jdk10] main:
[windows-jdk10] [INFO] Executed tasks
[windows-jdk10] [INFO] 
[windows-jdk10] [INFO] --- maven-compiler-plugin:3.7.0:testCompile (default-testCompile) @
archetype-common ---
[windows-jdk10] [INFO] Changes detected - recompiling the module!
[windows-jdk10] [INFO] Compiling 12 source files to F:\jenkins\jenkins-slave\workspace\ven-archetype_ARCHETYPE-545-HILXCDUDGSSEADZWSM37YDQ4AUSZ64CLEBNX225C3MTHM3O3PQ7Q\m\archetype-common\target\test-classes
[windows-jdk10] [INFO] /F:/jenkins/jenkins-slave/workspace/ven-archetype_ARCHETYPE-545-HILXCDUDGSSEADZWSM37YDQ4AUSZ64CLEBNX225C3MTHM3O3PQ7Q/m/archetype-common/src/test/java/org/apache/maven/archetype/generator/DefaultArchetypeGeneratorTest.java:
Some input files use or override a deprecated API.
[windows-jdk10] [INFO] /F:/jenkins/jenkins-slave/workspace/ven-archetype_ARCHETYPE-545-HILXCDUDGSSEADZWSM37YDQ4AUSZ64CLEBNX225C3MTHM3O3PQ7Q/m/archetype-common/src/test/java/org/apache/maven/archetype/generator/DefaultArchetypeGeneratorTest.java:
Recompile with -Xlint:deprecation for details.
[windows-jdk10] [INFO] 
[windows-jdk10] [INFO] --- maven-surefire-plugin:2.20.1:test (default-test) @ archetype-common
---
[windows-jdk10] [INFO] ------------------------------------------------------------------------
[windows-jdk10] [INFO] Reactor Summary:
[windows-jdk10] [INFO] 
[windows-jdk10] [INFO] Maven Archetype .................................... SUCCESS [ 14.715
s]
[windows-jdk10] [INFO] Maven Archetype Models ............................. SUCCESS [  0.560
s]
[windows-jdk10] [INFO] Maven Archetype Catalog Model ...................... SUCCESS [  4.462
s]
[windows-jdk10] [INFO] Maven Archetype Descriptor Model ................... SUCCESS [  0.938
s]
[windows-jdk10] [INFO] Maven Archetype Testing ............................ SUCCESS [  0.658
s]
[windows-jdk10] [INFO] Maven Archetype Webapp Repository .................. SUCCESS [  1.673
s]
[windows-jdk10] [INFO] Maven Archetype Webapp Proxy ....................... SUCCESS [  0.840
s]
[windows-jdk10] [INFO] Maven Archetype Common ............................. FAILURE [  8.759
s]
[windows-jdk10] [INFO] Maven Archetype Packaging .......................... SKIPPED
[windows-jdk10] [INFO] Maven Archetype Plugin ............................. SKIPPED
[windows-jdk10] [INFO] Maven Archetype Testing Final ...................... SKIPPED
[windows-jdk10] [INFO] ------------------------------------------------------------------------
[windows-jdk10] [INFO] BUILD FAILURE
[windows-jdk10] [INFO] ------------------------------------------------------------------------
[windows-jdk10] [INFO] Total time: 33.919 s
[windows-jdk10] [INFO] Finished at: 2018-04-07T14:46:06Z
[windows-jdk10] [INFO] Final Memory: 55M/190M
[windows-jdk10] [INFO] ------------------------------------------------------------------------
[windows-jdk10] [INFO] [jenkins-event-spy] Generated F:\jenkins\jenkins-slave\workspace\ven-archetype_ARCHETYPE-545-HILXCDUDGSSEADZWSM37YDQ4AUSZ64CLEBNX225C3MTHM3O3PQ7Q@tmp\withMaven08cae213\maven-spy-20180407-144531-87914949042641582890760.log
[windows-jdk10] [ERROR] Failed to execute goal org.apache.maven.plugins:maven-surefire-plugin:2.20.1:test
(default-test) on project archetype-common: Execution default-test of goal org.apache.maven.plugins:maven-surefire-plugin:2.20.1:test
failed. NullPointerException -> [Help 1]
[windows-jdk10] [ERROR] 
[windows-jdk10] [ERROR] To see the full stack trace of the errors, re-run Maven with the -e
switch.
[windows-jdk10] [ERROR] Re-run Maven using the -X switch to enable full debug logging.
[windows-jdk10] [ERROR] 
[windows-jdk10] [ERROR] For more information about the errors and possible solutions, please
read the following articles:
[windows-jdk10] [ERROR] [Help 1] http://cwiki.apache.org/confluence/display/MAVEN/PluginExecutionException
[windows-jdk10] [ERROR] 
[windows-jdk10] [ERROR] After correcting the problems, you can resume the build with the command
[windows-jdk10] [ERROR]   mvn <goals> -rf :archetype-common
[windows-jdk8] [INFO] Downloaded: https://repo.maven.apache.org/maven2/org/apache/maven/maven-parent/9/maven-parent-9.pom
(33 kB at 462 kB/s)
[windows-jdk8] [INFO] Downloading: https://repo.maven.apache.org/maven2/org/apache/maven/shared/maven-shared-io/1.1/maven-shared-io-1.1.pom
[windows-jdk8] [INFO] Downloaded: https://repo.maven.apache.org/maven2/org/apache/maven/shared/maven-shared-io/1.1/maven-shared-io-1.1.pom
(4.1 kB at 451 kB/s)
[windows-jdk8] [INFO] Downloading: https://repo.maven.apache.org/maven2/org/apache/maven/shared/maven-shared-components/8/maven-shared-components-8.pom
[windows-jdk8] [INFO] Downloaded: https://repo.maven.apache.org/maven2/org/apache/maven/shared/maven-shared-components/8/maven-shared-components-8.pom
(2.7 kB at 334 kB/s)
[windows-jdk8] [INFO] Downloading: https://repo.maven.apache.org/maven2/org/apache/maven/maven-parent/7/maven-parent-7.pom
[windows-jdk8] [INFO] Downloaded: https://repo.maven.apache.org/maven2/org/apache/maven/maven-parent/7/maven-parent-7.pom
(21 kB at 2.4 MB/s)
[windows-jdk8] [INFO] Downloading: https://repo.maven.apache.org/maven2/org/apache/maven/maven-artifact/2.0.2/maven-artifact-2.0.2.pom
[windows-jdk9] [INFO] Executing tasks
[windows-jdk9] 
[windows-jdk9] main:
[windows-jdk9]     [mkdir] Created dir: F:\jenkins\jenkins-slave\workspace\ven-archetype_ARCHETYPE-545-HILXCDUDGSSEADZWSM37YDQ4AUSZ64CLEBNX225C3MTHM3O3PQ7Q@2\m\archetype-common\target\test-classes\repositories\central\archetypes\partial\1.0
[windows-jdk9]       [jar] Building jar: F:\jenkins\jenkins-slave\workspace\ven-archetype_ARCHETYPE-545-HILXCDUDGSSEADZWSM37YDQ4AUSZ64CLEBNX225C3MTHM3O3PQ7Q@2\m\archetype-common\target\test-classes\repositories\central\archetypes\partial\1.0\partial-1.0.jar
[windows-jdk9]      [copy] Copying 1 file to F:\jenkins\jenkins-slave\workspace\ven-archetype_ARCHETYPE-545-HILXCDUDGSSEADZWSM37YDQ4AUSZ64CLEBNX225C3MTHM3O3PQ7Q@2\m\archetype-common\target\test-classes\repositories\central\archetypes\partial\1.0
[windows-jdk9] [INFO] Executed tasks
[windows-jdk9] [INFO] 
[windows-jdk9] [INFO] --- maven-antrun-plugin:1.8:run (archetype-test-site) @ archetype-common
---
[windows-jdk9] [INFO] Executing tasks
[windows-jdk9] 
[windows-jdk9] main:
[windows-jdk9]     [mkdir] Created dir: F:\jenkins\jenkins-slave\workspace\ven-archetype_ARCHETYPE-545-HILXCDUDGSSEADZWSM37YDQ4AUSZ64CLEBNX225C3MTHM3O3PQ7Q@2\m\archetype-common\target\test-classes\repositories\central\archetypes\site\1.0
[windows-jdk9]       [jar] Building jar: F:\jenkins\jenkins-slave\workspace\ven-archetype_ARCHETYPE-545-HILXCDUDGSSEADZWSM37YDQ4AUSZ64CLEBNX225C3MTHM3O3PQ7Q@2\m\archetype-common\target\test-classes\repositories\central\archetypes\site\1.0\site-1.0.jar
[windows-jdk9]      [copy] Copying 1 file to F:\jenkins\jenkins-slave\workspace\ven-archetype_ARCHETYPE-545-HILXCDUDGSSEADZWSM37YDQ4AUSZ64CLEBNX225C3MTHM3O3PQ7Q@2\m\archetype-common\target\test-classes\repositories\central\archetypes\site\1.0
[windows-jdk9] [INFO] Executed tasks
[windows-jdk9] [INFO] 
[windows-jdk9] [INFO] --- maven-antrun-plugin:1.8:run (archetype-test-old) @ archetype-common
---
[windows-jdk9] [INFO] Executing tasks
[windows-jdk9] 
[windows-jdk9] main:
[windows-jdk9]     [mkdir] Created dir: F:\jenkins\jenkins-slave\workspace\ven-archetype_ARCHETYPE-545-HILXCDUDGSSEADZWSM37YDQ4AUSZ64CLEBNX225C3MTHM3O3PQ7Q@2\m\archetype-common\target\test-classes\repositories\central\archetypes\old\1.0
[windows-jdk9]       [jar] Building jar: F:\jenkins\jenkins-slave\workspace\ven-archetype_ARCHETYPE-545-HILXCDUDGSSEADZWSM37YDQ4AUSZ64CLEBNX225C3MTHM3O3PQ7Q@2\m\archetype-common\target\test-classes\repositories\central\archetypes\old\1.0\old-1.0.jar
[windows-jdk9]      [copy] Copying 1 file to F:\jenkins\jenkins-slave\workspace\ven-archetype_ARCHETYPE-545-HILXCDUDGSSEADZWSM37YDQ4AUSZ64CLEBNX225C3MTHM3O3PQ7Q@2\m\archetype-common\target\test-classes\repositories\central\archetypes\old\1.0
[windows-jdk9] [INFO] Executed tasks
[windows-jdk9] [INFO] 
[windows-jdk9] [INFO] --- maven-antrun-plugin:1.8:run (archetype-test-fileset) @ archetype-common
---
[windows-jdk9] [INFO] Executing tasks
[windows-jdk9] 
[windows-jdk9] main:
[windows-jdk9]     [mkdir] Created dir: F:\jenkins\jenkins-slave\workspace\ven-archetype_ARCHETYPE-545-HILXCDUDGSSEADZWSM37YDQ4AUSZ64CLEBNX225C3MTHM3O3PQ7Q@2\m\archetype-common\target\test-classes\repositories\central\archetypes\fileset\1.0
[windows-jdk9]       [jar] Building jar: F:\jenkins\jenkins-slave\workspace\ven-archetype_ARCHETYPE-545-HILXCDUDGSSEADZWSM37YDQ4AUSZ64CLEBNX225C3MTHM3O3PQ7Q@2\m\archetype-common\target\test-classes\repositories\central\archetypes\fileset\1.0\fileset-1.0.jar
[windows-jdk9]      [copy] Copying 1 file to F:\jenkins\jenkins-slave\workspace\ven-archetype_ARCHETYPE-545-HILXCDUDGSSEADZWSM37YDQ4AUSZ64CLEBNX225C3MTHM3O3PQ7Q@2\m\archetype-common\target\test-classes\repositories\central\archetypes\fileset\1.0
[windows-jdk9] [INFO] Executed tasks
[windows-jdk9] [INFO] 
[windows-jdk9] [INFO] --- maven-antrun-plugin:1.8:run (archetype-test-fileset-with-postscript)
@ archetype-common ---
[windows-jdk9] [INFO] Executing tasks
[windows-jdk9] 
[windows-jdk9] main:
[windows-jdk9]     [mkdir] Created dir: F:\jenkins\jenkins-slave\workspace\ven-archetype_ARCHETYPE-545-HILXCDUDGSSEADZWSM37YDQ4AUSZ64CLEBNX225C3MTHM3O3PQ7Q@2\m\archetype-common\target\test-classes\repositories\central\archetypes\fileset_with_postscript\1.0
[windows-jdk9]       [jar] Building jar: F:\jenkins\jenkins-slave\workspace\ven-archetype_ARCHETYPE-545-HILXCDUDGSSEADZWSM37YDQ4AUSZ64CLEBNX225C3MTHM3O3PQ7Q@2\m\archetype-common\target\test-classes\repositories\central\archetypes\fileset_with_postscript\1.0\fileset_with_postscript-1.0.jar
[windows-jdk9]      [copy] Copying 1 file to F:\jenkins\jenkins-slave\workspace\ven-archetype_ARCHETYPE-545-HILXCDUDGSSEADZWSM37YDQ4AUSZ64CLEBNX225C3MTHM3O3PQ7Q@2\m\archetype-common\target\test-classes\repositories\central\archetypes\fileset_with_postscript\1.0
[windows-jdk9] [INFO] Executed tasks
[windows-jdk9] [INFO] 
[windows-jdk9] [INFO] --- maven-antrun-plugin:1.8:run (repository-metadata) @ archetype-common
---
[windows-jdk9] [INFO] Executing tasks
[windows-jdk9] 
[windows-jdk9] main:
[windows-jdk9] [INFO] Executed tasks
[windows-jdk9] [INFO] 
[windows-jdk9] [INFO] --- maven-compiler-plugin:3.7.0:testCompile (default-testCompile) @
archetype-common ---
[windows-jdk9] [INFO] Changes detected - recompiling the module!
[windows-jdk9] [INFO] Compiling 12 source files to F:\jenkins\jenkins-slave\workspace\ven-archetype_ARCHETYPE-545-HILXCDUDGSSEADZWSM37YDQ4AUSZ64CLEBNX225C3MTHM3O3PQ7Q@2\m\archetype-common\target\test-classes
[windows-jdk9] Sending interrupt signal to process
[windows-jdk9] [INFO] /F:/jenkins/jenkins-slave/workspace/ven-archetype_ARCHETYPE-545-HILXCDUDGSSEADZWSM37YDQ4AUSZ64CLEBNX225C3MTHM3O3PQ7Q@2/m/archetype-common/src/test/java/org/apache/maven/archetype/old/ArchetypeTest.java:
Some input files use or override a deprecated API.
[windows-jdk9] [INFO] /F:/jenkins/jenkins-slave/workspace/ven-archetype_ARCHETYPE-545-HILXCDUDGSSEADZWSM37YDQ4AUSZ64CLEBNX225C3MTHM3O3PQ7Q@2/m/archetype-common/src/test/java/org/apache/maven/archetype/old/ArchetypeTest.java:
Recompile with -Xlint:deprecation for details.
[windows-jdk9] [INFO] 
[windows-jdk9] [INFO] --- maven-surefire-plugin:2.20.1:test (default-test) @ archetype-common
---
[windows-jdk10] Sending interrupt signal to process
[Pipeline] [linux-jdk7] }
[Pipeline] [linux-jdk8] }
[Pipeline] [linux-jdk9] }
[Pipeline] [windows-jdk7] }
[Pipeline] [windows-jdk10] }
[Pipeline] [linux-jdk7] // dir
[Pipeline] [linux-jdk8] // dir
[Pipeline] [linux-jdk9] // dir
[Pipeline] [windows-jdk7] // dir
[Pipeline] [windows-jdk10] // dir
[Pipeline] [linux-jdk7] }
[linux-jdk7] [withMaven] One or multiple Maven executions have been ignored by the Jenkins
Pipeline Maven Plugin because they have been interrupted before completion (1). See Pipeline
Maven Plugin FAQ for more details.
[Pipeline] [linux-jdk8] }
[linux-jdk8] [withMaven] One or multiple Maven executions have been ignored by the Jenkins
Pipeline Maven Plugin because they have been interrupted before completion (1). See Pipeline
Maven Plugin FAQ for more details.
[Pipeline] [linux-jdk9] }
[linux-jdk9] [withMaven] One or multiple Maven executions have been ignored by the Jenkins
Pipeline Maven Plugin because they have been interrupted before completion (1). See Pipeline
Maven Plugin FAQ for more details.
[Pipeline] [windows-jdk7] }
[windows-jdk7] [withMaven] One or multiple Maven executions have been ignored by the Jenkins
Pipeline Maven Plugin because they have been interrupted before completion (1). See Pipeline
Maven Plugin FAQ for more details.
[Pipeline] [windows-jdk10] }
[windows-jdk10] [withMaven] junitPublisher - Archive test results for Maven artifact org.apache.maven.archetype:archetype-catalog:3.0.2-SNAPSHOT
generated by maven-surefire-plugin:test (default-test): m\archetype-models\archetype-catalog\target\surefire-reports\*.xml
[windows-jdk10] [withMaven] junitPublisher - Jenkins JUnit Attachments Plugin not found, can't
publish test attachments.Recording test results
[windows-jdk10] None of the test reports contained any result
[windows-jdk10] [withMaven] junitPublisher - Archive test results for Maven artifact org.apache.maven.archetype:archetype-descriptor:3.0.2-SNAPSHOT
generated by maven-surefire-plugin:test (default-test): m\archetype-models\archetype-descriptor\target\surefire-reports\*.xml
[windows-jdk10] [withMaven] junitPublisher - Jenkins JUnit Attachments Plugin not found, can't
publish test attachments.Recording test results
[windows-jdk10] None of the test reports contained any result
[windows-jdk10] [withMaven] junitPublisher - Archive test results for Maven artifact org.apache.maven.archetype:archetype-repository:3.0.2-SNAPSHOT
generated by maven-surefire-plugin:test (default-test): m\archetype-testing\archetype-repository\target\surefire-reports\*.xml
[windows-jdk10] [withMaven] junitPublisher - Jenkins JUnit Attachments Plugin not found, can't
publish test attachments.Recording test results
[windows-jdk10] None of the test reports contained any result
[windows-jdk10] [withMaven] junitPublisher - Archive test results for Maven artifact org.apache.maven.archetype:archetype-proxy:3.0.2-SNAPSHOT
generated by maven-surefire-plugin:test (default-test): m\archetype-testing\archetype-proxy\target\surefire-reports\*.xml
[windows-jdk10] [withMaven] junitPublisher - Jenkins JUnit Attachments Plugin not found, can't
publish test attachments.Recording test results
[windows-jdk10] None of the test reports contained any result
[windows-jdk10] [withMaven] junitPublisher - Archive test results for Maven artifact org.apache.maven.archetype:archetype-common:3.0.2-SNAPSHOT
generated by maven-surefire-plugin:test (default-test): m\archetype-common\target\surefire-reports\*.xml
[windows-jdk10] [withMaven] junitPublisher - Jenkins JUnit Attachments Plugin not found, can't
publish test attachments.Recording test results
[windows-jdk10] None of the test reports contained any result
[Pipeline] [linux-jdk7] // withMaven
[Pipeline] [linux-jdk8] // withMaven
[Pipeline] [linux-jdk9] // withMaven
[Pipeline] [windows-jdk7] // withMaven
[Pipeline] [windows-jdk10] // withMaven
[Pipeline] [linux-jdk7] echo
[linux-jdk7] [FAIL FAST] linux-jdk10 had first failure, ignoring script returned exit code
143
[Pipeline] [linux-jdk7] }
[Pipeline] [linux-jdk8] echo
[linux-jdk8] [FAIL FAST] linux-jdk10 had first failure, ignoring script returned exit code
143
[Pipeline] [linux-jdk8] }
[Pipeline] [linux-jdk9] echo
[linux-jdk9] [FAIL FAST] linux-jdk10 had first failure, ignoring script returned exit code
143
[Pipeline] [linux-jdk9] }
[Pipeline] [windows-jdk7] echo
[windows-jdk7] [FAIL FAST] linux-jdk10 had first failure, ignoring script returned exit code
-1
[Pipeline] [windows-jdk7] }
[Pipeline] [windows-jdk10] echo
[windows-jdk10] [FAIL FAST] linux-jdk10 had first failure, ignoring script returned exit code
1
[Pipeline] [windows-jdk10] }
[Pipeline] [linux-jdk7] // stage
[Pipeline] [linux-jdk8] // stage
[Pipeline] [linux-jdk9] // stage
[Pipeline] [windows-jdk7] // stage
[Pipeline] [windows-jdk10] // stage
[Pipeline] [linux-jdk7] }
[Pipeline] [linux-jdk8] }
[Pipeline] [linux-jdk9] }
[Pipeline] [windows-jdk7] }
[Pipeline] [windows-jdk10] }
[Pipeline] [linux-jdk7] // node
[Pipeline] [linux-jdk8] // node
[Pipeline] [linux-jdk9] // node
[Pipeline] [windows-jdk7] // node
[Pipeline] [windows-jdk10] // node
[Pipeline] [linux-jdk7] }
[Pipeline] [linux-jdk8] }
[Pipeline] [linux-jdk9] }
[Pipeline] [windows-jdk7] }
[Pipeline] [windows-jdk10] }
[windows-jdk8] After 10s process did not stop
[Pipeline] [windows-jdk8] }
[Pipeline] [windows-jdk8] // dir
[Pipeline] [windows-jdk8] }
[windows-jdk8] [withMaven] One or multiple Maven executions have been ignored by the Jenkins
Pipeline Maven Plugin because they have been interrupted before completion (1). See Pipeline
Maven Plugin FAQ for more details.
[Pipeline] [windows-jdk8] // withMaven
[Pipeline] [windows-jdk8] echo
[windows-jdk8] [FAIL FAST] linux-jdk10 had first failure, ignoring null
[Pipeline] [windows-jdk8] }
[Pipeline] [windows-jdk8] // stage
[Pipeline] [windows-jdk8] }
[Pipeline] [windows-jdk8] // node
[Pipeline] [windows-jdk8] }
[windows-jdk9] After 10s process did not stop
[Pipeline] [windows-jdk9] }
[Pipeline] [windows-jdk9] // dir
[Pipeline] [windows-jdk9] }
[windows-jdk9] [withMaven] One or multiple Maven executions have been ignored by the Jenkins
Pipeline Maven Plugin because they have been interrupted before completion (1). See Pipeline
Maven Plugin FAQ for more details.
[Pipeline] [windows-jdk9] // withMaven
[Pipeline] [windows-jdk9] echo
[windows-jdk9] [FAIL FAST] linux-jdk10 had first failure, ignoring null
[Pipeline] [windows-jdk9] }
[Pipeline] [windows-jdk9] // stage
[Pipeline] [windows-jdk9] }
[Pipeline] [windows-jdk9] // node
[Pipeline] [windows-jdk9] }
[Pipeline] // parallel
[Pipeline] echo
***** FAST FAILURE *****

Fast failure triggered by linux-jdk10

***** FAST FAILURE *****
[Pipeline] stage
[Pipeline] { (Notifications)
[Pipeline] echo
Build result: FAILURE
[Pipeline] jiraIssueSelector
[Pipeline] emailext
Mime
  • Unnamed multipart/mixed (inline, None, 0 bytes)
View raw message