maven-notifications mailing list archives

Site index · List index
Message view « Date » · « Thread »
Top « Date » · « Thread »
From Apache Jenkins Server <jenk...@builds.apache.org>
Subject Build failed in Jenkins: Maven TLP » maven-site-plugin » master #31
Date Mon, 23 Apr 2018 16:44:17 GMT
See https://builds.apache.org/job/maven-box/job/maven-site-plugin/job/master/31/

Changes:

* [MSITE-812] Missing '/' in log when deploying documentation by
* [MSITE-818] currently only language is used, not the full locale
* [MSITE-812] Missing '/' in log when deploying documentation by
* [MSITE-818] currently only language is used, not the full locale
* [MSITE-812] Missing '/' in log when deploying documentation by
* [MSITE-818] currently only language is used, not the full locale
* [MSITE-812] Missing '/' in log when deploying documentation by
* [MSITE-818] currently only language is used, not the full locale

No tests ran.

Build log:
[...truncated 862.59 KB...]
[windows-jdk10] [INFO] --- maven-compiler-plugin:3.7.0:testCompile (default-testCompile) @
maven-site-plugin ---
[windows-jdk10] [INFO] Changes detected - recompiling the module!
[windows-jdk10] [INFO] Compiling 7 source files to f:\jenkins\jenkins-slave\workspace\ox_maven-site-plugin_master-LZWAKOPRMO5JAZW5HRA2IQ56LLTFU3PLKDIE2JNFFXEGASBYKK3Q\m\target\test-classes
[windows-jdk10] [INFO] /f:/jenkins/jenkins-slave/workspace/ox_maven-site-plugin_master-LZWAKOPRMO5JAZW5HRA2IQ56LLTFU3PLKDIE2JNFFXEGASBYKK3Q/m/src/test/java/org/apache/maven/plugins/site/deploy/SiteDeployMojoTest.java:
Some input files use or override a deprecated API.
[windows-jdk10] [INFO] /f:/jenkins/jenkins-slave/workspace/ox_maven-site-plugin_master-LZWAKOPRMO5JAZW5HRA2IQ56LLTFU3PLKDIE2JNFFXEGASBYKK3Q/m/src/test/java/org/apache/maven/plugins/site/deploy/SiteDeployMojoTest.java:
Recompile with -Xlint:deprecation for details.
[windows-jdk10] [INFO] 
[windows-jdk10] [INFO] --- maven-surefire-plugin:2.20.1:test (default-test) @ maven-site-plugin
---
[windows-jdk10] [INFO] Downloading: https://repo.maven.apache.org/maven2/org/apache/maven/surefire/maven-surefire-common/2.20.1/maven-surefire-common-2.20.1.pom
[windows-jdk10] [INFO] Downloaded: https://repo.maven.apache.org/maven2/org/apache/maven/surefire/maven-surefire-common/2.20.1/maven-surefire-common-2.20.1.pom
(9.3 kB at 1.2 MB/s)
[windows-jdk10] [INFO] Downloading: https://repo.maven.apache.org/maven2/org/apache/maven/plugin-tools/maven-plugin-annotations/3.3/maven-plugin-annotations-3.3.pom
[windows-jdk10] [INFO] Downloaded: https://repo.maven.apache.org/maven2/org/apache/maven/plugin-tools/maven-plugin-annotations/3.3/maven-plugin-annotations-3.3.pom
(1.6 kB at 204 kB/s)
[windows-jdk10] [INFO] Downloading: https://repo.maven.apache.org/maven2/org/apache/maven/plugin-tools/maven-plugin-tools/3.3/maven-plugin-tools-3.3.pom
[windows-jdk10] [INFO] Downloaded: https://repo.maven.apache.org/maven2/org/apache/maven/plugin-tools/maven-plugin-tools/3.3/maven-plugin-tools-3.3.pom
(13 kB at 2.5 MB/s)
[windows-jdk10] [INFO] Downloading: https://repo.maven.apache.org/maven2/org/apache/maven/surefire/surefire-api/2.20.1/surefire-api-2.20.1.pom
[windows-jdk10] [INFO] Downloaded: https://repo.maven.apache.org/maven2/org/apache/maven/surefire/surefire-api/2.20.1/surefire-api-2.20.1.pom
(3.7 kB at 609 kB/s)
[windows-jdk10] [INFO] Downloading: https://repo.maven.apache.org/maven2/org/apache/maven/surefire/surefire-logger-api/2.20.1/surefire-logger-api-2.20.1.pom
[windows-jdk10] [INFO] Downloaded: https://repo.maven.apache.org/maven2/org/apache/maven/surefire/surefire-logger-api/2.20.1/surefire-logger-api-2.20.1.pom
(2.0 kB at 335 kB/s)
[windows-jdk10] [INFO] Downloading: https://repo.maven.apache.org/maven2/org/apache/maven/surefire/surefire-booter/2.20.1/surefire-booter-2.20.1.pom
[windows-jdk10] [INFO] Downloaded: https://repo.maven.apache.org/maven2/org/apache/maven/surefire/surefire-booter/2.20.1/surefire-booter-2.20.1.pom
(8.5 kB at 1.2 MB/s)
[windows-jdk10] [INFO] Downloading: https://repo.maven.apache.org/maven2/org/apache/maven/surefire/maven-surefire-common/2.20.1/maven-surefire-common-2.20.1.jar
[windows-jdk10] [INFO] Downloading: https://repo.maven.apache.org/maven2/org/apache/maven/surefire/surefire-booter/2.20.1/surefire-booter-2.20.1.jar
[windows-jdk10] [INFO] Downloading: https://repo.maven.apache.org/maven2/org/apache/maven/plugin-tools/maven-plugin-annotations/3.3/maven-plugin-annotations-3.3.jar
[windows-jdk10] [INFO] Downloading: https://repo.maven.apache.org/maven2/org/apache/maven/surefire/surefire-api/2.20.1/surefire-api-2.20.1.jar
[windows-jdk10] [INFO] Downloading: https://repo.maven.apache.org/maven2/org/apache/maven/surefire/surefire-logger-api/2.20.1/surefire-logger-api-2.20.1.jar
[windows-jdk10] [INFO] Downloaded: https://repo.maven.apache.org/maven2/org/apache/maven/surefire/surefire-api/2.20.1/surefire-api-2.20.1.jar
(183 kB at 2.7 MB/s)
[windows-jdk10] [INFO] Downloading: https://repo.maven.apache.org/maven2/junit/junit/4.12/junit-4.12.jar
[windows-jdk10] [INFO] Downloaded: https://repo.maven.apache.org/maven2/org/apache/maven/plugin-tools/maven-plugin-annotations/3.3/maven-plugin-annotations-3.3.jar
(14 kB at 203 kB/s)
[windows-jdk10] [INFO] Downloaded: https://repo.maven.apache.org/maven2/org/apache/maven/surefire/surefire-logger-api/2.20.1/surefire-logger-api-2.20.1.jar
(13 kB at 188 kB/s)
[windows-jdk10] [INFO] Downloaded: https://repo.maven.apache.org/maven2/org/apache/maven/surefire/surefire-booter/2.20.1/surefire-booter-2.20.1.jar
(268 kB at 3.7 MB/s)
[windows-jdk10] [INFO] Downloaded: https://repo.maven.apache.org/maven2/org/apache/maven/surefire/maven-surefire-common/2.20.1/maven-surefire-common-2.20.1.jar
(509 kB at 6.3 MB/s)
[windows-jdk10] [INFO] Downloaded: https://repo.maven.apache.org/maven2/junit/junit/4.12/junit-4.12.jar
(315 kB at 3.3 MB/s)
[windows-jdk10] [INFO] ------------------------------------------------------------------------
[windows-jdk10] [INFO] BUILD FAILURE
[windows-jdk10] [INFO] ------------------------------------------------------------------------
[windows-jdk10] [INFO] Total time: 26.110 s
[windows-jdk10] [INFO] Finished at: 2018-04-23T16:43:59Z
[windows-jdk10] [INFO] Final Memory: 38M/134M
[windows-jdk10] [INFO] ------------------------------------------------------------------------
[windows-jdk10] [INFO] [jenkins-event-spy] Generated F:\jenkins\jenkins-slave\workspace\ox_maven-site-plugin_master-LZWAKOPRMO5JAZW5HRA2IQ56LLTFU3PLKDIE2JNFFXEGASBYKK3Q@tmp\withMaven72327668\maven-spy-20180423-164333-809109885168050868347.log
[windows-jdk10] [ERROR] Failed to execute goal org.apache.maven.plugins:maven-surefire-plugin:2.20.1:test
(default-test) on project maven-site-plugin: Execution default-test of goal org.apache.maven.plugins:maven-surefire-plugin:2.20.1:test
failed. NullPointerException -> [Help 1]
[windows-jdk10] [ERROR] 
[windows-jdk10] [ERROR] To see the full stack trace of the errors, re-run Maven with the -e
switch.
[windows-jdk10] [ERROR] Re-run Maven using the -X switch to enable full debug logging.
[windows-jdk10] [ERROR] 
[windows-jdk10] [ERROR] For more information about the errors and possible solutions, please
read the following articles:
[windows-jdk10] [ERROR] [Help 1] http://cwiki.apache.org/confluence/display/MAVEN/PluginExecutionException
[Pipeline] [windows-jdk10] }
[Pipeline] [windows-jdk10] // dir
[windows-jdk7] [INFO] Tests run: 1, Failures: 0, Errors: 0, Skipped: 0, Time elapsed: 1.796
s - in org.apache.maven.plugins.site.deploy.SiteDeployMojoTest
[windows-jdk7] [INFO] Running org.apache.maven.plugins.site.deploy.SiteDeployWebDavTest
[windows-jdk7] 956 [main] INFO org.mortbay.log - Logging to org.slf4j.impl.SimpleLogger(org.mortbay.log)
via org.mortbay.log.Slf4jLog
[windows-jdk7] 956 [main] INFO org.mortbay.log - jetty-6.1.25
[windows-jdk7] 1002 [main] INFO org.mortbay.log - Started SocketConnector@0.0.0.0:61102
[windows-jdk8] [INFO] /f:/jenkins/jenkins-slave/workspace/ox_maven-site-plugin_master-LZWAKOPRMO5JAZW5HRA2IQ56LLTFU3PLKDIE2JNFFXEGASBYKK3Q@2/m/src/main/java/org/apache/maven/plugins/site/deploy/AbstractDeployMojo.java:
Some input files use or override a deprecated API.
[windows-jdk8] [INFO] /f:/jenkins/jenkins-slave/workspace/ox_maven-site-plugin_master-LZWAKOPRMO5JAZW5HRA2IQ56LLTFU3PLKDIE2JNFFXEGASBYKK3Q@2/m/src/main/java/org/apache/maven/plugins/site/deploy/AbstractDeployMojo.java:
Recompile with -Xlint:deprecation for details.
[windows-jdk8] [INFO] /f:/jenkins/jenkins-slave/workspace/ox_maven-site-plugin_master-LZWAKOPRMO5JAZW5HRA2IQ56LLTFU3PLKDIE2JNFFXEGASBYKK3Q@2/m/src/main/java/org/apache/maven/plugins/site/run/SiteRunMojo.java:
Some input files use unchecked or unsafe operations.
[windows-jdk8] [INFO] /f:/jenkins/jenkins-slave/workspace/ox_maven-site-plugin_master-LZWAKOPRMO5JAZW5HRA2IQ56LLTFU3PLKDIE2JNFFXEGASBYKK3Q@2/m/src/main/java/org/apache/maven/plugins/site/run/SiteRunMojo.java:
Recompile with -Xlint:unchecked for details.
[windows-jdk8] [INFO] 
[windows-jdk8] [INFO] --- maven-plugin-plugin:3.5.1:descriptor (default-descriptor) @ maven-site-plugin
---
[windows-jdk8] [INFO] Using 'UTF-8' encoding to read mojo source files.
[windows-jdk8] [INFO] java-javadoc mojo extractor found 0 mojo descriptor.
[windows-jdk7] [INFO] Pushing src\test\resources\unit\deploy-dav\target\site
[windows-jdk7] [INFO]    >>> to http://toto.com/site//./
[windows-jdk7] 1604 [1000699316@qtp-1604376835-1] INFO org.apache.maven.plugins.site.deploy.SimpleDavServerHandler
- writing file f:\jenkins\jenkins-slave\workspace\ox_maven-site-plugin_master-LZWAKOPRMO5JAZW5HRA2IQ56LLTFU3PLKDIE2JNFFXEGASBYKK3Q\m\target\siteTargetDeploy\site\css\maven-base.css
[windows-jdk7] 1618 [1000699316@qtp-1604376835-1] INFO org.apache.maven.plugins.site.deploy.SimpleDavServerHandler
- writing file f:\jenkins\jenkins-slave\workspace\ox_maven-site-plugin_master-LZWAKOPRMO5JAZW5HRA2IQ56LLTFU3PLKDIE2JNFFXEGASBYKK3Q\m\target\siteTargetDeploy\site\index.html
[windows-jdk7] 1628 [main] INFO org.apache.maven.plugins.site.deploy.SiteDeployWebDavTest
- MKCOL path /site/css/
[windows-jdk7] Host : toto.com
[windows-jdk7] Content-Length : 0
[windows-jdk7] Expires : 0
[windows-jdk7] Accept-Encoding : gzip
[windows-jdk7] User-Agent : Jakarta Commons-HttpClient/3.1
[windows-jdk7] Proxy-Connection : Keep-Alive
[windows-jdk7] Pragma : no-cache
[windows-jdk7] Cache-store : no-store
[windows-jdk7] Cache-Control : no-cache
[windows-jdk7] 
[windows-jdk7] 1628 [main] INFO org.apache.maven.plugins.site.deploy.SiteDeployWebDavTest
- PUT path /site//css/maven-base.css
[windows-jdk7] Host : toto.com
[windows-jdk7] Content-Length : 3291
[windows-jdk7] Expires : 0
[windows-jdk7] Accept-Encoding : gzip
[windows-jdk7] User-Agent : Jakarta Commons-HttpClient/3.1
[windows-jdk7] Proxy-Connection : Keep-Alive
[windows-jdk7] Pragma : no-cache
[windows-jdk7] Cache-store : no-store
[windows-jdk7] Cache-Control : no-cache
[windows-jdk7] 
[windows-jdk7] 1628 [main] INFO org.apache.maven.plugins.site.deploy.SiteDeployWebDavTest
- MKCOL path /site/
[windows-jdk7] Host : toto.com
[windows-jdk7] Content-Length : 0
[windows-jdk7] Expires : 0
[windows-jdk7] Accept-Encoding : gzip
[windows-jdk7] User-Agent : Jakarta Commons-HttpClient/3.1
[windows-jdk7] Proxy-Connection : Keep-Alive
[windows-jdk7] Pragma : no-cache
[windows-jdk7] Cache-store : no-store
[windows-jdk7] Cache-Control : no-cache
[windows-jdk7] 
[windows-jdk7] 1628 [main] INFO org.apache.maven.plugins.site.deploy.SiteDeployWebDavTest
- PUT path /site//index.html
[windows-jdk7] Host : toto.com
[windows-jdk7] Content-Length : 21549
[windows-jdk7] Expires : 0
[windows-jdk7] Accept-Encoding : gzip
[windows-jdk7] User-Agent : Jakarta Commons-HttpClient/3.1
[windows-jdk7] Proxy-Connection : Keep-Alive
[windows-jdk7] Pragma : no-cache
[windows-jdk7] Cache-store : no-store
[windows-jdk7] Cache-Control : no-cache
[windows-jdk7] 
[windows-jdk7] 1628 [main] INFO org.mortbay.log - Stopped SocketConnector@0.0.0.0:61102
[Pipeline] [windows-jdk10] }
[windows-jdk10] [withMaven] junitPublisher - Archive test results for Maven artifact org.apache.maven.plugins:maven-site-plugin:3.7.1-SNAPSHOT
generated by maven-surefire-plugin:test (default-test): m\target\surefire-reports\*.xml
[windows-jdk10] Recording test results
[windows-jdk10] None of the test reports contained any result
[Pipeline] [windows-jdk10] // withMaven
[Pipeline] [windows-jdk10] echo
[windows-jdk10] [FAIL FAST] This is the first failure and likely root cause
[Pipeline] [windows-jdk10] }
[Pipeline] [windows-jdk10] // stage
[Pipeline] [windows-jdk10] }
[Pipeline] [windows-jdk10] // node
[Pipeline] [windows-jdk10] }
[windows-jdk10] Failed in branch windows-jdk10
[windows-jdk7] Sending interrupt signal to process
[windows-jdk7] 1906 [main] INFO org.mortbay.log - jetty-6.1.25
[windows-jdk7] 1968 [main] INFO org.mortbay.log - Started SocketConnector@0.0.0.0:61106
[windows-jdk7] [INFO] 
[windows-jdk7] [INFO] Results:
[windows-jdk7] [INFO] 
[windows-jdk7] [INFO] Tests run: 1, Failures: 0, Errors: 0, Skipped: 0
[windows-jdk7] [INFO] 
[windows-jdk7] [ERROR] There are test failures.
[windows-jdk7] 
[windows-jdk7] Please refer to f:\jenkins\jenkins-slave\workspace\ox_maven-site-plugin_master-LZWAKOPRMO5JAZW5HRA2IQ56LLTFU3PLKDIE2JNFFXEGASBYKK3Q\m\target\surefire-reports
for the individual test results.
[windows-jdk7] Please refer to dump files (if any exist) [date]-jvmRun[N].dump, [date].dumpstream
and [date]-jvmRun[N].dumpstream.
[windows-jdk7] The forked VM terminated without properly saying goodbye. VM crash or System.exit
called?
[windows-jdk7] Command was cmd.exe /X /C "f:\jenkins\tools\java\latest1.7\jre\bin\java -jar
C:\Users\jenkins\AppData\Local\Temp\1\surefire8331311874192025915\surefirebooter2814024577209132826.jar
C:\Users\jenkins\AppData\Local\Temp\1\surefire8331311874192025915 2018-04-23T16-43-57_002-jvmRun1
surefire5397579574578704924tmp surefire_03972198960745972925tmp"
[windows-jdk7] Error occurred in starting fork, check output in log
[windows-jdk7] Process Exit Code: -1
[windows-jdk7] Crashed tests:
[windows-jdk7] org.apache.maven.plugins.site.deploy.SiteDeployWebDavTest
[windows-jdk7] org.apache.maven.surefire.booter.SurefireBooterForkException: The forked VM
terminated without properly saying goodbye. VM crash or System.exit called?
[windows-jdk7] Command was cmd.exe /X /C "f:\jenkins\tools\java\latest1.7\jre\bin\java -jar
C:\Users\jenkins\AppData\Local\Temp\1\surefire8331311874192025915\surefirebooter2814024577209132826.jar
C:\Users\jenkins\AppData\Local\Temp\1\surefire8331311874192025915 2018-04-23T16-43-57_002-jvmRun1
surefire5397579574578704924tmp surefire_03972198960745972925tmp"
[windows-jdk7] Error occurred in starting fork, check output in log
[windows-jdk7] Process Exit Code: -1
[windows-jdk7] Crashed tests:
[windows-jdk7] org.apache.maven.plugins.site.deploy.SiteDeployWebDavTest
[windows-jdk7] 	at org.apache.maven.plugin.surefire.booterclient.ForkStarter.fork(ForkStarter.java:686)
[windows-jdk7] 	at org.apache.maven.plugin.surefire.booterclient.ForkStarter.fork(ForkStarter.java:535)
[windows-jdk7] 	at org.apache.maven.plugin.surefire.booterclient.ForkStarter.run(ForkStarter.java:280)
[windows-jdk7] 	at org.apache.maven.plugin.surefire.booterclient.ForkStarter.run(ForkStarter.java:245)
[windows-jdk7] 	at org.apache.maven.plugin.surefire.AbstractSurefireMojo.executeProvider(AbstractSurefireMojo.java:1124)
[windows-jdk7] 	at org.apache.maven.plugin.surefire.AbstractSurefireMojo.executeAfterPreconditionsChecked(AbstractSurefireMojo.java:954)
[windows-jdk7] 	at org.apache.maven.plugin.surefire.AbstractSurefireMojo.execute(AbstractSurefireMojo.java:832)
[windows-jdk7] 	at org.apache.maven.plugin.DefaultBuildPluginManager.executeMojo(DefaultBuildPluginManager.java:134)
[windows-jdk7] 	at org.apache.maven.lifecycle.internal.MojoExecutor.execute(MojoExecutor.java:208)
[windows-jdk7] 	at org.apache.maven.lifecycle.internal.MojoExecutor.execute(MojoExecutor.java:154)
[windows-jdk7] 	at org.apache.maven.lifecycle.internal.MojoExecutor.execute(MojoExecutor.java:146)
[windows-jdk7] 	at org.apache.maven.lifecycle.internal.LifecycleModuleBuilder.buildProject(LifecycleModuleBuilder.java:117)
[windows-jdk7] 	at org.apache.maven.lifecycle.internal.LifecycleModuleBuilder.buildProject(LifecycleModuleBuilder.java:81)
[windows-jdk7] 	at org.apache.maven.lifecycle.internal.builder.singlethreaded.SingleThreadedBuilder.build(SingleThreadedBuilder.java:51)
[windows-jdk7] 	at org.apache.maven.lifecycle.internal.LifecycleStarter.execute(LifecycleStarter.java:128)
[windows-jdk7] 	at org.apache.maven.DefaultMaven.doExecute(DefaultMaven.java:309)
[windows-jdk7] 	at org.apache.maven.DefaultMaven.doExecute(DefaultMaven.java:194)
[windows-jdk7] 	at org.apache.maven.DefaultMaven.execute(DefaultMaven.java:107)
[windows-jdk7] 	at org.apache.maven.cli.MavenCli.execute(MavenCli.java:993)
[windows-jdk7] 	at org.apache.maven.cli.MavenCli.doMain(MavenCli.java:345)
[windows-jdk7] 	at org.apache.maven.cli.MavenCli.main(MavenCli.java:191)
[windows-jdk7] 	at sun.reflect.NativeMethodAccessorImpl.invoke0(Native Method)
[windows-jdk7] 	at sun.reflect.NativeMethodAccessorImpl.invoke(NativeMethodAccessorImpl.java:57)
[windows-jdk7] 	at sun.reflect.DelegatingMethodAccessorImpl.invoke(DelegatingMethodAccessorImpl.java:43)
[windows-jdk7] 	at java.lang.reflect.Method.invoke(Method.java:606)
[windows-jdk7] 	at org.codehaus.plexus.classworlds.launcher.Launcher.launchEnhanced(Launcher.java:289)
[windows-jdk7] 	at org.codehaus.plexus.classworlds.launcher.Launcher.launch(Launcher.java:229)
[windows-jdk7] 	at org.codehaus.plexus.classworlds.launcher.Launcher.mainWithExitCode(Launcher.java:415)
[windows-jdk7] 	at org.codehaus.plexus.classworlds.launcher.Launcher.main(Launcher.java:356)
[windows-jdk7] 
[windows-jdk8] Sending interrupt signal to process
[windows-jdk9] Sending interrupt signal to process
[Pipeline] [linux-jdk7] // node
[Pipeline] [linux-jdk8] // node
[Pipeline] [linux-jdk9] // node
[Pipeline] [linux-jdk10] // node
[Pipeline] [linux-jdk7] }
[linux-jdk7] Failed in branch linux-jdk7
[Pipeline] [linux-jdk8] }
[linux-jdk8] Failed in branch linux-jdk8
[Pipeline] [linux-jdk9] }
[linux-jdk9] Failed in branch linux-jdk9
[Pipeline] [linux-jdk10] }
[linux-jdk10] Failed in branch linux-jdk10
[Pipeline] [windows-jdk7] }
[Pipeline] [windows-jdk8] }
[Pipeline] [windows-jdk7] // dir
[Pipeline] [windows-jdk8] // dir
[Pipeline] [windows-jdk7] }
[windows-jdk7] [withMaven] One or multiple Maven executions have been ignored by the Jenkins
Pipeline Maven Plugin because they have been interrupted before completion (1). See Pipeline
Maven Plugin FAQ for more details.
[Pipeline] [windows-jdk8] }
[windows-jdk8] [withMaven] One or multiple Maven executions have been ignored by the Jenkins
Pipeline Maven Plugin because they have been interrupted before completion (1). See Pipeline
Maven Plugin FAQ for more details.
[Pipeline] [windows-jdk7] // withMaven
[Pipeline] [windows-jdk8] // withMaven
[Pipeline] [windows-jdk7] echo
[windows-jdk7] [FAIL FAST] windows-jdk10 had first failure, ignoring script returned exit
code -1
[Pipeline] [windows-jdk7] }
[Pipeline] [windows-jdk8] echo
[windows-jdk8] [FAIL FAST] windows-jdk10 had first failure, ignoring script returned exit
code -1
[Pipeline] [windows-jdk8] }
[Pipeline] [windows-jdk7] // stage
[Pipeline] [windows-jdk8] // stage
[Pipeline] [windows-jdk7] }
[Pipeline] [windows-jdk8] }
[Pipeline] [windows-jdk7] // node
[Pipeline] [windows-jdk8] // node
[Pipeline] [windows-jdk7] }
[Pipeline] [windows-jdk8] }
[windows-jdk9] [INFO] run post-build script verify.groovy
[windows-jdk9] WARNING: An illegal reflective access operation has occurred
[windows-jdk9] WARNING: Illegal reflective access by org.codehaus.groovy.reflection.CachedClass
(file:/f:/jenkins/jenkins-slave/workspace/ox_maven-site-plugin_master-LZWAKOPRMO5JAZW5HRA2IQ56LLTFU3PLKDIE2JNFFXEGASBYKK3Q/.repository/org/codehaus/groovy/groovy-all/2.4.8/groovy-all-2.4.8.jar)
to method java.lang.Object.finalize()
[windows-jdk9] WARNING: Please consider reporting this to the maintainers of org.codehaus.groovy.reflection.CachedClass
[windows-jdk9] WARNING: Use --illegal-access=warn to enable warnings of further illegal reflective
access operations
[windows-jdk9] WARNING: All illegal access operations will be denied in a future release
[windows-jdk9] After 10s process did not stop
[Pipeline] [windows-jdk9] }
[Pipeline] [windows-jdk9] // dir
[Pipeline] [windows-jdk9] }
[windows-jdk9] [withMaven] One or multiple Maven executions have been ignored by the Jenkins
Pipeline Maven Plugin because they have been interrupted before completion (1). See Pipeline
Maven Plugin FAQ for more details.
[Pipeline] [windows-jdk9] // withMaven
[Pipeline] [windows-jdk9] echo
[windows-jdk9] [FAIL FAST] windows-jdk10 had first failure, ignoring null
[Pipeline] [windows-jdk9] }
[Pipeline] [windows-jdk9] // stage
[Pipeline] [windows-jdk9] }
[Pipeline] [windows-jdk9] // node
[Pipeline] [windows-jdk9] }
[Pipeline] // parallel
[Pipeline] echo
***** FAST FAILURE *****

Fast failure triggered by windows-jdk10

***** FAST FAILURE *****
[Pipeline] stage
[Pipeline] { (Notifications)
[Pipeline] echo
Build result: FAILURE
[Pipeline] jiraIssueSelector
[Pipeline] jiraComment
[Pipeline] jiraComment
[Pipeline] emailext
Mime
  • Unnamed multipart/mixed (inline, None, 0 bytes)
View raw message