maven-notifications mailing list archives

Site index · List index
Message view « Date » · « Thread »
Top « Date » · « Thread »
From Apache Jenkins Server <jenk...@builds.apache.org>
Subject Build failed in Jenkins: Maven TLP » maven-shared-io » MSHARED-716 #1
Date Sat, 07 Apr 2018 13:57:26 GMT
See https://builds.apache.org/job/maven-box/job/maven-shared-io/job/MSHARED-716/1/

No changes.

No tests ran.

Build log:
[...truncated 28.68 KB...]
[linux-jdk10] Resetting working tree
[linux-jdk10]  > git reset --hard # timeout=10
[linux-jdk10]  > git clean -fdx # timeout=10
[Pipeline] [linux-jdk7] isUnix
[Pipeline] [linux-jdk7] sh
[linux-jdk9] Commit message: "[MSHARED-716] - Upgrade mave-surefire/failsafe-plugin 2.21.0"
[linux-jdk9] Cleaning workspace
[linux-jdk7] [m] Running shell script
[Pipeline] [linux-jdk8] // stage
[Pipeline] [linux-jdk8] stage
[Pipeline] [linux-jdk8] { (Build linux-jdk8)
[linux-jdk9]  > git rev-parse --verify HEAD # timeout=10
[linux-jdk9] Resetting working tree
[linux-jdk9]  > git reset --hard # timeout=10
[linux-jdk9]  > git clean -fdx # timeout=10
[linux-jdk10] fatal: bad object 090e7ee9c188397dc0a755b7eb60600eb6c2c0c9
[linux-jdk7] + mvn -P+run-its -Dmaven.test.failure.ignore=true -Dfindbugs.failOnError=false
clean verify
[linux-jdk7] ----- withMaven Wrapper script -----
[linux-jdk7] Picked up JAVA_TOOL_OPTIONS: -Dmaven.ext.class.path="/home/jenkins/jenkins-slave/workspace/maven-shared-io_MSHARED-716-HOBCH4M3OUSO5PNNSHA4SGXFDYEA5B6S5J7CDPL5H4HEXWKYNYEQ@tmp/withMaven0504b411/pipeline-maven-spy.jar"
-Dorg.jenkinsci.plugins.pipeline.maven.reportsFolder="/home/jenkins/jenkins-slave/workspace/maven-shared-io_MSHARED-716-HOBCH4M3OUSO5PNNSHA4SGXFDYEA5B6S5J7CDPL5H4HEXWKYNYEQ@tmp/withMaven0504b411"

[linux-jdk7] Apache Maven 3.5.2 (138edd61fd100ec658bfa2d307c43b76940a5d7d; 2017-10-18T07:58:13Z)
[linux-jdk7] Maven home: /home/jenkins/tools/maven/apache-maven-3.5.2
[linux-jdk7] Java version: 1.7.0_80, vendor: Oracle Corporation
[linux-jdk7] Java home: /usr/local/asfpackages/java/jdk1.7.0_80/jre
[linux-jdk7] Default locale: en_US, platform encoding: ISO-8859-1
[linux-jdk7] OS name: "linux", version: "4.4.0-43-generic", arch: "amd64", family: "unix"
[linux-jdk9] fatal: bad object 090e7ee9c188397dc0a755b7eb60600eb6c2c0c9
[Pipeline] [linux-jdk8] withMaven
[linux-jdk8] [withMaven] Options: [org.jenkinsci.plugins.pipeline.maven.publishers.GeneratedArtifactsPublisher[disabled=true],
org.jenkinsci.plugins.pipeline.maven.publishers.JunitTestsPublisher[disabled=false], org.jenkinsci.plugins.pipeline.maven.publishers.FindbugsAnalysisPublisher[disabled=true],
org.jenkinsci.plugins.pipeline.maven.publishers.TasksScannerPublisher[disabled=true], org.jenkinsci.plugins.pipeline.maven.publishers.DependenciesFingerprintPublisher[disabled=false,
scopes=[compile, provided, runtime], versions={snapshot:true, release:false}], org.jenkinsci.plugins.pipeline.maven.publishers.InvokerRunsPublisher[disabled=false],
org.jenkinsci.plugins.pipeline.maven.publishers.PipelineGraphPublisher[disabled=false, scopes=[compile,
provided, runtime], versions={snapshot:true, release:false}, skipDownstreamTriggers=false,
lifecycleThreshold=deploy, ignoreUpstreamTriggers=false]]
[linux-jdk8] [withMaven] Available options: 
[linux-jdk8] [withMaven] using JDK installation JDK 1.8 (latest)
[linux-jdk8] [withMaven] using Maven installation 'Maven 3.5.2'
[Pipeline] [linux-jdk8] {
[linux-jdk7] [INFO] [jenkins-event-spy] Generate /home/jenkins/jenkins-slave/workspace/maven-shared-io_MSHARED-716-HOBCH4M3OUSO5PNNSHA4SGXFDYEA5B6S5J7CDPL5H4HEXWKYNYEQ@tmp/withMaven0504b411/maven-spy-20180407-135658-9253650702248704962309.log.tmp
...
[linux-jdk7] [INFO] Scanning for projects...
[linux-jdk7] [ERROR] [ERROR] Some problems were encountered while processing the POMs:
[linux-jdk7] [FATAL] Non-parseable POM /home/jenkins/jenkins-slave/workspace/maven-shared-io_MSHARED-716-HOBCH4M3OUSO5PNNSHA4SGXFDYEA5B6S5J7CDPL5H4HEXWKYNYEQ/m/pom.xml:
TEXT must be immediately followed by END_TAG and not START_TAG (position: START_TAG seen ...<surefire.version>2.21.0<surefire.version>...
@72:47)  @ line 72, column 47
[linux-jdk7]  @ 
[linux-jdk7] [INFO] [jenkins-event-spy] Generated /home/jenkins/jenkins-slave/workspace/maven-shared-io_MSHARED-716-HOBCH4M3OUSO5PNNSHA4SGXFDYEA5B6S5J7CDPL5H4HEXWKYNYEQ@tmp/withMaven0504b411/maven-spy-20180407-135658-9253650702248704962309.log
[linux-jdk7] [ERROR] The build could not read 1 project -> [Help 1]
[linux-jdk7] [ERROR]   
[linux-jdk7] [ERROR]   The project  (/home/jenkins/jenkins-slave/workspace/maven-shared-io_MSHARED-716-HOBCH4M3OUSO5PNNSHA4SGXFDYEA5B6S5J7CDPL5H4HEXWKYNYEQ/m/pom.xml)
has 1 error
[linux-jdk7] [ERROR]     Non-parseable POM /home/jenkins/jenkins-slave/workspace/maven-shared-io_MSHARED-716-HOBCH4M3OUSO5PNNSHA4SGXFDYEA5B6S5J7CDPL5H4HEXWKYNYEQ/m/pom.xml:
TEXT must be immediately followed by END_TAG and not START_TAG (position: START_TAG seen ...<surefire.version>2.21.0<surefire.version>...
@72:47)  @ line 72, column 47 -> [Help 2]
[linux-jdk7] [ERROR] 
[linux-jdk7] [ERROR] To see the full stack trace of the errors, re-run Maven with the -e switch.
[linux-jdk7] [ERROR] Re-run Maven using the -X switch to enable full debug logging.
[linux-jdk7] [ERROR] 
[linux-jdk7] [ERROR] For more information about the errors and possible solutions, please
read the following articles:
[linux-jdk7] [ERROR] [Help 1] http://cwiki.apache.org/confluence/display/MAVEN/ProjectBuildingException
[linux-jdk7] [ERROR] [Help 2] http://cwiki.apache.org/confluence/display/MAVEN/ModelParseException
[Pipeline] [linux-jdk9] }
[Pipeline] [linux-jdk10] }
[Pipeline] [linux-jdk8] dir
[linux-jdk8] Running in /home/jenkins/jenkins-slave/workspace/maven-shared-io_MSHARED-716-HOBCH4M3OUSO5PNNSHA4SGXFDYEA5B6S5J7CDPL5H4HEXWKYNYEQ/m
[Pipeline] [linux-jdk8] {
[Pipeline] [linux-jdk8] isUnix
[Pipeline] [linux-jdk8] sh
[linux-jdk8] [m] Running shell script
[Pipeline] [linux-jdk9] // dir
[Pipeline] [linux-jdk10] // dir
[Pipeline] [linux-jdk9] }
[Pipeline] [linux-jdk10] }
[Pipeline] [linux-jdk7] }
[Pipeline] [linux-jdk9] // stage
[Pipeline] [linux-jdk10] // stage
[Pipeline] [linux-jdk9] stage
[linux-jdk8] + mvn -P+run-its -Dmaven.test.failure.ignore=true -Dfindbugs.failOnError=false
-Dfindbugs.skip=true clean verify
[linux-jdk8] ----- withMaven Wrapper script -----
[linux-jdk8] Picked up JAVA_TOOL_OPTIONS: -Dmaven.ext.class.path="/home/jenkins/jenkins-slave/workspace/maven-shared-io_MSHARED-716-HOBCH4M3OUSO5PNNSHA4SGXFDYEA5B6S5J7CDPL5H4HEXWKYNYEQ@tmp/withMaven8d77f6e6/pipeline-maven-spy.jar"
-Dorg.jenkinsci.plugins.pipeline.maven.reportsFolder="/home/jenkins/jenkins-slave/workspace/maven-shared-io_MSHARED-716-HOBCH4M3OUSO5PNNSHA4SGXFDYEA5B6S5J7CDPL5H4HEXWKYNYEQ@tmp/withMaven8d77f6e6"

[linux-jdk8] Apache Maven 3.5.2 (138edd61fd100ec658bfa2d307c43b76940a5d7d; 2017-10-18T07:58:13Z)
[linux-jdk8] Maven home: /home/jenkins/tools/maven/apache-maven-3.5.2
[linux-jdk8] Java version: 1.8.0_152, vendor: Oracle Corporation
[linux-jdk8] Java home: /usr/local/asfpackages/java/jdk1.8.0_152/jre
[linux-jdk8] Default locale: en_US, platform encoding: ISO-8859-1
[linux-jdk8] OS name: "linux", version: "4.4.0-109-generic", arch: "amd64", family: "unix"
[Pipeline] [linux-jdk9] { (Build linux-jdk9)
[Pipeline] [linux-jdk10] stage
[Pipeline] [linux-jdk10] { (Build linux-jdk10)
[Pipeline] [linux-jdk7] // dir
[windows-jdk7] Still waiting to schedule task
[windows-jdk7] Waiting for next available executor on Windows
[windows-jdk8] Still waiting to schedule task
[windows-jdk8] Waiting for next available executor on Windows
[windows-jdk9] Still waiting to schedule task
[windows-jdk9] Waiting for next available executor on Windows
[windows-jdk10] Still waiting to schedule task
[windows-jdk10] Waiting for next available executor on Windows
[linux-jdk8] [INFO] [jenkins-event-spy] Generate /home/jenkins/jenkins-slave/workspace/maven-shared-io_MSHARED-716-HOBCH4M3OUSO5PNNSHA4SGXFDYEA5B6S5J7CDPL5H4HEXWKYNYEQ@tmp/withMaven8d77f6e6/maven-spy-20180407-135701-603479817273342672039.log.tmp
...
[linux-jdk8] [INFO] Scanning for projects...
[linux-jdk8] [ERROR] [ERROR] Some problems were encountered while processing the POMs:
[linux-jdk8] [FATAL] Non-parseable POM /home/jenkins/jenkins-slave/workspace/maven-shared-io_MSHARED-716-HOBCH4M3OUSO5PNNSHA4SGXFDYEA5B6S5J7CDPL5H4HEXWKYNYEQ/m/pom.xml:
TEXT must be immediately followed by END_TAG and not START_TAG (position: START_TAG seen ...<surefire.version>2.21.0<surefire.version>...
@72:47)  @ line 72, column 47
[linux-jdk8]  @ 
[linux-jdk8] [INFO] [jenkins-event-spy] Generated /home/jenkins/jenkins-slave/workspace/maven-shared-io_MSHARED-716-HOBCH4M3OUSO5PNNSHA4SGXFDYEA5B6S5J7CDPL5H4HEXWKYNYEQ@tmp/withMaven8d77f6e6/maven-spy-20180407-135701-603479817273342672039.log
[linux-jdk8] [ERROR] The build could not read 1 project -> [Help 1]
[linux-jdk8] [ERROR]   
[linux-jdk8] [ERROR]   The project  (/home/jenkins/jenkins-slave/workspace/maven-shared-io_MSHARED-716-HOBCH4M3OUSO5PNNSHA4SGXFDYEA5B6S5J7CDPL5H4HEXWKYNYEQ/m/pom.xml)
has 1 error
[linux-jdk8] [ERROR]     Non-parseable POM /home/jenkins/jenkins-slave/workspace/maven-shared-io_MSHARED-716-HOBCH4M3OUSO5PNNSHA4SGXFDYEA5B6S5J7CDPL5H4HEXWKYNYEQ/m/pom.xml:
TEXT must be immediately followed by END_TAG and not START_TAG (position: START_TAG seen ...<surefire.version>2.21.0<surefire.version>...
@72:47)  @ line 72, column 47 -> [Help 2]
[linux-jdk8] [ERROR] 
[linux-jdk8] [ERROR] To see the full stack trace of the errors, re-run Maven with the -e switch.
[linux-jdk8] [ERROR] Re-run Maven using the -X switch to enable full debug logging.
[linux-jdk8] [ERROR] 
[linux-jdk8] [ERROR] For more information about the errors and possible solutions, please
read the following articles:
[linux-jdk8] [ERROR] [Help 1] http://cwiki.apache.org/confluence/display/MAVEN/ProjectBuildingException
[linux-jdk8] [ERROR] [Help 2] http://cwiki.apache.org/confluence/display/MAVEN/ModelParseException
[Pipeline] [linux-jdk7] }
[linux-jdk7] [Fast Archiver] No prior successful build to compare, so performing full copy
of artifacts
[Pipeline] [linux-jdk9] withMaven
[linux-jdk9] [withMaven] Options: [org.jenkinsci.plugins.pipeline.maven.publishers.GeneratedArtifactsPublisher[disabled=true],
org.jenkinsci.plugins.pipeline.maven.publishers.JunitTestsPublisher[disabled=false], org.jenkinsci.plugins.pipeline.maven.publishers.FindbugsAnalysisPublisher[disabled=true],
org.jenkinsci.plugins.pipeline.maven.publishers.TasksScannerPublisher[disabled=true], org.jenkinsci.plugins.pipeline.maven.publishers.DependenciesFingerprintPublisher[disabled=false,
scopes=[compile, provided, runtime], versions={snapshot:true, release:false}], org.jenkinsci.plugins.pipeline.maven.publishers.InvokerRunsPublisher[disabled=false],
org.jenkinsci.plugins.pipeline.maven.publishers.PipelineGraphPublisher[disabled=false, scopes=[compile,
provided, runtime], versions={snapshot:true, release:false}, skipDownstreamTriggers=false,
lifecycleThreshold=deploy, ignoreUpstreamTriggers=false]]
[linux-jdk9] [withMaven] Available options: 
[linux-jdk9] [withMaven] using JDK installation JDK 1.9 (latest)
[linux-jdk9] [withMaven] using Maven installation 'Maven 3.5.2'
[Pipeline] [linux-jdk9] {
[Pipeline] [linux-jdk10] withMaven
[linux-jdk10] [withMaven] Options: [org.jenkinsci.plugins.pipeline.maven.publishers.GeneratedArtifactsPublisher[disabled=true],
org.jenkinsci.plugins.pipeline.maven.publishers.JunitTestsPublisher[disabled=false], org.jenkinsci.plugins.pipeline.maven.publishers.FindbugsAnalysisPublisher[disabled=true],
org.jenkinsci.plugins.pipeline.maven.publishers.TasksScannerPublisher[disabled=true], org.jenkinsci.plugins.pipeline.maven.publishers.DependenciesFingerprintPublisher[disabled=false,
scopes=[compile, provided, runtime], versions={snapshot:true, release:false}], org.jenkinsci.plugins.pipeline.maven.publishers.InvokerRunsPublisher[disabled=false],
org.jenkinsci.plugins.pipeline.maven.publishers.PipelineGraphPublisher[disabled=false, scopes=[compile,
provided, runtime], versions={snapshot:true, release:false}, skipDownstreamTriggers=false,
lifecycleThreshold=deploy, ignoreUpstreamTriggers=false]]
[linux-jdk10] [withMaven] Available options: 
[linux-jdk10] [withMaven] using JDK installation JDK 10 (latest)
[linux-jdk10] [withMaven] using Maven installation 'Maven 3.5.2'
[Pipeline] [linux-jdk10] {
[Pipeline] [linux-jdk9] dir
[linux-jdk9] Running in /home/jenkins/jenkins-slave/workspace/maven-shared-io_MSHARED-716-HOBCH4M3OUSO5PNNSHA4SGXFDYEA5B6S5J7CDPL5H4HEXWKYNYEQ/m
[Pipeline] [linux-jdk9] {
[Pipeline] [linux-jdk10] dir
[linux-jdk10] Running in /home/jenkins/jenkins-slave/workspace/maven-shared-io_MSHARED-716-HOBCH4M3OUSO5PNNSHA4SGXFDYEA5B6S5J7CDPL5H4HEXWKYNYEQ/m
[Pipeline] [linux-jdk10] {
[Pipeline] [linux-jdk7] // withMaven
[Pipeline] [linux-jdk7] echo
[linux-jdk7] [FAIL FAST] This is the first failure and likely root cause
[Pipeline] [linux-jdk7] }
[Pipeline] [linux-jdk8] }
[Pipeline] [linux-jdk9] isUnix
[Pipeline] [linux-jdk9] sh
[linux-jdk9] [m] Running shell script
[linux-jdk9] + mvn -P+run-its -Dmaven.test.failure.ignore=true -Dfindbugs.failOnError=false
-Dfindbugs.skip=true clean verify
[linux-jdk9] ----- withMaven Wrapper script -----
[linux-jdk9] Picked up JAVA_TOOL_OPTIONS: -Dmaven.ext.class.path="/home/jenkins/jenkins-slave/workspace/maven-shared-io_MSHARED-716-HOBCH4M3OUSO5PNNSHA4SGXFDYEA5B6S5J7CDPL5H4HEXWKYNYEQ@tmp/withMavend511a1d1/pipeline-maven-spy.jar"
-Dorg.jenkinsci.plugins.pipeline.maven.reportsFolder="/home/jenkins/jenkins-slave/workspace/maven-shared-io_MSHARED-716-HOBCH4M3OUSO5PNNSHA4SGXFDYEA5B6S5J7CDPL5H4HEXWKYNYEQ@tmp/withMavend511a1d1"

[linux-jdk9] Apache Maven 3.5.2 (138edd61fd100ec658bfa2d307c43b76940a5d7d; 2017-10-18T07:58:13Z)
[linux-jdk9] Maven home: /home/jenkins/tools/maven/apache-maven-3.5.2
[linux-jdk9] Java version: 9.0.1, vendor: Oracle Corporation
[linux-jdk9] Java home: /usr/local/asfpackages/java/jdk-9.0.1
[linux-jdk9] Default locale: en_US, platform encoding: ISO-8859-1
[linux-jdk9] OS name: "linux", version: "3.13.0-105-generic", arch: "amd64", family: "unix"
[Pipeline] [linux-jdk10] isUnix
[Pipeline] [linux-jdk10] sh
[linux-jdk10] [m] Running shell script
[Pipeline] [linux-jdk7] // stage
[Pipeline] [linux-jdk8] // dir
[linux-jdk9] [INFO] [jenkins-event-spy] Generate /home/jenkins/jenkins-slave/workspace/maven-shared-io_MSHARED-716-HOBCH4M3OUSO5PNNSHA4SGXFDYEA5B6S5J7CDPL5H4HEXWKYNYEQ@tmp/withMavend511a1d1/maven-spy-20180407-135717-216834631133656586943.log.tmp
...
[linux-jdk9] [INFO] Scanning for projects...
[linux-jdk9] [ERROR] [ERROR] Some problems were encountered while processing the POMs:
[linux-jdk9] [FATAL] Non-parseable POM /home/jenkins/jenkins-slave/workspace/maven-shared-io_MSHARED-716-HOBCH4M3OUSO5PNNSHA4SGXFDYEA5B6S5J7CDPL5H4HEXWKYNYEQ/m/pom.xml:
TEXT must be immediately followed by END_TAG and not START_TAG (position: START_TAG seen ...<surefire.version>2.21.0<surefire.version>...
@72:47)  @ line 72, column 47
[linux-jdk9]  @ 
[linux-jdk9] [INFO] [jenkins-event-spy] Generated /home/jenkins/jenkins-slave/workspace/maven-shared-io_MSHARED-716-HOBCH4M3OUSO5PNNSHA4SGXFDYEA5B6S5J7CDPL5H4HEXWKYNYEQ@tmp/withMavend511a1d1/maven-spy-20180407-135717-216834631133656586943.log
[linux-jdk9] [ERROR] The build could not read 1 project -> [Help 1]
[linux-jdk9] [ERROR]   
[linux-jdk9] [ERROR]   The project  (/home/jenkins/jenkins-slave/workspace/maven-shared-io_MSHARED-716-HOBCH4M3OUSO5PNNSHA4SGXFDYEA5B6S5J7CDPL5H4HEXWKYNYEQ/m/pom.xml)
has 1 error
[linux-jdk9] [ERROR]     Non-parseable POM /home/jenkins/jenkins-slave/workspace/maven-shared-io_MSHARED-716-HOBCH4M3OUSO5PNNSHA4SGXFDYEA5B6S5J7CDPL5H4HEXWKYNYEQ/m/pom.xml:
TEXT must be immediately followed by END_TAG and not START_TAG (position: START_TAG seen ...<surefire.version>2.21.0<surefire.version>...
@72:47)  @ line 72, column 47 -> [Help 2]
[linux-jdk9] [ERROR] 
[linux-jdk9] [ERROR] To see the full stack trace of the errors, re-run Maven with the -e switch.
[linux-jdk9] [ERROR] Re-run Maven using the -X switch to enable full debug logging.
[linux-jdk9] [ERROR] 
[linux-jdk9] [ERROR] For more information about the errors and possible solutions, please
read the following articles:
[linux-jdk9] [ERROR] [Help 1] http://cwiki.apache.org/confluence/display/MAVEN/ProjectBuildingException
[linux-jdk9] [ERROR] [Help 2] http://cwiki.apache.org/confluence/display/MAVEN/ModelParseException
[linux-jdk10] + mvn -P+run-its -Dmaven.test.failure.ignore=true -Dfindbugs.failOnError=false
-Dfindbugs.skip=true clean verify
[linux-jdk10] ----- withMaven Wrapper script -----
[linux-jdk10] Picked up JAVA_TOOL_OPTIONS: -Dmaven.ext.class.path="/home/jenkins/jenkins-slave/workspace/maven-shared-io_MSHARED-716-HOBCH4M3OUSO5PNNSHA4SGXFDYEA5B6S5J7CDPL5H4HEXWKYNYEQ@tmp/withMaven1ed873e4/pipeline-maven-spy.jar"
-Dorg.jenkinsci.plugins.pipeline.maven.reportsFolder="/home/jenkins/jenkins-slave/workspace/maven-shared-io_MSHARED-716-HOBCH4M3OUSO5PNNSHA4SGXFDYEA5B6S5J7CDPL5H4HEXWKYNYEQ@tmp/withMaven1ed873e4"

[linux-jdk10] Apache Maven 3.5.2 (138edd61fd100ec658bfa2d307c43b76940a5d7d; 2017-10-18T07:58:13Z)
[linux-jdk10] Maven home: /home/jenkins/tools/maven/apache-maven-3.5.2
[linux-jdk10] Java version: 10, vendor: Oracle Corporation
[linux-jdk10] Java home: /usr/local/asfpackages/java/jdk-10_46
[linux-jdk10] Default locale: en_US, platform encoding: ISO-8859-1
[linux-jdk10] OS name: "linux", version: "4.4.0-43-generic", arch: "amd64", family: "unix"
[linux-jdk10] [INFO] [jenkins-event-spy] Generate /home/jenkins/jenkins-slave/workspace/maven-shared-io_MSHARED-716-HOBCH4M3OUSO5PNNSHA4SGXFDYEA5B6S5J7CDPL5H4HEXWKYNYEQ@tmp/withMaven1ed873e4/maven-spy-20180407-135719-1725935461878126580408.log.tmp
...
[Pipeline] [linux-jdk7] }
[Pipeline] [linux-jdk8] }
[Pipeline] [linux-jdk7] // node
[Pipeline] [linux-jdk8] // withMaven
[Pipeline] [linux-jdk7] }
[linux-jdk7] Failed in branch linux-jdk7
[Pipeline] [linux-jdk8] echo
[linux-jdk8] [FAIL FAST] linux-jdk7 had first failure, ignoring script returned exit code
1
[Pipeline] [linux-jdk8] }
[Pipeline] [linux-jdk9] }
[linux-jdk10] [INFO] Scanning for projects...
[linux-jdk10] [ERROR] [ERROR] Some problems were encountered while processing the POMs:
[linux-jdk10] [FATAL] Non-parseable POM /home/jenkins/jenkins-slave/workspace/maven-shared-io_MSHARED-716-HOBCH4M3OUSO5PNNSHA4SGXFDYEA5B6S5J7CDPL5H4HEXWKYNYEQ/m/pom.xml:
TEXT must be immediately followed by END_TAG and not START_TAG (position: START_TAG seen ...<surefire.version>2.21.0<surefire.version>...
@72:47)  @ line 72, column 47
[linux-jdk10]  @ 
[linux-jdk10] [INFO] [jenkins-event-spy] Generated /home/jenkins/jenkins-slave/workspace/maven-shared-io_MSHARED-716-HOBCH4M3OUSO5PNNSHA4SGXFDYEA5B6S5J7CDPL5H4HEXWKYNYEQ@tmp/withMaven1ed873e4/maven-spy-20180407-135719-1725935461878126580408.log
[linux-jdk10] [ERROR] The build could not read 1 project -> [Help 1]
[linux-jdk10] [ERROR]   
[linux-jdk10] [ERROR]   The project  (/home/jenkins/jenkins-slave/workspace/maven-shared-io_MSHARED-716-HOBCH4M3OUSO5PNNSHA4SGXFDYEA5B6S5J7CDPL5H4HEXWKYNYEQ/m/pom.xml)
has 1 error
[linux-jdk10] [ERROR]     Non-parseable POM /home/jenkins/jenkins-slave/workspace/maven-shared-io_MSHARED-716-HOBCH4M3OUSO5PNNSHA4SGXFDYEA5B6S5J7CDPL5H4HEXWKYNYEQ/m/pom.xml:
TEXT must be immediately followed by END_TAG and not START_TAG (position: START_TAG seen ...<surefire.version>2.21.0<surefire.version>...
@72:47)  @ line 72, column 47 -> [Help 2]
[linux-jdk10] [ERROR] 
[linux-jdk10] [ERROR] To see the full stack trace of the errors, re-run Maven with the -e
switch.
[linux-jdk10] [ERROR] Re-run Maven using the -X switch to enable full debug logging.
[linux-jdk10] [ERROR] 
[linux-jdk10] [ERROR] For more information about the errors and possible solutions, please
read the following articles:
[linux-jdk10] [ERROR] [Help 1] http://cwiki.apache.org/confluence/display/MAVEN/ProjectBuildingException
[linux-jdk10] [ERROR] [Help 2] http://cwiki.apache.org/confluence/display/MAVEN/ModelParseException
[linux-jdk10] Sending interrupt signal to process
[Pipeline] [linux-jdk8] // stage
[Pipeline] [linux-jdk9] // dir
[Pipeline] [windows-jdk7] // node
[Pipeline] [windows-jdk8] // node
[Pipeline] [windows-jdk9] // node
[Pipeline] [windows-jdk10] // node
[Pipeline] [windows-jdk7] }
[windows-jdk7] Failed in branch windows-jdk7
[Pipeline] [windows-jdk8] }
[windows-jdk8] Failed in branch windows-jdk8
[Pipeline] [windows-jdk9] }
[windows-jdk9] Failed in branch windows-jdk9
[Pipeline] [windows-jdk10] }
[windows-jdk10] Failed in branch windows-jdk10
[Pipeline] [linux-jdk8] }
[Pipeline] [linux-jdk9] }
[Pipeline] [linux-jdk8] // node
[Pipeline] [linux-jdk9] // withMaven
[Pipeline] [linux-jdk8] }
[Pipeline] [linux-jdk9] echo
[linux-jdk9] [FAIL FAST] linux-jdk7 had first failure, ignoring script returned exit code
1
[Pipeline] [linux-jdk9] }
[Pipeline] [linux-jdk10] }
[Pipeline] [linux-jdk9] // stage
[Pipeline] [linux-jdk10] // dir
[Pipeline] [linux-jdk9] }
[Pipeline] [linux-jdk10] }
[Pipeline] [linux-jdk9] // node
[Pipeline] [linux-jdk10] // withMaven
[Pipeline] [linux-jdk9] }
[Pipeline] [linux-jdk10] echo
[linux-jdk10] [FAIL FAST] linux-jdk7 had first failure, ignoring script returned exit code
1
[Pipeline] [linux-jdk10] }
[Pipeline] [linux-jdk10] // stage
[Pipeline] [linux-jdk10] }
[Pipeline] [linux-jdk10] // node
[Pipeline] [linux-jdk10] }
[Pipeline] // parallel
[Pipeline] echo
***** FAST FAILURE *****

Fast failure triggered by linux-jdk7

***** FAST FAILURE *****
[Pipeline] stage
[Pipeline] { (Notifications)
[Pipeline] echo
Build result: FAILURE
[Pipeline] jiraIssueSelector
[Pipeline] emailext
Mime
  • Unnamed multipart/mixed (inline, None, 0 bytes)
View raw message