maven-notifications mailing list archives

Site index · List index
Message view « Date » · « Thread »
Top « Date » · « Thread »
From Apache Jenkins Server <jenk...@builds.apache.org>
Subject Build failed in Jenkins: Maven TLP » maven-project-info-reports-plugin » MPIR-366 #15
Date Fri, 13 Apr 2018 11:16:20 GMT
See https://builds.apache.org/job/maven-box/job/maven-project-info-reports-plugin/job/MPIR-366/15/

Changes:

* [MPIR-366] Drop Maven 2 support
* [MPIR-366] Drop Maven 2 support
* [MPIR-366] Drop Maven 2 support
* [MPIR-366] Drop Maven 2 support

All tests passed

Build log:
[...truncated 335.74 KB...]
[windows-jdk8] [INFO] Downloading: https://repo.maven.apache.org/maven2/com/google/guava/guava-parent/18.0/guava-parent-18.0.pom
[windows-jdk8] [INFO] Downloaded: https://repo.maven.apache.org/maven2/com/google/guava/guava-parent/18.0/guava-parent-18.0.pom
(7.7 kB at 640 kB/s)
[windows-jdk8] [INFO] Downloading: https://repo.maven.apache.org/maven2/org/apache/maven/shared/maven-shared-resources/2/maven-shared-resources-2.jar
[windows-jdk8] [INFO] Downloading: https://repo.maven.apache.org/maven2/org/codehaus/plexus/plexus-resources/1.0.1/plexus-resources-1.0.1.jar
[windows-jdk8] [INFO] Downloading: https://repo.maven.apache.org/maven2/com/puppycrawl/tools/checkstyle/6.1.1/checkstyle-6.1.1.jar
[windows-jdk8] [INFO] Downloading: https://repo.maven.apache.org/maven2/org/antlr/antlr4-runtime/4.3/antlr4-runtime-4.3.jar
[windows-jdk8] [INFO] Downloading: https://repo.maven.apache.org/maven2/org/abego/treelayout/org.abego.treelayout.core/1.0.1/org.abego.treelayout.core-1.0.1.jar
[windows-jdk8] [INFO] Downloaded: https://repo.maven.apache.org/maven2/com/puppycrawl/tools/checkstyle/6.1.1/checkstyle-6.1.1.jar
(1.0 MB at 18 MB/s)
[windows-jdk8] [INFO] Downloading: https://repo.maven.apache.org/maven2/org/antlr/antlr4-annotations/4.3/antlr4-annotations-4.3.jar
[windows-jdk8] [INFO] Downloaded: https://repo.maven.apache.org/maven2/org/antlr/antlr4-runtime/4.3/antlr4-runtime-4.3.jar
(345 kB at 5.0 MB/s)
[windows-jdk8] [INFO] Downloading: https://repo.maven.apache.org/maven2/commons-beanutils/commons-beanutils-core/1.8.3/commons-beanutils-core-1.8.3.jar
[windows-jdk8] [INFO] Downloaded: https://repo.maven.apache.org/maven2/org/apache/maven/shared/maven-shared-resources/2/maven-shared-resources-2.jar
(13 kB at 147 kB/s)
[windows-jdk8] [INFO] Downloading: https://repo.maven.apache.org/maven2/com/google/guava/guava/18.0/guava-18.0.jar
[windows-jdk8] [INFO] Downloaded: https://repo.maven.apache.org/maven2/commons-beanutils/commons-beanutils-core/1.8.3/commons-beanutils-core-1.8.3.jar
(207 kB at 2.3 MB/s)
[windows-jdk8] [INFO] Downloaded: https://repo.maven.apache.org/maven2/org/antlr/antlr4-annotations/4.3/antlr4-annotations-4.3.jar
(10 kB at 101 kB/s)
[windows-jdk8] [INFO] Downloaded: https://repo.maven.apache.org/maven2/org/codehaus/plexus/plexus-resources/1.0.1/plexus-resources-1.0.1.jar
(22 kB at 160 kB/s)
[windows-jdk8] [INFO] Downloaded: https://repo.maven.apache.org/maven2/org/abego/treelayout/org.abego.treelayout.core/1.0.1/org.abego.treelayout.core-1.0.1.jar
(26 kB at 178 kB/s)
[windows-jdk8] [INFO] Downloaded: https://repo.maven.apache.org/maven2/com/google/guava/guava/18.0/guava-18.0.jar
(2.3 MB at 12 MB/s)
[windows-jdk8] [INFO] There are 10 errors reported by Checkstyle 6.1.1 with config/maven_checks.xml
ruleset.
[windows-jdk8] [INFO] Ignored 10 errors, 0 violation remaining.
[windows-jdk8] [INFO] 
[windows-jdk8] [INFO] --- maven-jarsigner-plugin:1.3.2:verify (verify) @ maven-project-info-reports-plugin
---
[windows-jdk8] [WARNING] Picked up JAVA_TOOL_OPTIONS: -Dmaven.ext.class.path="f:\jenkins\jenkins-slave\workspace\nfo-reports-plugin_MPIR-366-S464FI4ATSVOULE3N7MCKV5FYYG6GVHDD7OLISMYBGUEPLQM2UNA@tmp\withMaven1ee3135a\pipeline-maven-spy.jar"
-Dorg.jenkinsci.plugins.pipeline.maven.reportsFolder="f:\jenkins\jenkins-slave\workspace\nfo-reports-plugin_MPIR-366-S464FI4ATSVOULE3N7MCKV5FYYG6GVHDD7OLISMYBGUEPLQM2UNA@tmp\withMaven1ee3135a"

[windows-jdk8] [INFO] 1 archive(s) processed
[windows-jdk8] [INFO] 
[windows-jdk8] [INFO] --- maven-invoker-plugin:2.0.0:verify (integration-test) @ maven-project-info-reports-plugin
---
[windows-jdk8] [INFO] -------------------------------------------------
[windows-jdk8] [INFO] Build Summary:
[windows-jdk8] [INFO]   Passed: 11, Failed: 0, Errors: 0, Skipped: 0
[windows-jdk8] [INFO] -------------------------------------------------
[windows-jdk8] [INFO] ------------------------------------------------------------------------
[windows-jdk8] [INFO] BUILD SUCCESS
[windows-jdk8] [INFO] ------------------------------------------------------------------------
[windows-jdk8] [INFO] Total time: 02:19 min
[windows-jdk8] [INFO] Finished at: 2018-04-13T11:14:59Z
[windows-jdk8] [INFO] Final Memory: 61M/1092M
[windows-jdk8] [INFO] ------------------------------------------------------------------------
[windows-jdk8] [INFO] [jenkins-event-spy] Generated F:\jenkins\jenkins-slave\workspace\nfo-reports-plugin_MPIR-366-S464FI4ATSVOULE3N7MCKV5FYYG6GVHDD7OLISMYBGUEPLQM2UNA@tmp\withMaven1ee3135a\maven-spy-20180413-111238-9854994914738742482771.log
[windows-jdk8] Picked up JAVA_TOOL_OPTIONS: -Dmaven.ext.class.path="f:\jenkins\jenkins-slave\workspace\nfo-reports-plugin_MPIR-366-S464FI4ATSVOULE3N7MCKV5FYYG6GVHDD7OLISMYBGUEPLQM2UNA@tmp\withMaven1ee3135a\pipeline-maven-spy.jar"
-Dorg.jenkinsci.plugins.pipeline.maven.reportsFolder="f:\jenkins\jenkins-slave\workspace\nfo-reports-plugin_MPIR-366-S464FI4ATSVOULE3N7MCKV5FYYG6GVHDD7OLISMYBGUEPLQM2UNA@tmp\withMaven1ee3135a"

[Pipeline] [windows-jdk8] }
[Pipeline] [windows-jdk8] // dir
[windows-jdk7] [INFO] run script verify.groovy
[windows-jdk7] [INFO] ..SUCCESS (7.1 s)
[windows-jdk7] [INFO] Building: minimal-pom\pom.xml
[windows-jdk7] [INFO] run script verify.bsh
[windows-jdk7] [INFO] ..SUCCESS (14.6 s)
[windows-jdk7] [INFO] Building: mpir-229\pom.xml
[windows-jdk7] [INFO] run script verify.groovy
[windows-jdk7] [INFO] ..SUCCESS (7.4 s)
[windows-jdk7] [INFO] Building: MPIR-242\pom.xml
[windows-jdk7] [INFO] run script verify.groovy
[windows-jdk7] [INFO] ..SUCCESS (7.3 s)
[windows-jdk7] [INFO] Building: MPIR-251\pom.xml
[windows-jdk9] [INFO] run script verify.bsh
[windows-jdk9] [INFO] ..SUCCESS (82.3 s)
[windows-jdk9] [INFO] Building: git\pom.xml
[windows-jdk9] [INFO] ..SUCCESS (10.5 s)
[windows-jdk9] [INFO] Building: java-version\pom.xml
[windows-jdk10] [INFO] run script verify.groovy
[windows-jdk10] [INFO] ..SUCCESS (16.6 s)
[windows-jdk10] [INFO] Building: MPIR-300\pom.xml
[windows-jdk10] [INFO] run script verify.groovy
[windows-jdk10] [INFO] ..SUCCESS (8.2 s)
[windows-jdk10] [INFO] Building: MPIR-349\parent\pom.xml
[windows-jdk10] [INFO] run script verify.groovy
[windows-jdk10] [INFO] ..SUCCESS (15.0 s)
[windows-jdk10] [INFO] Building: multi-module\pom.xml
[windows-jdk9] [INFO] run script verify.groovy
[windows-jdk9] [INFO] ..SUCCESS (9.8 s)
[windows-jdk9] [INFO] Building: minimal-pom\pom.xml
[windows-jdk7] [INFO] run script verify.groovy
[windows-jdk7] [INFO] ..SUCCESS (13.5 s)
[windows-jdk7] [INFO] Building: MPIR-300\pom.xml
[windows-jdk7] [INFO] run script verify.groovy
[windows-jdk7] [INFO] ..SUCCESS (7.1 s)
[windows-jdk7] [INFO] Building: MPIR-349\parent\pom.xml
[Pipeline] [windows-jdk8] }
[windows-jdk8] [withMaven] junitPublisher - Archive test results for Maven artifact org.apache.maven.plugins:maven-project-info-reports-plugin:2.10-SNAPSHOT
generated by maven-surefire-plugin:test (default-test): m\target\surefire-reports\*.xml
[windows-jdk8] [withMaven] junitPublisher - Jenkins JUnit Attachments Plugin not found, can't
publish test attachments.Recording test results
[windows-jdk8] [withMaven] junitPublisher - Archive test results for Maven artifact org.apache.maven.plugins.project-info-reports.its:dep:1.0-SNAPSHOT
generated by maven-surefire-plugin:test (default-test): m\target\it\multi-module\dep\target\surefire-reports\*.xml
[windows-jdk8] [withMaven] junitPublisher - Jenkins JUnit Attachments Plugin not found, can't
publish test attachments.Recording test results
[windows-jdk8] None of the test reports contained any result
[windows-jdk8] [withMaven] junitPublisher - Archive test results for Maven artifact org.apache.maven.plugins.project-info-reports.its:main:1.0-SNAPSHOT
generated by maven-surefire-plugin:test (default-test): m\target\it\multi-module\main\target\surefire-reports\*.xml
[windows-jdk8] [withMaven] junitPublisher - Jenkins JUnit Attachments Plugin not found, can't
publish test attachments.Recording test results
[windows-jdk8] None of the test reports contained any result
[Pipeline] [windows-jdk8] // withMaven
[Pipeline] [windows-jdk8] }
[Pipeline] [windows-jdk8] // stage
[Pipeline] [windows-jdk8] }
[Pipeline] [windows-jdk8] // node
[Pipeline] [windows-jdk8] }
[windows-jdk10] [INFO] ..FAILED (23.9 s)
[windows-jdk10] [INFO]   The build exited with code 1. See f:\jenkins\jenkins-slave\workspace\nfo-reports-plugin_MPIR-366-S464FI4ATSVOULE3N7MCKV5FYYG6GVHDD7OLISMYBGUEPLQM2UNA@2\m\target\it\multi-module\build.log
for details.
[windows-jdk10] [INFO] 
[windows-jdk10] [INFO] --- maven-checkstyle-plugin:2.15:check (checkstyle-check) @ maven-project-info-reports-plugin
---
[windows-jdk10] [INFO] Downloading: https://repo.maven.apache.org/maven2/org/apache/maven/shared/maven-shared-resources/2/maven-shared-resources-2.pom
[windows-jdk10] [INFO] Downloaded: https://repo.maven.apache.org/maven2/org/apache/maven/shared/maven-shared-resources/2/maven-shared-resources-2.pom
(3.0 kB at 227 kB/s)
[windows-jdk10] [INFO] Downloading: https://repo.maven.apache.org/maven2/org/codehaus/plexus/plexus-utils/3.0.10/plexus-utils-3.0.10.pom
[windows-jdk10] [INFO] Downloaded: https://repo.maven.apache.org/maven2/org/codehaus/plexus/plexus-utils/3.0.10/plexus-utils-3.0.10.pom
(3.1 kB at 314 kB/s)
[windows-jdk10] [INFO] Downloading: https://repo.maven.apache.org/maven2/org/codehaus/plexus/plexus-resources/1.0.1/plexus-resources-1.0.1.pom
[windows-jdk10] [INFO] Downloaded: https://repo.maven.apache.org/maven2/org/codehaus/plexus/plexus-resources/1.0.1/plexus-resources-1.0.1.pom
(1.3 kB at 101 kB/s)
[windows-jdk10] [INFO] Downloading: https://repo.maven.apache.org/maven2/com/puppycrawl/tools/checkstyle/6.1.1/checkstyle-6.1.1.pom
[windows-jdk10] [INFO] Downloaded: https://repo.maven.apache.org/maven2/com/puppycrawl/tools/checkstyle/6.1.1/checkstyle-6.1.1.pom
(30 kB at 2.8 MB/s)
[windows-jdk10] [INFO] Downloading: https://repo.maven.apache.org/maven2/org/sonatype/oss/oss-parent/7/oss-parent-7.pom
[windows-jdk10] [INFO] Downloaded: https://repo.maven.apache.org/maven2/org/sonatype/oss/oss-parent/7/oss-parent-7.pom
(4.8 kB at 322 kB/s)
[windows-jdk10] [INFO] Downloading: https://repo.maven.apache.org/maven2/org/antlr/antlr4-runtime/4.3/antlr4-runtime-4.3.pom
[windows-jdk10] [INFO] Downloaded: https://repo.maven.apache.org/maven2/org/antlr/antlr4-runtime/4.3/antlr4-runtime-4.3.pom
(4.8 kB at 90 kB/s)
[windows-jdk10] [INFO] Downloading: https://repo.maven.apache.org/maven2/org/antlr/antlr4-master/4.3/antlr4-master-4.3.pom
[windows-jdk10] [INFO] Downloaded: https://repo.maven.apache.org/maven2/org/antlr/antlr4-master/4.3/antlr4-master-4.3.pom
(7.9 kB at 283 kB/s)
[windows-jdk10] [INFO] Downloading: https://repo.maven.apache.org/maven2/org/abego/treelayout/org.abego.treelayout.core/1.0.1/org.abego.treelayout.core-1.0.1.pom
[windows-jdk10] [INFO] Downloaded: https://repo.maven.apache.org/maven2/org/abego/treelayout/org.abego.treelayout.core/1.0.1/org.abego.treelayout.core-1.0.1.pom
(3.1 kB at 103 kB/s)
[windows-jdk10] [INFO] Downloading: https://repo.maven.apache.org/maven2/org/antlr/antlr4-annotations/4.3/antlr4-annotations-4.3.pom
[windows-jdk10] [INFO] Downloaded: https://repo.maven.apache.org/maven2/org/antlr/antlr4-annotations/4.3/antlr4-annotations-4.3.pom
(1.3 kB at 141 kB/s)
[windows-jdk10] [INFO] Downloading: https://repo.maven.apache.org/maven2/commons-beanutils/commons-beanutils-core/1.8.3/commons-beanutils-core-1.8.3.pom
[windows-jdk10] [INFO] Downloaded: https://repo.maven.apache.org/maven2/commons-beanutils/commons-beanutils-core/1.8.3/commons-beanutils-core-1.8.3.pom
(1.6 kB at 205 kB/s)
[windows-jdk10] [INFO] Downloading: https://repo.maven.apache.org/maven2/com/google/guava/guava/18.0/guava-18.0.pom
[windows-jdk10] [INFO] Downloaded: https://repo.maven.apache.org/maven2/com/google/guava/guava/18.0/guava-18.0.pom
(5.7 kB at 708 kB/s)
[windows-jdk10] [INFO] Downloading: https://repo.maven.apache.org/maven2/com/google/guava/guava-parent/18.0/guava-parent-18.0.pom
[windows-jdk10] [INFO] Downloaded: https://repo.maven.apache.org/maven2/com/google/guava/guava-parent/18.0/guava-parent-18.0.pom
(7.7 kB at 452 kB/s)
[windows-jdk10] [INFO] Downloading: https://repo.maven.apache.org/maven2/com/puppycrawl/tools/checkstyle/6.1.1/checkstyle-6.1.1.jar
[windows-jdk10] [INFO] Downloading: https://repo.maven.apache.org/maven2/org/antlr/antlr4-runtime/4.3/antlr4-runtime-4.3.jar
[windows-jdk10] [INFO] Downloading: https://repo.maven.apache.org/maven2/org/codehaus/plexus/plexus-resources/1.0.1/plexus-resources-1.0.1.jar
[windows-jdk10] [INFO] Downloading: https://repo.maven.apache.org/maven2/org/abego/treelayout/org.abego.treelayout.core/1.0.1/org.abego.treelayout.core-1.0.1.jar
[windows-jdk10] [INFO] Downloaded: https://repo.maven.apache.org/maven2/com/puppycrawl/tools/checkstyle/6.1.1/checkstyle-6.1.1.jar
(1.0 MB at 9.9 MB/s)
[windows-jdk10] [INFO] Downloading: https://repo.maven.apache.org/maven2/org/antlr/antlr4-annotations/4.3/antlr4-annotations-4.3.jar
[windows-jdk10] [INFO] Downloading: https://repo.maven.apache.org/maven2/org/apache/maven/shared/maven-shared-resources/2/maven-shared-resources-2.jar
[windows-jdk10] [INFO] Downloaded: https://repo.maven.apache.org/maven2/org/antlr/antlr4-annotations/4.3/antlr4-annotations-4.3.jar
(10 kB at 89 kB/s)
[windows-jdk10] [INFO] Downloading: https://repo.maven.apache.org/maven2/commons-beanutils/commons-beanutils-core/1.8.3/commons-beanutils-core-1.8.3.jar
[windows-jdk10] [INFO] Downloaded: https://repo.maven.apache.org/maven2/org/antlr/antlr4-runtime/4.3/antlr4-runtime-4.3.jar
(345 kB at 2.6 MB/s)
[windows-jdk10] [INFO] Downloading: https://repo.maven.apache.org/maven2/com/google/guava/guava/18.0/guava-18.0.jar
[windows-jdk10] [INFO] Downloaded: https://repo.maven.apache.org/maven2/commons-beanutils/commons-beanutils-core/1.8.3/commons-beanutils-core-1.8.3.jar
(207 kB at 763 kB/s)
[windows-jdk10] [INFO] Downloaded: https://repo.maven.apache.org/maven2/org/apache/maven/shared/maven-shared-resources/2/maven-shared-resources-2.jar
(13 kB at 47 kB/s)
[windows-jdk10] [INFO] Downloaded: https://repo.maven.apache.org/maven2/org/codehaus/plexus/plexus-resources/1.0.1/plexus-resources-1.0.1.jar
(22 kB at 71 kB/s)
[windows-jdk10] [INFO] Downloaded: https://repo.maven.apache.org/maven2/org/abego/treelayout/org.abego.treelayout.core/1.0.1/org.abego.treelayout.core-1.0.1.jar
(26 kB at 83 kB/s)
[windows-jdk10] [INFO] Downloaded: https://repo.maven.apache.org/maven2/com/google/guava/guava/18.0/guava-18.0.jar
(2.3 MB at 7.2 MB/s)
[windows-jdk10] [INFO] There are 10 errors reported by Checkstyle 6.1.1 with config/maven_checks.xml
ruleset.
[windows-jdk10] [INFO] Ignored 10 errors, 0 violation remaining.
[windows-jdk10] [INFO] 
[windows-jdk10] [INFO] --- maven-jarsigner-plugin:1.3.2:verify (verify) @ maven-project-info-reports-plugin
---
[windows-jdk10] [WARNING] Picked up JAVA_TOOL_OPTIONS: -Dmaven.ext.class.path="f:\jenkins\jenkins-slave\workspace\nfo-reports-plugin_MPIR-366-S464FI4ATSVOULE3N7MCKV5FYYG6GVHDD7OLISMYBGUEPLQM2UNA@2@tmp\withMavenbd1f3328\pipeline-maven-spy.jar"
-Dorg.jenkinsci.plugins.pipeline.maven.reportsFolder="f:\jenkins\jenkins-slave\workspace\nfo-reports-plugin_MPIR-366-S464FI4ATSVOULE3N7MCKV5FYYG6GVHDD7OLISMYBGUEPLQM2UNA@2@tmp\withMavenbd1f3328"

[windows-jdk9] [INFO] run script verify.bsh
[windows-jdk9] [INFO] ..SUCCESS (18.3 s)
[windows-jdk9] [INFO] Building: mpir-229\pom.xml
[windows-jdk10] [INFO] 1 archive(s) processed
[windows-jdk10] [INFO] 
[windows-jdk10] [INFO] --- maven-invoker-plugin:2.0.0:verify (integration-test) @ maven-project-info-reports-plugin
---
[windows-jdk10] [INFO] -------------------------------------------------
[windows-jdk10] [INFO] Build Summary:
[windows-jdk10] [INFO]   Passed: 4, Failed: 7, Errors: 0, Skipped: 0
[windows-jdk10] [INFO] -------------------------------------------------
[windows-jdk10] [ERROR] The following builds failed:
[windows-jdk10] [ERROR] *  dependencies-java-1.7-and-1.8\pom.xml
[windows-jdk10] [ERROR] *  full-pom\pom.xml
[windows-jdk10] [ERROR] *  git\pom.xml
[windows-jdk10] [ERROR] *  minimal-pom\pom.xml
[windows-jdk10] [ERROR] *  mpir-229\pom.xml
[windows-jdk10] [ERROR] *  MPIR-242\pom.xml
[windows-jdk10] [ERROR] *  multi-module\pom.xml
[windows-jdk10] [INFO] -------------------------------------------------
[windows-jdk10] [INFO] ------------------------------------------------------------------------
[windows-jdk10] [INFO] BUILD FAILURE
[windows-jdk10] [INFO] ------------------------------------------------------------------------
[windows-jdk10] [INFO] Total time: 03:19 min
[windows-jdk10] [INFO] Finished at: 2018-04-13T11:16:01Z
[windows-jdk10] [INFO] Final Memory: 46M/160M
[windows-jdk10] [INFO] ------------------------------------------------------------------------
[windows-jdk10] [INFO] [jenkins-event-spy] Generated F:\jenkins\jenkins-slave\workspace\nfo-reports-plugin_MPIR-366-S464FI4ATSVOULE3N7MCKV5FYYG6GVHDD7OLISMYBGUEPLQM2UNA@2@tmp\withMavenbd1f3328\maven-spy-20180413-111241-38213302192481786826134.log
[windows-jdk10] [ERROR] Failed to execute goal org.apache.maven.plugins:maven-invoker-plugin:2.0.0:verify
(integration-test) on project maven-project-info-reports-plugin: 7 builds failed. See console
output above for details. -> [Help 1]
[windows-jdk10] [ERROR] 
[windows-jdk10] [ERROR] To see the full stack trace of the errors, re-run Maven with the -e
switch.
[windows-jdk10] [ERROR] Re-run Maven using the -X switch to enable full debug logging.
[windows-jdk10] [ERROR] 
[windows-jdk10] [ERROR] For more information about the errors and possible solutions, please
read the following articles:
[windows-jdk10] [ERROR] [Help 1] http://cwiki.apache.org/confluence/display/MAVEN/MojoFailureException
[Pipeline] [windows-jdk10] }
[Pipeline] [windows-jdk10] // dir
[windows-jdk7] [INFO] run script verify.groovy
[windows-jdk7] [INFO] ..SUCCESS (13.9 s)
[windows-jdk7] [INFO] Building: multi-module\pom.xml
[Pipeline] [windows-jdk10] }
[windows-jdk10] [withMaven] junitPublisher - Archive test results for Maven artifact org.apache.maven.plugins:maven-project-info-reports-plugin:2.10-SNAPSHOT
generated by maven-surefire-plugin:test (default-test): m\target\surefire-reports\*.xml
[windows-jdk10] [withMaven] junitPublisher - Jenkins JUnit Attachments Plugin not found, can't
publish test attachments.Recording test results
[windows-jdk10] [withMaven] junitPublisher - Archive test results for Maven artifact org.apache.maven.plugins.project-info-reports.its:dep:1.0-SNAPSHOT
generated by maven-surefire-plugin:test (default-test): m\target\it\multi-module\dep\target\surefire-reports\*.xml
[windows-jdk10] [withMaven] junitPublisher - Jenkins JUnit Attachments Plugin not found, can't
publish test attachments.Recording test results
[windows-jdk10] None of the test reports contained any result
[windows-jdk10] [withMaven] junitPublisher - Archive test results for Maven artifact org.apache.maven.plugins.project-info-reports.its:main:1.0-SNAPSHOT
generated by maven-surefire-plugin:test (default-test): m\target\it\multi-module\main\target\surefire-reports\*.xml
[windows-jdk10] [withMaven] junitPublisher - Jenkins JUnit Attachments Plugin not found, can't
publish test attachments.Recording test results
[windows-jdk10] None of the test reports contained any result
[Pipeline] [windows-jdk10] // withMaven
[Pipeline] [windows-jdk10] echo
[windows-jdk10] [FAIL FAST] This is the first failure and likely root cause
[Pipeline] [windows-jdk10] }
[Pipeline] [windows-jdk10] // stage
[Pipeline] [windows-jdk10] }
[Pipeline] [windows-jdk10] // node
[Pipeline] [windows-jdk10] }
[windows-jdk7] Sending interrupt signal to process
[windows-jdk10] Failed in branch windows-jdk10
[windows-jdk9] Sending interrupt signal to process
[Pipeline] [linux-jdk7] // node
[Pipeline] [linux-jdk8] // node
[Pipeline] [linux-jdk9] // node
[Pipeline] [linux-jdk10] // node
[Pipeline] [linux-jdk7] }
[linux-jdk7] Failed in branch linux-jdk7
[Pipeline] [linux-jdk8] }
[linux-jdk8] Failed in branch linux-jdk8
[Pipeline] [linux-jdk9] }
[linux-jdk9] Failed in branch linux-jdk9
[Pipeline] [linux-jdk10] }
[linux-jdk10] Failed in branch linux-jdk10
[Pipeline] [windows-jdk7] }
[Pipeline] [windows-jdk7] // dir
[Pipeline] [windows-jdk7] }
[windows-jdk7] [withMaven] One or multiple Maven executions have been ignored by the Jenkins
Pipeline Maven Plugin because they have been interrupted before completion (1). See Pipeline
Maven Plugin FAQ for more details.
[Pipeline] [windows-jdk7] // withMaven
[Pipeline] [windows-jdk7] echo
[windows-jdk7] [FAIL FAST] windows-jdk10 had first failure, ignoring script returned exit
code -1
[Pipeline] [windows-jdk7] }
[Pipeline] [windows-jdk7] // stage
[Pipeline] [windows-jdk7] }
[Pipeline] [windows-jdk7] // node
[Pipeline] [windows-jdk7] }
[windows-jdk9] After 10s process did not stop
[Pipeline] [windows-jdk9] }
[Pipeline] [windows-jdk9] // dir
[Pipeline] [windows-jdk9] }
[windows-jdk9] [withMaven] One or multiple Maven executions have been ignored by the Jenkins
Pipeline Maven Plugin because they have been interrupted before completion (2). See Pipeline
Maven Plugin FAQ for more details.
[Pipeline] [windows-jdk9] // withMaven
[Pipeline] [windows-jdk9] echo
[windows-jdk9] [FAIL FAST] windows-jdk10 had first failure, ignoring null
[Pipeline] [windows-jdk9] }
[Pipeline] [windows-jdk9] // stage
[Pipeline] [windows-jdk9] }
[Pipeline] [windows-jdk9] // node
[Pipeline] [windows-jdk9] }
[Pipeline] // parallel
[Pipeline] echo
***** FAST FAILURE *****

Fast failure triggered by windows-jdk10

***** FAST FAILURE *****
[Pipeline] stage
[Pipeline] { (Notifications)
[Pipeline] echo
Build result: FAILURE
[Pipeline] jiraIssueSelector
[Pipeline] jiraComment
Mime
  • Unnamed multipart/mixed (inline, None, 0 bytes)
View raw message