maven-notifications mailing list archives

Site index · List index
Message view « Date » · « Thread »
Top « Date » · « Thread »
From Apache Jenkins Server <jenk...@builds.apache.org>
Subject Build failed in Jenkins: Maven TLP » maven-checkstyle-plugin » master #16
Date Sat, 07 Apr 2018 16:45:02 GMT
See https://builds.apache.org/job/maven-box/job/maven-checkstyle-plugin/job/master/16/

Changes:

* [MCHECKSTYLE-350] Lock version of animal-sniffer-maven-plugin
* [MCHECKSTYLE-350] Lock version of animal-sniffer-maven-plugin
* [MCHECKSTYLE-350] Lock version of animal-sniffer-maven-plugin
* [MCHECKSTYLE-350] Lock version of animal-sniffer-maven-plugin
* [MCHECKSTYLE-350] Lock version of animal-sniffer-maven-plugin
* [MCHECKSTYLE-350] Lock version of animal-sniffer-maven-plugin
* [MCHECKSTYLE-350] Lock version of animal-sniffer-maven-plugin
* [MCHECKSTYLE-350] Lock version of animal-sniffer-maven-plugin

No tests ran.

Build log:
[...truncated 111.68 KB...]
[linux-jdk10] [INFO] java-annotations mojo extractor found 4 mojo descriptors.
[linux-jdk10] [INFO] 
[linux-jdk10] [INFO] --- animal-sniffer-maven-plugin:1.16:check (check-java-compatibility)
@ maven-checkstyle-plugin ---
[linux-jdk10] [INFO] Checking unresolved references to org.codehaus.mojo.signature:java17:1.0
[windows-jdk9] [INFO] Tests run: 10, Failures: 0, Errors: 0, Skipped: 0, Time elapsed: 6.917
s - in org.apache.maven.plugins.checkstyle.CheckstyleReportTest
[windows-jdk9] [INFO] Running org.apache.maven.plugins.checkstyle.CheckstyleViolationCheckMojoTest
[windows-jdk9] [WARNING] checkstyle:check violations detected but failOnViolation set to false
[windows-jdk9] [INFO] Unable to perform checkstyle:check, unable to find checkstyle:checkstyle
outputFile.
[windows-jdk9] [INFO] There are 5 errors reported by Checkstyle 6.18 with sun_checks.xml ruleset.
[windows-jdk9] [WARNING] checkstyle:check violations detected but failOnViolation set to false
[windows-jdk9] [INFO] Tests run: 6, Failures: 0, Errors: 0, Skipped: 0, Time elapsed: 0.784
s - in org.apache.maven.plugins.checkstyle.CheckstyleViolationCheckMojoTest
[windows-jdk9] [INFO] Running org.apache.maven.plugins.checkstyle.exec.CheckstyleReportListenerMultiSourceTest
[windows-jdk9] [INFO] Tests run: 1, Failures: 0, Errors: 0, Skipped: 0, Time elapsed: 0.001
s - in org.apache.maven.plugins.checkstyle.exec.CheckstyleReportListenerMultiSourceTest
[windows-jdk9] [INFO] Running org.apache.maven.plugins.checkstyle.exec.CheckstyleReportListenerTest
[windows-jdk9] [INFO] Tests run: 1, Failures: 0, Errors: 0, Skipped: 0, Time elapsed: 0 s
- in org.apache.maven.plugins.checkstyle.exec.CheckstyleReportListenerTest
[windows-jdk9] [INFO] Running org.apache.maven.plugins.checkstyle.exec.CheckstyleResultsTest
[windows-jdk9] [INFO] Tests run: 2, Failures: 0, Errors: 0, Skipped: 0, Time elapsed: 0 s
- in org.apache.maven.plugins.checkstyle.exec.CheckstyleResultsTest
[windows-jdk9] [INFO] Running org.apache.maven.plugins.checkstyle.ReportResourceTest
[windows-jdk9] [INFO] Tests run: 3, Failures: 0, Errors: 0, Skipped: 0, Time elapsed: 0 s
- in org.apache.maven.plugins.checkstyle.ReportResourceTest
[windows-jdk9] [INFO] Running org.apache.maven.plugins.checkstyle.RuleUtilTest
[windows-jdk9] [INFO] Tests run: 4, Failures: 0, Errors: 0, Skipped: 0, Time elapsed: 0 s
- in org.apache.maven.plugins.checkstyle.RuleUtilTest
[windows-jdk9] [INFO] 
[windows-jdk9] [INFO] Results:
[windows-jdk9] [INFO] 
[windows-jdk9] [INFO] Tests run: 27, Failures: 0, Errors: 0, Skipped: 0
[windows-jdk9] [INFO] 
[windows-jdk9] [INFO] 
[windows-jdk9] [INFO] --- maven-jar-plugin:3.0.2:jar (default-jar) @ maven-checkstyle-plugin
---
[linux-jdk8] [INFO] There are 5 errors reported by Checkstyle 6.18 with sun_checks.xml ruleset.
[linux-jdk8] [INFO] There are 5 errors reported by Checkstyle 6.18 with sun_checks.xml ruleset.
[linux-jdk8] [INFO] There are 5 errors reported by Checkstyle 6.18 with sun_checks.xml ruleset.
[linux-jdk8] [INFO] There are 5 errors reported by Checkstyle 6.18 with sun_checks.xml ruleset.
[linux-jdk8] [INFO] There are 5 errors reported by Checkstyle 6.18 with sun_checks.xml ruleset.
[windows-jdk8] [INFO] 
[windows-jdk8] [INFO] --- maven-surefire-plugin:2.21.0:test (default-test) @ maven-checkstyle-plugin
---
[windows-jdk8] [INFO] 
[windows-jdk8] [INFO] -------------------------------------------------------
[windows-jdk8] [INFO]  T E S T S
[windows-jdk8] [INFO] -------------------------------------------------------
[windows-jdk8] [INFO] Running org.apache.maven.plugins.checkstyle.CheckstyleReportTest
[linux-jdk10] [INFO] 
[linux-jdk10] [INFO] --- plexus-component-metadata:1.7.1:generate-metadata (default) @ maven-checkstyle-plugin
---
[windows-jdk9] [INFO] Building jar: f:\jenkins\jenkins-slave\workspace\en-checkstyle-plugin_master-6DNBLC4MMIUMS5G3LAT6DLZEJTJFDWHANNB7EQVCGNVHOCTJQXVA\m\target\maven-checkstyle-plugin-3.0.1-SNAPSHOT.jar
[windows-jdk9] [INFO] 
[windows-jdk9] [INFO] --- maven-plugin-plugin:3.5:addPluginArtifactMetadata (default-addPluginArtifactMetadata)
@ maven-checkstyle-plugin ---
[windows-jdk9] [INFO] 
[windows-jdk9] [INFO] --- maven-site-plugin:3.7:attach-descriptor (attach-descriptor) @ maven-checkstyle-plugin
---
[windows-jdk9] [INFO] Skipping because packaging 'maven-plugin' is not pom.
[windows-jdk9] [INFO] 
[windows-jdk9] [INFO] --- maven-invoker-plugin:3.0.1:install (integration-test) @ maven-checkstyle-plugin
---
[linux-jdk8] [INFO] There are 5 errors reported by Checkstyle 6.18 with sun_checks.xml ruleset.
[linux-jdk10] [INFO] Discovered 3 component descriptors(s)
[linux-jdk10] [INFO] 
[linux-jdk10] [INFO] --- maven-resources-plugin:3.0.2:testResources (default-testResources)
@ maven-checkstyle-plugin ---
[linux-jdk10] [INFO] Using 'UTF-8' encoding to copy filtered resources.
[linux-jdk10] [INFO] skip non existing resourceDirectory /home/jenkins/jenkins-slave/workspace/en-checkstyle-plugin_master-6DNBLC4MMIUMS5G3LAT6DLZEJTJFDWHANNB7EQVCGNVHOCTJQXVA/m/src/test/resources
[linux-jdk10] [INFO] Copying 3 resources
[linux-jdk10] [INFO] 
[linux-jdk10] [INFO] --- maven-compiler-plugin:3.7.0:testCompile (default-testCompile) @ maven-checkstyle-plugin
---
[linux-jdk10] [INFO] Changes detected - recompiling the module!
[linux-jdk10] [INFO] Compiling 12 source files to /home/jenkins/jenkins-slave/workspace/en-checkstyle-plugin_master-6DNBLC4MMIUMS5G3LAT6DLZEJTJFDWHANNB7EQVCGNVHOCTJQXVA/m/target/test-classes
[linux-jdk10] [INFO] 
[linux-jdk10] [INFO] --- maven-surefire-plugin:2.21.0:test (default-test) @ maven-checkstyle-plugin
---
[linux-jdk10] [INFO] 
[linux-jdk10] [INFO] -------------------------------------------------------
[linux-jdk10] [INFO]  T E S T S
[linux-jdk10] [INFO] -------------------------------------------------------
[linux-jdk8] [INFO] There are 5 errors reported by Checkstyle 6.18 with sun_checks.xml ruleset.
[linux-jdk8] [INFO] Tests run: 10, Failures: 0, Errors: 0, Skipped: 0, Time elapsed: 5.558
s - in org.apache.maven.plugins.checkstyle.CheckstyleReportTest
[linux-jdk8] [INFO] 
[linux-jdk8] [INFO] Results:
[linux-jdk8] [INFO] 
[linux-jdk8] [INFO] Tests run: 27, Failures: 0, Errors: 0, Skipped: 0
[linux-jdk8] [INFO] 
[linux-jdk8] [INFO] 
[linux-jdk8] [INFO] --- maven-jar-plugin:3.0.2:jar (default-jar) @ maven-checkstyle-plugin
---
[linux-jdk8] [INFO] Building jar: /home/jenkins/jenkins-slave/workspace/en-checkstyle-plugin_master-6DNBLC4MMIUMS5G3LAT6DLZEJTJFDWHANNB7EQVCGNVHOCTJQXVA/m/target/maven-checkstyle-plugin-3.0.1-SNAPSHOT.jar
[linux-jdk8] [INFO] 
[linux-jdk8] [INFO] --- maven-plugin-plugin:3.5:addPluginArtifactMetadata (default-addPluginArtifactMetadata)
@ maven-checkstyle-plugin ---
[linux-jdk8] [INFO] 
[linux-jdk8] [INFO] --- maven-site-plugin:3.7:attach-descriptor (attach-descriptor) @ maven-checkstyle-plugin
---
[linux-jdk10] [INFO] Running org.apache.maven.plugins.checkstyle.CheckstyleReportTest
[linux-jdk8] [INFO] Skipping because packaging 'maven-plugin' is not pom.
[linux-jdk8] [INFO] 
[linux-jdk8] [INFO] --- maven-invoker-plugin:3.0.1:install (integration-test) @ maven-checkstyle-plugin
---
[linux-jdk8] [INFO] Installing /home/jenkins/jenkins-slave/workspace/en-checkstyle-plugin_master-6DNBLC4MMIUMS5G3LAT6DLZEJTJFDWHANNB7EQVCGNVHOCTJQXVA/m/pom.xml
to /home/jenkins/jenkins-slave/workspace/en-checkstyle-plugin_master-6DNBLC4MMIUMS5G3LAT6DLZEJTJFDWHANNB7EQVCGNVHOCTJQXVA/m/target/local-repo/org/apache/maven/plugins/maven-checkstyle-plugin/3.0.1-SNAPSHOT/maven-checkstyle-plugin-3.0.1-SNAPSHOT.pom
[linux-jdk8] [INFO] Installing /home/jenkins/jenkins-slave/workspace/en-checkstyle-plugin_master-6DNBLC4MMIUMS5G3LAT6DLZEJTJFDWHANNB7EQVCGNVHOCTJQXVA/m/target/maven-checkstyle-plugin-3.0.1-SNAPSHOT.jar
to /home/jenkins/jenkins-slave/workspace/en-checkstyle-plugin_master-6DNBLC4MMIUMS5G3LAT6DLZEJTJFDWHANNB7EQVCGNVHOCTJQXVA/m/target/local-repo/org/apache/maven/plugins/maven-checkstyle-plugin/3.0.1-SNAPSHOT/maven-checkstyle-plugin-3.0.1-SNAPSHOT.jar
[linux-jdk8] [INFO] 
[linux-jdk8] [INFO] --- maven-invoker-plugin:3.0.1:integration-test (integration-test) @ maven-checkstyle-plugin
---
[linux-jdk8] [INFO] Running Setup Jobs
[linux-jdk8] [INFO] Building: MCHECKSTYLE-173-without-charset/pom.xml
[windows-jdk9] [INFO] Installing f:\jenkins\jenkins-slave\workspace\en-checkstyle-plugin_master-6DNBLC4MMIUMS5G3LAT6DLZEJTJFDWHANNB7EQVCGNVHOCTJQXVA\m\pom.xml
to f:\jenkins\jenkins-slave\workspace\en-checkstyle-plugin_master-6DNBLC4MMIUMS5G3LAT6DLZEJTJFDWHANNB7EQVCGNVHOCTJQXVA\m\target\local-repo\org\apache\maven\plugins\maven-checkstyle-plugin\3.0.1-SNAPSHOT\maven-checkstyle-plugin-3.0.1-SNAPSHOT.pom
[windows-jdk9] [INFO] Installing f:\jenkins\jenkins-slave\workspace\en-checkstyle-plugin_master-6DNBLC4MMIUMS5G3LAT6DLZEJTJFDWHANNB7EQVCGNVHOCTJQXVA\m\target\maven-checkstyle-plugin-3.0.1-SNAPSHOT.jar
to f:\jenkins\jenkins-slave\workspace\en-checkstyle-plugin_master-6DNBLC4MMIUMS5G3LAT6DLZEJTJFDWHANNB7EQVCGNVHOCTJQXVA\m\target\local-repo\org\apache\maven\plugins\maven-checkstyle-plugin\3.0.1-SNAPSHOT\maven-checkstyle-plugin-3.0.1-SNAPSHOT.jar
[windows-jdk9] [INFO] 
[windows-jdk9] [INFO] --- maven-invoker-plugin:3.0.1:integration-test (integration-test) @
maven-checkstyle-plugin ---
[windows-jdk8] [INFO] There are 5 errors reported by Checkstyle 6.18 with sun_checks.xml ruleset.
[linux-jdk10] [INFO] There are 5 errors reported by Checkstyle 6.18 with sun_checks.xml ruleset.
[windows-jdk9] [INFO] Running Setup Jobs
[windows-jdk8] [INFO] There are 5 errors reported by Checkstyle 6.18 with sun_checks.xml ruleset.
[linux-jdk10] [INFO] There are 5 errors reported by Checkstyle 6.18 with sun_checks.xml ruleset.
[linux-jdk10] [INFO] Starting audit...
[linux-jdk10] [WARN] /home/jenkins/jenkins-slave/workspace/en-checkstyle-plugin_master-6DNBLC4MMIUMS5G3LAT6DLZEJTJFDWHANNB7EQVCGNVHOCTJQXVA/m/src/test/test-sources/TestJavaObject.java:21:
'method def modifier' have incorrect indentation level 4, expected level should be 2. [Indentation]
[linux-jdk10] [WARN] /home/jenkins/jenkins-slave/workspace/en-checkstyle-plugin_master-6DNBLC4MMIUMS5G3LAT6DLZEJTJFDWHANNB7EQVCGNVHOCTJQXVA/m/src/test/test-sources/TestJavaObject.java:23:
'method def rcurly' have incorrect indentation level 4, expected level should be 2. [Indentation]
[linux-jdk10] [WARN] /home/jenkins/jenkins-slave/workspace/en-checkstyle-plugin_master-6DNBLC4MMIUMS5G3LAT6DLZEJTJFDWHANNB7EQVCGNVHOCTJQXVA/m/src/test/test-sources/TestJavaObject.java:25:
'method def modifier' have incorrect indentation level 4, expected level should be 2. [Indentation]
[linux-jdk10] [WARN] /home/jenkins/jenkins-slave/workspace/en-checkstyle-plugin_master-6DNBLC4MMIUMS5G3LAT6DLZEJTJFDWHANNB7EQVCGNVHOCTJQXVA/m/src/test/test-sources/TestJavaObject.java:27:
'method def rcurly' have incorrect indentation level 4, expected level should be 2. [Indentation]
[linux-jdk10] Audit done.
[windows-jdk9] [INFO] Building: check-fail\pom.xml
[windows-jdk8] [INFO] Starting audit...
[windows-jdk8] [WARN] F:\jenkins\jenkins-slave\workspace\en-checkstyle-plugin_master-6DNBLC4MMIUMS5G3LAT6DLZEJTJFDWHANNB7EQVCGNVHOCTJQXVA\m\src\test\test-sources\TestJavaObject.java:21:
'method def modifier' have incorrect indentation level 4, expected level should be 2. [Indentation]
[windows-jdk8] [WARN] F:\jenkins\jenkins-slave\workspace\en-checkstyle-plugin_master-6DNBLC4MMIUMS5G3LAT6DLZEJTJFDWHANNB7EQVCGNVHOCTJQXVA\m\src\test\test-sources\TestJavaObject.java:23:
'method def rcurly' have incorrect indentation level 4, expected level should be 2. [Indentation]
[windows-jdk8] [WARN] F:\jenkins\jenkins-slave\workspace\en-checkstyle-plugin_master-6DNBLC4MMIUMS5G3LAT6DLZEJTJFDWHANNB7EQVCGNVHOCTJQXVA\m\src\test\test-sources\TestJavaObject.java:25:
'method def modifier' have incorrect indentation level 4, expected level should be 2. [Indentation]
[windows-jdk8] [WARN] F:\jenkins\jenkins-slave\workspace\en-checkstyle-plugin_master-6DNBLC4MMIUMS5G3LAT6DLZEJTJFDWHANNB7EQVCGNVHOCTJQXVA\m\src\test\test-sources\TestJavaObject.java:27:
'method def rcurly' have incorrect indentation level 4, expected level should be 2. [Indentation]
[windows-jdk8] Audit done.
[linux-jdk10] [INFO] Starting audit...
[linux-jdk10] [WARN] /home/jenkins/jenkins-slave/workspace/en-checkstyle-plugin_master-6DNBLC4MMIUMS5G3LAT6DLZEJTJFDWHANNB7EQVCGNVHOCTJQXVA/m/src/test/test-sources/TestJavaObject.java:21:
'method def modifier' have incorrect indentation level 4, expected level should be 2. [Indentation]
[linux-jdk10] [WARN] /home/jenkins/jenkins-slave/workspace/en-checkstyle-plugin_master-6DNBLC4MMIUMS5G3LAT6DLZEJTJFDWHANNB7EQVCGNVHOCTJQXVA/m/src/test/test-sources/TestJavaObject.java:23:
'method def rcurly' have incorrect indentation level 4, expected level should be 2. [Indentation]
[linux-jdk10] [WARN] /home/jenkins/jenkins-slave/workspace/en-checkstyle-plugin_master-6DNBLC4MMIUMS5G3LAT6DLZEJTJFDWHANNB7EQVCGNVHOCTJQXVA/m/src/test/test-sources/TestJavaObject.java:25:
'method def modifier' have incorrect indentation level 4, expected level should be 2. [Indentation]
[linux-jdk10] [WARN] /home/jenkins/jenkins-slave/workspace/en-checkstyle-plugin_master-6DNBLC4MMIUMS5G3LAT6DLZEJTJFDWHANNB7EQVCGNVHOCTJQXVA/m/src/test/test-sources/TestJavaObject.java:27:
'method def rcurly' have incorrect indentation level 4, expected level should be 2. [Indentation]
[linux-jdk10] Audit done.
[linux-jdk10] [INFO] There are 5 errors reported by Checkstyle 6.18 with sun_checks.xml ruleset.
[windows-jdk8] [INFO] Starting audit...
[windows-jdk8] [WARN] F:\jenkins\jenkins-slave\workspace\en-checkstyle-plugin_master-6DNBLC4MMIUMS5G3LAT6DLZEJTJFDWHANNB7EQVCGNVHOCTJQXVA\m\src\test\test-sources\TestJavaObject.java:21:
'method def modifier' have incorrect indentation level 4, expected level should be 2. [Indentation]
[windows-jdk8] [WARN] F:\jenkins\jenkins-slave\workspace\en-checkstyle-plugin_master-6DNBLC4MMIUMS5G3LAT6DLZEJTJFDWHANNB7EQVCGNVHOCTJQXVA\m\src\test\test-sources\TestJavaObject.java:23:
'method def rcurly' have incorrect indentation level 4, expected level should be 2. [Indentation]
[windows-jdk8] [WARN] F:\jenkins\jenkins-slave\workspace\en-checkstyle-plugin_master-6DNBLC4MMIUMS5G3LAT6DLZEJTJFDWHANNB7EQVCGNVHOCTJQXVA\m\src\test\test-sources\TestJavaObject.java:25:
'method def modifier' have incorrect indentation level 4, expected level should be 2. [Indentation]
[windows-jdk8] [WARN] F:\jenkins\jenkins-slave\workspace\en-checkstyle-plugin_master-6DNBLC4MMIUMS5G3LAT6DLZEJTJFDWHANNB7EQVCGNVHOCTJQXVA\m\src\test\test-sources\TestJavaObject.java:27:
'method def rcurly' have incorrect indentation level 4, expected level should be 2. [Indentation]
[windows-jdk8] Audit done.
[linux-jdk10] [INFO] There are 5 errors reported by Checkstyle 6.18 with sun_checks.xml ruleset.
[linux-jdk10] [INFO] There are 5 errors reported by Checkstyle 6.18 with sun_checks.xml ruleset.
[linux-jdk10] [INFO] There are 5 errors reported by Checkstyle 6.18 with sun_checks.xml ruleset.
[windows-jdk8] [INFO] There are 5 errors reported by Checkstyle 6.18 with sun_checks.xml ruleset.
[linux-jdk10] [INFO] There are 5 errors reported by Checkstyle 6.18 with sun_checks.xml ruleset.
[linux-jdk10] [INFO] There are 5 errors reported by Checkstyle 6.18 with sun_checks.xml ruleset.
[linux-jdk10] [INFO] There are 5 errors reported by Checkstyle 6.18 with sun_checks.xml ruleset.
[linux-jdk10] [INFO] There are 5 errors reported by Checkstyle 6.18 with sun_checks.xml ruleset.
[linux-jdk8] Sending interrupt signal to process
[windows-jdk8] [INFO] There are 5 errors reported by Checkstyle 6.18 with sun_checks.xml ruleset.
[linux-jdk10] [INFO] There are 5 errors reported by Checkstyle 6.18 with sun_checks.xml ruleset.
[linux-jdk10] [INFO] There are 5 errors reported by Checkstyle 6.18 with sun_checks.xml ruleset.
[linux-jdk10] [INFO] Tests run: 10, Failures: 0, Errors: 0, Skipped: 0, Time elapsed: 7.811
s - in org.apache.maven.plugins.checkstyle.CheckstyleReportTest
[linux-jdk10] [INFO] Running org.apache.maven.plugins.checkstyle.ReportResourceTest
[linux-jdk8] [INFO]           MCHECKSTYLE-173-without-charset/pom.xml .......... FAILED (6.3
s)
[linux-jdk8] [INFO]   The build exited with code 143. See /home/jenkins/jenkins-slave/workspace/en-checkstyle-plugin_master-6DNBLC4MMIUMS5G3LAT6DLZEJTJFDWHANNB7EQVCGNVHOCTJQXVA/m/target/it/MCHECKSTYLE-173-without-charset/build.log
for details.
[linux-jdk8] [INFO] Building: MCHECKSTYLE-260-testSourceDirectories/pom.xml
[windows-jdk8] [INFO] There are 5 errors reported by Checkstyle 6.18 with sun_checks.xml ruleset.
[windows-jdk8] [INFO] There are 5 errors reported by Checkstyle 6.18 with sun_checks.xml ruleset.
[linux-jdk10] [INFO] Tests run: 3, Failures: 0, Errors: 0, Skipped: 0, Time elapsed: 0 s -
in org.apache.maven.plugins.checkstyle.ReportResourceTest
[linux-jdk10] [INFO] Running org.apache.maven.plugins.checkstyle.CheckstyleViolationCheckMojoTest
[linux-jdk10] [INFO] Unable to perform checkstyle:check, unable to find checkstyle:checkstyle
outputFile.
[linux-jdk10] [INFO] There are 5 errors reported by Checkstyle 6.18 with sun_checks.xml ruleset.
[linux-jdk10] [WARNING] checkstyle:check violations detected but failOnViolation set to false
[linux-jdk10] Sending interrupt signal to process
[linux-jdk8] Terminated
[windows-jdk8] [INFO] There are 5 errors reported by Checkstyle 6.18 with sun_checks.xml ruleset.
[windows-jdk8] Sending interrupt signal to process
[linux-jdk10] [WARNING] checkstyle:check violations detected but failOnViolation set to false
[linux-jdk10] [INFO] Tests run: 6, Failures: 0, Errors: 0, Skipped: 0, Time elapsed: 0.709
s - in org.apache.maven.plugins.checkstyle.CheckstyleViolationCheckMojoTest
[linux-jdk10] [INFO] Running org.apache.maven.plugins.checkstyle.RuleUtilTest
[linux-jdk10] [INFO] Tests run: 4, Failures: 0, Errors: 0, Skipped: 0, Time elapsed: 0 s -
in org.apache.maven.plugins.checkstyle.RuleUtilTest
[linux-jdk10] [INFO] Running org.apache.maven.plugins.checkstyle.exec.CheckstyleResultsTest
[linux-jdk10] [INFO] Tests run: 2, Failures: 0, Errors: 0, Skipped: 0, Time elapsed: 0 s -
in org.apache.maven.plugins.checkstyle.exec.CheckstyleResultsTest
[linux-jdk10] [INFO] Running org.apache.maven.plugins.checkstyle.exec.CheckstyleReportListenerMultiSourceTest
[linux-jdk10] [INFO] Tests run: 1, Failures: 0, Errors: 0, Skipped: 0, Time elapsed: 0 s -
in org.apache.maven.plugins.checkstyle.exec.CheckstyleReportListenerMultiSourceTest
[linux-jdk10] [INFO] Running org.apache.maven.plugins.checkstyle.exec.CheckstyleReportListenerTest
[linux-jdk10] [INFO] Tests run: 1, Failures: 0, Errors: 0, Skipped: 0, Time elapsed: 0 s -
in org.apache.maven.plugins.checkstyle.exec.CheckstyleReportListenerTest
[linux-jdk10] [INFO] 
[linux-jdk10] [INFO] Results:
[linux-jdk10] [INFO] 
[linux-jdk10] [INFO] Tests run: 27, Failures: 0, Errors: 0, Skipped: 0
[linux-jdk10] [INFO] 
[linux-jdk10] [INFO] 
[linux-jdk10] [INFO] --- maven-jar-plugin:3.0.2:jar (default-jar) @ maven-checkstyle-plugin
---
[windows-jdk9] Sending interrupt signal to process
[Pipeline] [windows-jdk7] // node
[Pipeline] [windows-jdk10] // node
[Pipeline] [windows-jdk7] }
[Pipeline] [windows-jdk10] }
[Pipeline] [linux-jdk8] }
[Pipeline] [linux-jdk7] }
[Pipeline] [linux-jdk10] }
[Pipeline] [windows-jdk9] }
[Pipeline] [linux-jdk8] // dir
[Pipeline] [linux-jdk7] // dir
[Pipeline] [linux-jdk10] // dir
[Pipeline] [linux-jdk8] }
[linux-jdk8] [withMaven] One or multiple Maven executions have been ignored by the Jenkins
Pipeline Maven Plugin because they have been interrupted before completion (1). See Pipeline
Maven Plugin FAQ for more details.
[Pipeline] [linux-jdk7] }
[linux-jdk7] [withMaven] One or multiple Maven executions have been ignored by the Jenkins
Pipeline Maven Plugin because they have been interrupted before completion (1). See Pipeline
Maven Plugin FAQ for more details.
[Pipeline] [linux-jdk10] }
[linux-jdk10] [withMaven] One or multiple Maven executions have been ignored by the Jenkins
Pipeline Maven Plugin because they have been interrupted before completion (1). See Pipeline
Maven Plugin FAQ for more details.
[Pipeline] [windows-jdk9] // dir
[Pipeline] [windows-jdk9] }
[windows-jdk9] [withMaven] One or multiple Maven executions have been ignored by the Jenkins
Pipeline Maven Plugin because they have been interrupted before completion (1). See Pipeline
Maven Plugin FAQ for more details.
[Pipeline] [linux-jdk8] // withMaven
[Pipeline] [linux-jdk7] // withMaven
[Pipeline] [linux-jdk10] // withMaven
[Pipeline] [linux-jdk8] echo
[linux-jdk8] [FAIL FAST] linux-jdk9 had first failure, ignoring script returned exit code
143
[Pipeline] [linux-jdk8] }
[Pipeline] [linux-jdk7] echo
[linux-jdk7] [FAIL FAST] linux-jdk9 had first failure, ignoring null
[Pipeline] [linux-jdk7] }
[Pipeline] [linux-jdk10] echo
[linux-jdk10] [FAIL FAST] linux-jdk9 had first failure, ignoring script returned exit code
143
[Pipeline] [linux-jdk10] }
[Pipeline] [windows-jdk9] // withMaven
[Pipeline] [windows-jdk9] }
[Pipeline] [linux-jdk8] // stage
[Pipeline] [linux-jdk7] // stage
[Pipeline] [linux-jdk10] // stage
[Pipeline] [linux-jdk8] }
[Pipeline] [linux-jdk7] }
[Pipeline] [linux-jdk10] }
[Pipeline] [windows-jdk9] // stage
[Pipeline] [windows-jdk9] }
[Pipeline] [linux-jdk8] // node
[Pipeline] [linux-jdk7] // node
[Pipeline] [linux-jdk10] // node
[Pipeline] [linux-jdk7] }
[Pipeline] [linux-jdk8] }
[Pipeline] [linux-jdk10] }
[Pipeline] [windows-jdk9] // node
[Pipeline] [windows-jdk9] }
[windows-jdk8] After 10s process did not stop
[Pipeline] [windows-jdk8] }
[Pipeline] [windows-jdk8] // dir
[Pipeline] [windows-jdk8] }
[windows-jdk8] [withMaven] One or multiple Maven executions have been ignored by the Jenkins
Pipeline Maven Plugin because they have been interrupted before completion (1). See Pipeline
Maven Plugin FAQ for more details.
[Pipeline] [windows-jdk8] // withMaven
[Pipeline] [windows-jdk8] echo
[windows-jdk8] [FAIL FAST] linux-jdk9 had first failure, ignoring null
[Pipeline] [windows-jdk8] }
[Pipeline] [windows-jdk8] // stage
[Pipeline] [windows-jdk8] }
[Pipeline] [windows-jdk8] // node
[Pipeline] [windows-jdk8] }
[Pipeline] // parallel
[Pipeline] echo
***** FAST FAILURE *****

Fast failure triggered by linux-jdk9

***** FAST FAILURE *****
[Pipeline] stage
[Pipeline] { (Notifications)
[Pipeline] echo
Build result: FAILURE
[Pipeline] jiraIssueSelector
[Pipeline] jiraComment
[Pipeline] emailext
Mime
  • Unnamed multipart/mixed (inline, None, 0 bytes)
View raw message