maven-notifications mailing list archives

Site index · List index
Message view « Date » · « Thread »
Top « Date » · « Thread »
From Apache Jenkins Server <jenk...@builds.apache.org>
Subject Build unstable in Jenkins: Maven TLP » maven-javadoc-plugin » MJAVADOC-521 #8
Date Sun, 01 Apr 2018 17:34:44 GMT
See https://builds.apache.org/job/maven-box/job/maven-javadoc-plugin/job/MJAVADOC-521/8/

Changes:

* WIP - [MJAVADOC-521] - Added github information.
* WIP - [MJAVADOC-521] - Added github information.
* WIP - [MJAVADOC-521] - Added github information.
* WIP - [MJAVADOC-521] - Added github information.

18 tests failed.
FAILED:  org.apache.maven.plugins.javadoc.FixJavadocMojoTest.testFix

Error Message:
null

Stack Trace:
java.lang.NullPointerException
	at org.apache.maven.plugins.javadoc.FixJavadocMojoTest.executeMojoAndTest(FixJavadocMojoTest.java:622)
	at org.apache.maven.plugins.javadoc.FixJavadocMojoTest.testFix(FixJavadocMojoTest.java:141)


FAILED:  org.apache.maven.plugins.javadoc.FixJavadocMojoTest.testRemoveUnknownExceptions

Error Message:
null

Stack Trace:
java.lang.NullPointerException
	at org.apache.maven.plugins.javadoc.FixJavadocMojoTest.testRemoveUnknownExceptions(FixJavadocMojoTest.java:576)


FAILED:  org.apache.maven.plugins.javadoc.FixJavadocMojoTest.testFix

Error Message:
null

Stack Trace:
java.lang.NullPointerException
	at org.apache.maven.plugins.javadoc.FixJavadocMojoTest.executeMojoAndTest(FixJavadocMojoTest.java:622)
	at org.apache.maven.plugins.javadoc.FixJavadocMojoTest.testFix(FixJavadocMojoTest.java:141)


FAILED:  org.apache.maven.plugins.javadoc.FixJavadocMojoTest.testRemoveUnknownExceptions

Error Message:
null

Stack Trace:
java.lang.NullPointerException
	at org.apache.maven.plugins.javadoc.FixJavadocMojoTest.testRemoveUnknownExceptions(FixJavadocMojoTest.java:576)


FAILED:  org.apache.maven.plugins.javadoc.JavadocReportTest.testTagletArtifacts

Error Message:
expected:<20> but was:<0>

Stack Trace:
junit.framework.AssertionFailedError: expected:<20> but was:<0>
	at org.apache.maven.plugins.javadoc.JavadocReportTest.testTagletArtifacts(JavadocReportTest.java:1044)


FAILED:  org.apache.maven.plugins.javadoc.JavadocReportTest.testTaglets

Error Message:
An error has occurred in Javadoc report generation: 
Exit code: 1 - Picked up JAVA_TOOL_OPTIONS: -Dmaven.ext.class.path="/home/jenkins/jenkins-slave/workspace/javadoc-plugin_MJAVADOC-521-4VCCRI6KPRH73A3RWPEXQVQHXBYIUVYDLQPEN3Z2IPPUYMQWLG3Q@tmp/withMaven938d700a/pipeline-maven-spy.jar" -Dorg.jenkinsci.plugins.pipeline.maven.reportsFolder="/home/jenkins/jenkins-slave/workspace/javadoc-plugin_MJAVADOC-521-4VCCRI6KPRH73A3RWPEXQVQHXBYIUVYDLQPEN3Z2IPPUYMQWLG3Q@tmp/withMaven938d700a" 
javadoc: error - An internal exception has occurred. 
 (java.lang.NoClassDefFoundError: com/sun/tools/doclets/Taglet)
Please file a bug against the javadoc tool via the Java bug reporting page
(http://bugreport.java.com) after checking the Bug Database (http://bugs.java.com)
for duplicates. Include error messages and the following diagnostic in your report. Thank you.
java.lang.NoClassDefFoundError: com/sun/tools/doclets/Taglet
 at java.base/java.lang.ClassLoader.defineClass1(Native Method)
 at java.base/java.lang.ClassLoader.defineClass(ClassLoader.java:1009)
 at java.base/java.security.SecureClassLoader.defineClass(SecureClassLoader.java:174)
 at java.base/java.net.URLClassLoader.defineClass(URLClassLoader.java:545)
 at java.base/java.net.URLClassLoader.access$100(URLClassLoader.java:83)
 at java.base/java.net.URLClassLoader$1.run(URLClassLoader.java:453)
 at java.base/java.net.URLClassLoader$1.run(URLClassLoader.java:447)
 at java.base/java.security.AccessController.doPrivileged(Native Method)
 at java.base/java.net.URLClassLoader.findClass(URLClassLoader.java:446)
 at java.base/java.lang.ClassLoader.loadClass(ClassLoader.java:566)
 at java.base/java.lang.ClassLoader.loadClass(ClassLoader.java:499)
 at java.base/java.lang.ClassLoader.defineClass1(Native Method)
 at java.base/java.lang.ClassLoader.defineClass(ClassLoader.java:1009)
 at java.base/java.security.SecureClassLoader.defineClass(SecureClassLoader.java:174)
 at java.base/java.net.URLClassLoader.defineClass(URLClassLoader.java:545)
 at java.base/java.net.URLClassLoader.access$100(URLClassLoader.java:83)
 at java.base/java.net.URLClassLoader$1.run(URLClassLoader.java:453)
 at java.base/java.net.URLClassLoader$1.run(URLClassLoader.java:447)
 at java.base/java.security.AccessController.doPrivileged(Native Method)
 at java.base/java.net.URLClassLoader.findClass(URLClassLoader.java:446)
 at java.base/java.lang.ClassLoader.loadClass(ClassLoader.java:566)
 at java.base/java.lang.ClassLoader.loadClass(ClassLoader.java:499)
 at jdk.javadoc/jdk.javadoc.internal.doclets.toolkit.taglets.TagletManager.addCustomTag(TagletManager.java:262)
 at jdk.javadoc/jdk.javadoc.internal.doclets.toolkit.BaseConfiguration.initTagletManager(BaseConfiguration.java:786)
 at jdk.javadoc/jdk.javadoc.internal.doclets.toolkit.BaseConfiguration.finishOptionSettings0(BaseConfiguration.java:726)
 at jdk.javadoc/jdk.javadoc.internal.doclets.formats.html.HtmlConfiguration.finishOptionSettings0(HtmlConfiguration.java:867)
 at jdk.javadoc/jdk.javadoc.internal.doclets.toolkit.BaseConfiguration.setOptions(BaseConfiguration.java:747)
 at jdk.javadoc/jdk.javadoc.internal.doclets.toolkit.AbstractDoclet.startGeneration(AbstractDoclet.java:204)
 at jdk.javadoc/jdk.javadoc.internal.doclets.toolkit.AbstractDoclet.run(AbstractDoclet.java:117)
 at jdk.javadoc/jdk.javadoc.doclet.StandardDoclet.run(StandardDoclet.java:72)
 at jdk.javadoc/jdk.javadoc.internal.tool.Start.parseAndExecute(Start.java:581)
 at jdk.javadoc/jdk.javadoc.internal.tool.Start.begin(Start.java:430)
 at jdk.javadoc/jdk.javadoc.internal.tool.Start.begin(Start.java:343)
 at jdk.javadoc/jdk.javadoc.internal.tool.Main.execute(Main.java:63)
 at jdk.javadoc/jdk.javadoc.internal.tool.Main.main(Main.java:52)
Caused by: java.lang.ClassNotFoundException: com.sun.tools.doclets.Taglet
 at java.base/java.net.URLClassLoader.findClass(URLClassLoader.java:466)
 at java.base/java.lang.ClassLoader.loadClass(ClassLoader.java:566)
 at java.base/java.lang.ClassLoader.loadClass(ClassLoader.java:499)
 ... 35 more

Command line was: /home/jenkins/tools/java/latest10/bin/javadoc @options @argfile

Refer to the generated Javadoc files in '/home/jenkins/jenkins-slave/workspace/javadoc-plugin_MJAVADOC-521-4VCCRI6KPRH73A3RWPEXQVQHXBYIUVYDLQPEN3Z2IPPUYMQWLG3Q/m/target/test/unit/taglet-test/target/site/apidocs' dir.


Stack Trace:
org.apache.maven.plugin.MojoExecutionException: 
An error has occurred in Javadoc report generation: 
Exit code: 1 - Picked up JAVA_TOOL_OPTIONS: -Dmaven.ext.class.path="/home/jenkins/jenkins-slave/workspace/javadoc-plugin_MJAVADOC-521-4VCCRI6KPRH73A3RWPEXQVQHXBYIUVYDLQPEN3Z2IPPUYMQWLG3Q@tmp/withMaven938d700a/pipeline-maven-spy.jar" -Dorg.jenkinsci.plugins.pipeline.maven.reportsFolder="/home/jenkins/jenkins-slave/workspace/javadoc-plugin_MJAVADOC-521-4VCCRI6KPRH73A3RWPEXQVQHXBYIUVYDLQPEN3Z2IPPUYMQWLG3Q@tmp/withMaven938d700a" 
javadoc: error - An internal exception has occurred. 
	(java.lang.NoClassDefFoundError: com/sun/tools/doclets/Taglet)
Please file a bug against the javadoc tool via the Java bug reporting page
(http://bugreport.java.com) after checking the Bug Database (http://bugs.java.com)
for duplicates. Include error messages and the following diagnostic in your report. Thank you.
java.lang.NoClassDefFoundError: com/sun/tools/doclets/Taglet
	at java.base/java.lang.ClassLoader.defineClass1(Native Method)
	at java.base/java.lang.ClassLoader.defineClass(ClassLoader.java:1009)
	at java.base/java.security.SecureClassLoader.defineClass(SecureClassLoader.java:174)
	at java.base/java.net.URLClassLoader.defineClass(URLClassLoader.java:545)
	at java.base/java.net.URLClassLoader.access$100(URLClassLoader.java:83)
	at java.base/java.net.URLClassLoader$1.run(URLClassLoader.java:453)
	at java.base/java.net.URLClassLoader$1.run(URLClassLoader.java:447)
	at java.base/java.security.AccessController.doPrivileged(Native Method)
	at java.base/java.net.URLClassLoader.findClass(URLClassLoader.java:446)
	at java.base/java.lang.ClassLoader.loadClass(ClassLoader.java:566)
	at java.base/java.lang.ClassLoader.loadClass(ClassLoader.java:499)
	at java.base/java.lang.ClassLoader.defineClass1(Native Method)
	at java.base/java.lang.ClassLoader.defineClass(ClassLoader.java:1009)
	at java.base/java.security.SecureClassLoader.defineClass(SecureClassLoader.java:174)
	at java.base/java.net.URLClassLoader.defineClass(URLClassLoader.java:545)
	at java.base/java.net.URLClassLoader.access$100(URLClassLoader.java:83)
	at java.base/java.net.URLClassLoader$1.run(URLClassLoader.java:453)
	at java.base/java.net.URLClassLoader$1.run(URLClassLoader.java:447)
	at java.base/java.security.AccessController.doPrivileged(Native Method)
	at java.base/java.net.URLClassLoader.findClass(URLClassLoader.java:446)
	at java.base/java.lang.ClassLoader.loadClass(ClassLoader.java:566)
	at java.base/java.lang.ClassLoader.loadClass(ClassLoader.java:499)
	at jdk.javadoc/jdk.javadoc.internal.doclets.toolkit.taglets.TagletManager.addCustomTag(TagletManager.java:262)
	at jdk.javadoc/jdk.javadoc.internal.doclets.toolkit.BaseConfiguration.initTagletManager(BaseConfiguration.java:786)
	at jdk.javadoc/jdk.javadoc.internal.doclets.toolkit.BaseConfiguration.finishOptionSettings0(BaseConfiguration.java:726)
	at jdk.javadoc/jdk.javadoc.internal.doclets.formats.html.HtmlConfiguration.finishOptionSettings0(HtmlConfiguration.java:867)
	at jdk.javadoc/jdk.javadoc.internal.doclets.toolkit.BaseConfiguration.setOptions(BaseConfiguration.java:747)
	at jdk.javadoc/jdk.javadoc.internal.doclets.toolkit.AbstractDoclet.startGeneration(AbstractDoclet.java:204)
	at jdk.javadoc/jdk.javadoc.internal.doclets.toolkit.AbstractDoclet.run(AbstractDoclet.java:117)
	at jdk.javadoc/jdk.javadoc.doclet.StandardDoclet.run(StandardDoclet.java:72)
	at jdk.javadoc/jdk.javadoc.internal.tool.Start.parseAndExecute(Start.java:581)
	at jdk.javadoc/jdk.javadoc.internal.tool.Start.begin(Start.java:430)
	at jdk.javadoc/jdk.javadoc.internal.tool.Start.begin(Start.java:343)
	at jdk.javadoc/jdk.javadoc.internal.tool.Main.execute(Main.java:63)
	at jdk.javadoc/jdk.javadoc.internal.tool.Main.main(Main.java:52)
Caused by: java.lang.ClassNotFoundException: com.sun.tools.doclets.Taglet
	at java.base/java.net.URLClassLoader.findClass(URLClassLoader.java:466)
	at java.base/java.lang.ClassLoader.loadClass(ClassLoader.java:566)
	at java.base/java.lang.ClassLoader.loadClass(ClassLoader.java:499)
	... 35 more

Command line was: /home/jenkins/tools/java/latest10/bin/javadoc @options @argfile

Refer to the generated Javadoc files in '/home/jenkins/jenkins-slave/workspace/javadoc-plugin_MJAVADOC-521-4VCCRI6KPRH73A3RWPEXQVQHXBYIUVYDLQPEN3Z2IPPUYMQWLG3Q/m/target/test/unit/taglet-test/target/site/apidocs' dir.

	at org.apache.maven.plugins.javadoc.JavadocReportTest.testTaglets(JavadocReportTest.java:559)
Caused by: org.apache.maven.reporting.MavenReportException: 

Exit code: 1 - Picked up JAVA_TOOL_OPTIONS: -Dmaven.ext.class.path="/home/jenkins/jenkins-slave/workspace/javadoc-plugin_MJAVADOC-521-4VCCRI6KPRH73A3RWPEXQVQHXBYIUVYDLQPEN3Z2IPPUYMQWLG3Q@tmp/withMaven938d700a/pipeline-maven-spy.jar" -Dorg.jenkinsci.plugins.pipeline.maven.reportsFolder="/home/jenkins/jenkins-slave/workspace/javadoc-plugin_MJAVADOC-521-4VCCRI6KPRH73A3RWPEXQVQHXBYIUVYDLQPEN3Z2IPPUYMQWLG3Q@tmp/withMaven938d700a" 
javadoc: error - An internal exception has occurred. 
	(java.lang.NoClassDefFoundError: com/sun/tools/doclets/Taglet)
Please file a bug against the javadoc tool via the Java bug reporting page
(http://bugreport.java.com) after checking the Bug Database (http://bugs.java.com)
for duplicates. Include error messages and the following diagnostic in your report. Thank you.
java.lang.NoClassDefFoundError: com/sun/tools/doclets/Taglet
	at java.base/java.lang.ClassLoader.defineClass1(Native Method)
	at java.base/java.lang.ClassLoader.defineClass(ClassLoader.java:1009)
	at java.base/java.security.SecureClassLoader.defineClass(SecureClassLoader.java:174)
	at java.base/java.net.URLClassLoader.defineClass(URLClassLoader.java:545)
	at java.base/java.net.URLClassLoader.access$100(URLClassLoader.java:83)
	at java.base/java.net.URLClassLoader$1.run(URLClassLoader.java:453)
	at java.base/java.net.URLClassLoader$1.run(URLClassLoader.java:447)
	at java.base/java.security.AccessController.doPrivileged(Native Method)
	at java.base/java.net.URLClassLoader.findClass(URLClassLoader.java:446)
	at java.base/java.lang.ClassLoader.loadClass(ClassLoader.java:566)
	at java.base/java.lang.ClassLoader.loadClass(ClassLoader.java:499)
	at java.base/java.lang.ClassLoader.defineClass1(Native Method)
	at java.base/java.lang.ClassLoader.defineClass(ClassLoader.java:1009)
	at java.base/java.security.SecureClassLoader.defineClass(SecureClassLoader.java:174)
	at java.base/java.net.URLClassLoader.defineClass(URLClassLoader.java:545)
	at java.base/java.net.URLClassLoader.access$100(URLClassLoader.java:83)
	at java.base/java.net.URLClassLoader$1.run(URLClassLoader.java:453)
	at java.base/java.net.URLClassLoader$1.run(URLClassLoader.java:447)
	at java.base/java.security.AccessController.doPrivileged(Native Method)
	at java.base/java.net.URLClassLoader.findClass(URLClassLoader.java:446)
	at java.base/java.lang.ClassLoader.loadClass(ClassLoader.java:566)
	at java.base/java.lang.ClassLoader.loadClass(ClassLoader.java:499)
	at jdk.javadoc/jdk.javadoc.internal.doclets.toolkit.taglets.TagletManager.addCustomTag(TagletManager.java:262)
	at jdk.javadoc/jdk.javadoc.internal.doclets.toolkit.BaseConfiguration.initTagletManager(BaseConfiguration.java:786)
	at jdk.javadoc/jdk.javadoc.internal.doclets.toolkit.BaseConfiguration.finishOptionSettings0(BaseConfiguration.java:726)
	at jdk.javadoc/jdk.javadoc.internal.doclets.formats.html.HtmlConfiguration.finishOptionSettings0(HtmlConfiguration.java:867)
	at jdk.javadoc/jdk.javadoc.internal.doclets.toolkit.BaseConfiguration.setOptions(BaseConfiguration.java:747)
	at jdk.javadoc/jdk.javadoc.internal.doclets.toolkit.AbstractDoclet.startGeneration(AbstractDoclet.java:204)
	at jdk.javadoc/jdk.javadoc.internal.doclets.toolkit.AbstractDoclet.run(AbstractDoclet.java:117)
	at jdk.javadoc/jdk.javadoc.doclet.StandardDoclet.run(StandardDoclet.java:72)
	at jdk.javadoc/jdk.javadoc.internal.tool.Start.parseAndExecute(Start.java:581)
	at jdk.javadoc/jdk.javadoc.internal.tool.Start.begin(Start.java:430)
	at jdk.javadoc/jdk.javadoc.internal.tool.Start.begin(Start.java:343)
	at jdk.javadoc/jdk.javadoc.internal.tool.Main.execute(Main.java:63)
	at jdk.javadoc/jdk.javadoc.internal.tool.Main.main(Main.java:52)
Caused by: java.lang.ClassNotFoundException: com.sun.tools.doclets.Taglet
	at java.base/java.net.URLClassLoader.findClass(URLClassLoader.java:466)
	at java.base/java.lang.ClassLoader.loadClass(ClassLoader.java:566)
	at java.base/java.lang.ClassLoader.loadClass(ClassLoader.java:499)
	... 35 more

Command line was: /home/jenkins/tools/java/latest10/bin/javadoc @options @argfile

Refer to the generated Javadoc files in '/home/jenkins/jenkins-slave/workspace/javadoc-plugin_MJAVADOC-521-4VCCRI6KPRH73A3RWPEXQVQHXBYIUVYDLQPEN3Z2IPPUYMQWLG3Q/m/target/test/unit/taglet-test/target/site/apidocs' dir.

	at org.apache.maven.plugins.javadoc.JavadocReportTest.testTaglets(JavadocReportTest.java:559)


FAILED:  org.apache.maven.plugins.javadoc.JavadocReportTest.testJavadocResources

Error Message:
null

Stack Trace:
junit.framework.AssertionFailedError
	at org.apache.maven.plugins.javadoc.JavadocReportTest.testJavadocResources(JavadocReportTest.java:673)


FAILED:  org.apache.maven.plugins.javadoc.JavadocReportTest.testQuotedPath

Error Message:
null

Stack Trace:
junit.framework.AssertionFailedError
	at org.apache.maven.plugins.javadoc.JavadocReportTest.testQuotedPath(JavadocReportTest.java:498)


FAILED:  org.apache.maven.plugins.javadoc.JavadocReportTest.testDefaultConfiguration

Error Message:
null

Stack Trace:
junit.framework.AssertionFailedError
	at org.apache.maven.plugins.javadoc.JavadocReportTest.testDefaultConfiguration(JavadocReportTest.java:240)


FAILED:  org.apache.maven.plugins.javadoc.JavadocReportTest.testDocfiles

Error Message:
null

Stack Trace:
junit.framework.AssertionFailedError
	at org.apache.maven.plugins.javadoc.JavadocReportTest.testDocfiles(JavadocReportTest.java:330)


FAILED:  org.apache.maven.plugins.javadoc.JavadocReportTest.testStylesheetfile

Error Message:
null

Stack Trace:
junit.framework.AssertionFailedError
	at org.apache.maven.plugins.javadoc.JavadocReportTest.testStylesheetfile(JavadocReportTest.java:1115)


FAILED:  org.apache.maven.plugins.javadoc.JavadocReportTest.testTagletArtifacts

Error Message:
expected:<20> but was:<0>

Stack Trace:
junit.framework.AssertionFailedError: expected:<20> but was:<0>
	at org.apache.maven.plugins.javadoc.JavadocReportTest.testTagletArtifacts(JavadocReportTest.java:1044)


FAILED:  org.apache.maven.plugins.javadoc.JavadocReportTest.testTaglets

Error Message:
An error has occurred in Javadoc report generation: 
Exit code: 1 - Picked up JAVA_TOOL_OPTIONS: -Dmaven.ext.class.path="f:\jenkins\jenkins-slave\workspace\javadoc-plugin_MJAVADOC-521-4VCCRI6KPRH73A3RWPEXQVQHXBYIUVYDLQPEN3Z2IPPUYMQWLG3Q@2@tmp\withMaven0b1d9b6e\pipeline-maven-spy.jar" -Dorg.jenkinsci.plugins.pipeline.maven.reportsFolder="f:\jenkins\jenkins-slave\workspace\javadoc-plugin_MJAVADOC-521-4VCCRI6KPRH73A3RWPEXQVQHXBYIUVYDLQPEN3Z2IPPUYMQWLG3Q@2@tmp\withMaven0b1d9b6e" 
javadoc: error - An internal exception has occurred. 
 (java.lang.NoClassDefFoundError: com/sun/tools/doclets/Taglet)
Please file a bug against the javadoc tool via the Java bug reporting page
(http://bugreport.java.com) after checking the Bug Database (http://bugs.java.com)
for duplicates. Include error messages and the following diagnostic in your report. Thank you.
java.lang.NoClassDefFoundError: com/sun/tools/doclets/Taglet
 at java.base/java.lang.ClassLoader.defineClass1(Native Method)
 at java.base/java.lang.ClassLoader.defineClass(ClassLoader.java:1009)
 at java.base/java.security.SecureClassLoader.defineClass(SecureClassLoader.java:174)
 at java.base/java.net.URLClassLoader.defineClass(URLClassLoader.java:545)
 at java.base/java.net.URLClassLoader.access$100(URLClassLoader.java:83)
 at java.base/java.net.URLClassLoader$1.run(URLClassLoader.java:453)
 at java.base/java.net.URLClassLoader$1.run(URLClassLoader.java:447)
 at java.base/java.security.AccessController.doPrivileged(Native Method)
 at java.base/java.net.URLClassLoader.findClass(URLClassLoader.java:446)
 at java.base/java.lang.ClassLoader.loadClass(ClassLoader.java:566)
 at java.base/java.lang.ClassLoader.loadClass(ClassLoader.java:499)
 at java.base/java.lang.ClassLoader.defineClass1(Native Method)
 at java.base/java.lang.ClassLoader.defineClass(ClassLoader.java:1009)
 at java.base/java.security.SecureClassLoader.defineClass(SecureClassLoader.java:174)
 at java.base/java.net.URLClassLoader.defineClass(URLClassLoader.java:545)
 at java.base/java.net.URLClassLoader.access$100(URLClassLoader.java:83)
 at java.base/java.net.URLClassLoader$1.run(URLClassLoader.java:453)
 at java.base/java.net.URLClassLoader$1.run(URLClassLoader.java:447)
 at java.base/java.security.AccessController.doPrivileged(Native Method)
 at java.base/java.net.URLClassLoader.findClass(URLClassLoader.java:446)
 at java.base/java.lang.ClassLoader.loadClass(ClassLoader.java:566)
 at java.base/java.lang.ClassLoader.loadClass(ClassLoader.java:499)
 at jdk.javadoc/jdk.javadoc.internal.doclets.toolkit.taglets.TagletManager.addCustomTag(TagletManager.java:262)
 at jdk.javadoc/jdk.javadoc.internal.doclets.toolkit.BaseConfiguration.initTagletManager(BaseConfiguration.java:786)
 at jdk.javadoc/jdk.javadoc.internal.doclets.toolkit.BaseConfiguration.finishOptionSettings0(BaseConfiguration.java:726)
 at jdk.javadoc/jdk.javadoc.internal.doclets.formats.html.HtmlConfiguration.finishOptionSettings0(HtmlConfiguration.java:867)
 at jdk.javadoc/jdk.javadoc.internal.doclets.toolkit.BaseConfiguration.setOptions(BaseConfiguration.java:747)
 at jdk.javadoc/jdk.javadoc.internal.doclets.toolkit.AbstractDoclet.startGeneration(AbstractDoclet.java:204)
 at jdk.javadoc/jdk.javadoc.internal.doclets.toolkit.AbstractDoclet.run(AbstractDoclet.java:117)
 at jdk.javadoc/jdk.javadoc.doclet.StandardDoclet.run(StandardDoclet.java:72)
 at jdk.javadoc/jdk.javadoc.internal.tool.Start.parseAndExecute(Start.java:581)
 at jdk.javadoc/jdk.javadoc.internal.tool.Start.begin(Start.java:430)
 at jdk.javadoc/jdk.javadoc.internal.tool.Start.begin(Start.java:343)
 at jdk.javadoc/jdk.javadoc.internal.tool.Main.execute(Main.java:63)
 at jdk.javadoc/jdk.javadoc.internal.tool.Main.main(Main.java:52)
Caused by: java.lang.ClassNotFoundException: com.sun.tools.doclets.Taglet
 at java.base/java.net.URLClassLoader.findClass(URLClassLoader.java:466)
 at java.base/java.lang.ClassLoader.loadClass(ClassLoader.java:566)
 at java.base/java.lang.ClassLoader.loadClass(ClassLoader.java:499)
 ... 35 more

Command line was: F:\jenkins\tools\java\jdk10_46\bin\javadoc.exe @options @argfile

Refer to the generated Javadoc files in 'f:\jenkins\jenkins-slave\workspace\javadoc-plugin_MJAVADOC-521-4VCCRI6KPRH73A3RWPEXQVQHXBYIUVYDLQPEN3Z2IPPUYMQWLG3Q@2\m\target\test\unit\taglet-test\target\site\apidocs' dir.


Stack Trace:
org.apache.maven.plugin.MojoExecutionException: 
An error has occurred in Javadoc report generation: 
Exit code: 1 - Picked up JAVA_TOOL_OPTIONS: -Dmaven.ext.class.path="f:\jenkins\jenkins-slave\workspace\javadoc-plugin_MJAVADOC-521-4VCCRI6KPRH73A3RWPEXQVQHXBYIUVYDLQPEN3Z2IPPUYMQWLG3Q@2@tmp\withMaven0b1d9b6e\pipeline-maven-spy.jar" -Dorg.jenkinsci.plugins.pipeline.maven.reportsFolder="f:\jenkins\jenkins-slave\workspace\javadoc-plugin_MJAVADOC-521-4VCCRI6KPRH73A3RWPEXQVQHXBYIUVYDLQPEN3Z2IPPUYMQWLG3Q@2@tmp\withMaven0b1d9b6e" 
javadoc: error - An internal exception has occurred. 
	(java.lang.NoClassDefFoundError: com/sun/tools/doclets/Taglet)
Please file a bug against the javadoc tool via the Java bug reporting page
(http://bugreport.java.com) after checking the Bug Database (http://bugs.java.com)
for duplicates. Include error messages and the following diagnostic in your report. Thank you.
java.lang.NoClassDefFoundError: com/sun/tools/doclets/Taglet
	at java.base/java.lang.ClassLoader.defineClass1(Native Method)
	at java.base/java.lang.ClassLoader.defineClass(ClassLoader.java:1009)
	at java.base/java.security.SecureClassLoader.defineClass(SecureClassLoader.java:174)
	at java.base/java.net.URLClassLoader.defineClass(URLClassLoader.java:545)
	at java.base/java.net.URLClassLoader.access$100(URLClassLoader.java:83)
	at java.base/java.net.URLClassLoader$1.run(URLClassLoader.java:453)
	at java.base/java.net.URLClassLoader$1.run(URLClassLoader.java:447)
	at java.base/java.security.AccessController.doPrivileged(Native Method)
	at java.base/java.net.URLClassLoader.findClass(URLClassLoader.java:446)
	at java.base/java.lang.ClassLoader.loadClass(ClassLoader.java:566)
	at java.base/java.lang.ClassLoader.loadClass(ClassLoader.java:499)
	at java.base/java.lang.ClassLoader.defineClass1(Native Method)
	at java.base/java.lang.ClassLoader.defineClass(ClassLoader.java:1009)
	at java.base/java.security.SecureClassLoader.defineClass(SecureClassLoader.java:174)
	at java.base/java.net.URLClassLoader.defineClass(URLClassLoader.java:545)
	at java.base/java.net.URLClassLoader.access$100(URLClassLoader.java:83)
	at java.base/java.net.URLClassLoader$1.run(URLClassLoader.java:453)
	at java.base/java.net.URLClassLoader$1.run(URLClassLoader.java:447)
	at java.base/java.security.AccessController.doPrivileged(Native Method)
	at java.base/java.net.URLClassLoader.findClass(URLClassLoader.java:446)
	at java.base/java.lang.ClassLoader.loadClass(ClassLoader.java:566)
	at java.base/java.lang.ClassLoader.loadClass(ClassLoader.java:499)
	at jdk.javadoc/jdk.javadoc.internal.doclets.toolkit.taglets.TagletManager.addCustomTag(TagletManager.java:262)
	at jdk.javadoc/jdk.javadoc.internal.doclets.toolkit.BaseConfiguration.initTagletManager(BaseConfiguration.java:786)
	at jdk.javadoc/jdk.javadoc.internal.doclets.toolkit.BaseConfiguration.finishOptionSettings0(BaseConfiguration.java:726)
	at jdk.javadoc/jdk.javadoc.internal.doclets.formats.html.HtmlConfiguration.finishOptionSettings0(HtmlConfiguration.java:867)
	at jdk.javadoc/jdk.javadoc.internal.doclets.toolkit.BaseConfiguration.setOptions(BaseConfiguration.java:747)
	at jdk.javadoc/jdk.javadoc.internal.doclets.toolkit.AbstractDoclet.startGeneration(AbstractDoclet.java:204)
	at jdk.javadoc/jdk.javadoc.internal.doclets.toolkit.AbstractDoclet.run(AbstractDoclet.java:117)
	at jdk.javadoc/jdk.javadoc.doclet.StandardDoclet.run(StandardDoclet.java:72)
	at jdk.javadoc/jdk.javadoc.internal.tool.Start.parseAndExecute(Start.java:581)
	at jdk.javadoc/jdk.javadoc.internal.tool.Start.begin(Start.java:430)
	at jdk.javadoc/jdk.javadoc.internal.tool.Start.begin(Start.java:343)
	at jdk.javadoc/jdk.javadoc.internal.tool.Main.execute(Main.java:63)
	at jdk.javadoc/jdk.javadoc.internal.tool.Main.main(Main.java:52)
Caused by: java.lang.ClassNotFoundException: com.sun.tools.doclets.Taglet
	at java.base/java.net.URLClassLoader.findClass(URLClassLoader.java:466)
	at java.base/java.lang.ClassLoader.loadClass(ClassLoader.java:566)
	at java.base/java.lang.ClassLoader.loadClass(ClassLoader.java:499)
	... 35 more

Command line was: F:\jenkins\tools\java\jdk10_46\bin\javadoc.exe @options @argfile

Refer to the generated Javadoc files in 'f:\jenkins\jenkins-slave\workspace\javadoc-plugin_MJAVADOC-521-4VCCRI6KPRH73A3RWPEXQVQHXBYIUVYDLQPEN3Z2IPPUYMQWLG3Q@2\m\target\test\unit\taglet-test\target\site\apidocs' dir.

	at org.apache.maven.plugins.javadoc.JavadocReportTest.testTaglets(JavadocReportTest.java:559)
Caused by: org.apache.maven.reporting.MavenReportException: 

Exit code: 1 - Picked up JAVA_TOOL_OPTIONS: -Dmaven.ext.class.path="f:\jenkins\jenkins-slave\workspace\javadoc-plugin_MJAVADOC-521-4VCCRI6KPRH73A3RWPEXQVQHXBYIUVYDLQPEN3Z2IPPUYMQWLG3Q@2@tmp\withMaven0b1d9b6e\pipeline-maven-spy.jar" -Dorg.jenkinsci.plugins.pipeline.maven.reportsFolder="f:\jenkins\jenkins-slave\workspace\javadoc-plugin_MJAVADOC-521-4VCCRI6KPRH73A3RWPEXQVQHXBYIUVYDLQPEN3Z2IPPUYMQWLG3Q@2@tmp\withMaven0b1d9b6e" 
javadoc: error - An internal exception has occurred. 
	(java.lang.NoClassDefFoundError: com/sun/tools/doclets/Taglet)
Please file a bug against the javadoc tool via the Java bug reporting page
(http://bugreport.java.com) after checking the Bug Database (http://bugs.java.com)
for duplicates. Include error messages and the following diagnostic in your report. Thank you.
java.lang.NoClassDefFoundError: com/sun/tools/doclets/Taglet
	at java.base/java.lang.ClassLoader.defineClass1(Native Method)
	at java.base/java.lang.ClassLoader.defineClass(ClassLoader.java:1009)
	at java.base/java.security.SecureClassLoader.defineClass(SecureClassLoader.java:174)
	at java.base/java.net.URLClassLoader.defineClass(URLClassLoader.java:545)
	at java.base/java.net.URLClassLoader.access$100(URLClassLoader.java:83)
	at java.base/java.net.URLClassLoader$1.run(URLClassLoader.java:453)
	at java.base/java.net.URLClassLoader$1.run(URLClassLoader.java:447)
	at java.base/java.security.AccessController.doPrivileged(Native Method)
	at java.base/java.net.URLClassLoader.findClass(URLClassLoader.java:446)
	at java.base/java.lang.ClassLoader.loadClass(ClassLoader.java:566)
	at java.base/java.lang.ClassLoader.loadClass(ClassLoader.java:499)
	at java.base/java.lang.ClassLoader.defineClass1(Native Method)
	at java.base/java.lang.ClassLoader.defineClass(ClassLoader.java:1009)
	at java.base/java.security.SecureClassLoader.defineClass(SecureClassLoader.java:174)
	at java.base/java.net.URLClassLoader.defineClass(URLClassLoader.java:545)
	at java.base/java.net.URLClassLoader.access$100(URLClassLoader.java:83)
	at java.base/java.net.URLClassLoader$1.run(URLClassLoader.java:453)
	at java.base/java.net.URLClassLoader$1.run(URLClassLoader.java:447)
	at java.base/java.security.AccessController.doPrivileged(Native Method)
	at java.base/java.net.URLClassLoader.findClass(URLClassLoader.java:446)
	at java.base/java.lang.ClassLoader.loadClass(ClassLoader.java:566)
	at java.base/java.lang.ClassLoader.loadClass(ClassLoader.java:499)
	at jdk.javadoc/jdk.javadoc.internal.doclets.toolkit.taglets.TagletManager.addCustomTag(TagletManager.java:262)
	at jdk.javadoc/jdk.javadoc.internal.doclets.toolkit.BaseConfiguration.initTagletManager(BaseConfiguration.java:786)
	at jdk.javadoc/jdk.javadoc.internal.doclets.toolkit.BaseConfiguration.finishOptionSettings0(BaseConfiguration.java:726)
	at jdk.javadoc/jdk.javadoc.internal.doclets.formats.html.HtmlConfiguration.finishOptionSettings0(HtmlConfiguration.java:867)
	at jdk.javadoc/jdk.javadoc.internal.doclets.toolkit.BaseConfiguration.setOptions(BaseConfiguration.java:747)
	at jdk.javadoc/jdk.javadoc.internal.doclets.toolkit.AbstractDoclet.startGeneration(AbstractDoclet.java:204)
	at jdk.javadoc/jdk.javadoc.internal.doclets.toolkit.AbstractDoclet.run(AbstractDoclet.java:117)
	at jdk.javadoc/jdk.javadoc.doclet.StandardDoclet.run(StandardDoclet.java:72)
	at jdk.javadoc/jdk.javadoc.internal.tool.Start.parseAndExecute(Start.java:581)
	at jdk.javadoc/jdk.javadoc.internal.tool.Start.begin(Start.java:430)
	at jdk.javadoc/jdk.javadoc.internal.tool.Start.begin(Start.java:343)
	at jdk.javadoc/jdk.javadoc.internal.tool.Main.execute(Main.java:63)
	at jdk.javadoc/jdk.javadoc.internal.tool.Main.main(Main.java:52)
Caused by: java.lang.ClassNotFoundException: com.sun.tools.doclets.Taglet
	at java.base/java.net.URLClassLoader.findClass(URLClassLoader.java:466)
	at java.base/java.lang.ClassLoader.loadClass(ClassLoader.java:566)
	at java.base/java.lang.ClassLoader.loadClass(ClassLoader.java:499)
	... 35 more

Command line was: F:\jenkins\tools\java\jdk10_46\bin\javadoc.exe @options @argfile

Refer to the generated Javadoc files in 'f:\jenkins\jenkins-slave\workspace\javadoc-plugin_MJAVADOC-521-4VCCRI6KPRH73A3RWPEXQVQHXBYIUVYDLQPEN3Z2IPPUYMQWLG3Q@2\m\target\test\unit\taglet-test\target\site\apidocs' dir.

	at org.apache.maven.plugins.javadoc.JavadocReportTest.testTaglets(JavadocReportTest.java:559)


FAILED:  org.apache.maven.plugins.javadoc.JavadocReportTest.testJavadocResources

Error Message:
null

Stack Trace:
junit.framework.AssertionFailedError
	at org.apache.maven.plugins.javadoc.JavadocReportTest.testJavadocResources(JavadocReportTest.java:673)


FAILED:  org.apache.maven.plugins.javadoc.JavadocReportTest.testQuotedPath

Error Message:
null

Stack Trace:
junit.framework.AssertionFailedError
	at org.apache.maven.plugins.javadoc.JavadocReportTest.testQuotedPath(JavadocReportTest.java:498)


FAILED:  org.apache.maven.plugins.javadoc.JavadocReportTest.testDefaultConfiguration

Error Message:
null

Stack Trace:
junit.framework.AssertionFailedError
	at org.apache.maven.plugins.javadoc.JavadocReportTest.testDefaultConfiguration(JavadocReportTest.java:240)


FAILED:  org.apache.maven.plugins.javadoc.JavadocReportTest.testDocfiles

Error Message:
null

Stack Trace:
junit.framework.AssertionFailedError
	at org.apache.maven.plugins.javadoc.JavadocReportTest.testDocfiles(JavadocReportTest.java:330)


FAILED:  org.apache.maven.plugins.javadoc.JavadocReportTest.testStylesheetfile

Error Message:
null

Stack Trace:
junit.framework.AssertionFailedError
	at org.apache.maven.plugins.javadoc.JavadocReportTest.testStylesheetfile(JavadocReportTest.java:1115)




Build log:
[...truncated 2.78 MB...]
[windows-jdk10] [INFO] --- mrm-maven-plugin:1.1.0:stop (repository) @ maven-javadoc-plugin ---
[windows-jdk10] [INFO] Stopping Mock Repository Manager on http://localhost:59470
[windows-jdk10] [INFO] Stopped SocketConnector@0.0.0.0:59470
[windows-jdk10] [INFO] Mock Repository Manager http://localhost:59470 is stopped.
[windows-jdk10] [INFO] 
[windows-jdk10] [INFO] --- mrm-maven-plugin:1.1.0:stop (3rdparty) @ maven-javadoc-plugin ---
[windows-jdk10] [INFO] Stopping Mock Repository Manager on http://localhost:59471
[windows-jdk10] [INFO] Stopped SocketConnector@0.0.0.0:59471
[windows-jdk10] [INFO] Mock Repository Manager http://localhost:59471 is stopped.
[windows-jdk10] [INFO] 
[windows-jdk10] [INFO] --- maven-checkstyle-plugin:3.0.0:check (checkstyle-check) @ maven-javadoc-plugin ---
[windows-jdk10] [INFO] Downloading: https://repo.maven.apache.org/maven2/org/apache/maven/shared/maven-shared-resources/2/maven-shared-resources-2.pom
[windows-jdk10] [INFO] Downloaded: https://repo.maven.apache.org/maven2/org/apache/maven/shared/maven-shared-resources/2/maven-shared-resources-2.pom (3.0 kB at 296 kB/s)
[windows-jdk10] [INFO] Downloading: https://repo.maven.apache.org/maven2/org/codehaus/plexus/plexus-utils/3.0.10/plexus-utils-3.0.10.pom
[windows-jdk10] [INFO] Downloaded: https://repo.maven.apache.org/maven2/org/codehaus/plexus/plexus-utils/3.0.10/plexus-utils-3.0.10.pom (3.1 kB at 314 kB/s)
[windows-jdk10] [INFO] Downloading: https://repo.maven.apache.org/maven2/org/codehaus/plexus/plexus/3.3/plexus-3.3.pom
[windows-jdk10] [INFO] Downloaded: https://repo.maven.apache.org/maven2/org/codehaus/plexus/plexus/3.3/plexus-3.3.pom (20 kB at 2.8 MB/s)
[windows-jdk10] [INFO] Downloading: https://repo.maven.apache.org/maven2/org/apache/maven/doxia/doxia-integration-tools/1.6/doxia-integration-tools-1.6.pom
[windows-jdk10] [INFO] Downloaded: https://repo.maven.apache.org/maven2/org/apache/maven/doxia/doxia-integration-tools/1.6/doxia-integration-tools-1.6.pom (7.0 kB at 994 kB/s)
[windows-jdk10] [INFO] Downloading: https://repo.maven.apache.org/maven2/org/apache/maven/doxia/doxia-tools/3/doxia-tools-3.pom
[windows-jdk10] [INFO] Downloaded: https://repo.maven.apache.org/maven2/org/apache/maven/doxia/doxia-tools/3/doxia-tools-3.pom (9.9 kB at 1.2 MB/s)
[windows-jdk10] [INFO] Downloading: https://repo.maven.apache.org/maven2/org/codehaus/plexus/plexus-resources/1.1.0/plexus-resources-1.1.0.pom
[windows-jdk10] [INFO] Downloaded: https://repo.maven.apache.org/maven2/org/codehaus/plexus/plexus-resources/1.1.0/plexus-resources-1.1.0.pom (3.2 kB at 353 kB/s)
[windows-jdk10] [INFO] Downloading: https://repo.maven.apache.org/maven2/com/puppycrawl/tools/checkstyle/6.18/checkstyle-6.18.pom
[windows-jdk10] [INFO] Downloaded: https://repo.maven.apache.org/maven2/com/puppycrawl/tools/checkstyle/6.18/checkstyle-6.18.pom (71 kB at 5.9 MB/s)
[windows-jdk10] [INFO] Downloading: https://repo.maven.apache.org/maven2/antlr/antlr/2.7.7/antlr-2.7.7.pom
[windows-jdk10] [INFO] Downloaded: https://repo.maven.apache.org/maven2/antlr/antlr/2.7.7/antlr-2.7.7.pom (632 B at 79 kB/s)
[windows-jdk10] [INFO] Downloading: https://repo.maven.apache.org/maven2/org/antlr/antlr4-runtime/4.5.3/antlr4-runtime-4.5.3.pom
[windows-jdk10] [INFO] Downloaded: https://repo.maven.apache.org/maven2/org/antlr/antlr4-runtime/4.5.3/antlr4-runtime-4.5.3.pom (2.3 kB at 105 kB/s)
[windows-jdk10] [INFO] Downloading: https://repo.maven.apache.org/maven2/org/antlr/antlr4-master/4.5.3/antlr4-master-4.5.3.pom
[windows-jdk10] [INFO] Downloaded: https://repo.maven.apache.org/maven2/org/antlr/antlr4-master/4.5.3/antlr4-master-4.5.3.pom (3.7 kB at 526 kB/s)
[windows-jdk10] [INFO] Downloading: https://repo.maven.apache.org/maven2/commons-beanutils/commons-beanutils/1.9.2/commons-beanutils-1.9.2.pom
[windows-jdk10] [INFO] Downloaded: https://repo.maven.apache.org/maven2/commons-beanutils/commons-beanutils/1.9.2/commons-beanutils-1.9.2.pom (14 kB at 2.4 MB/s)
[windows-jdk10] [INFO] Downloading: https://repo.maven.apache.org/maven2/org/apache/commons/commons-parent/33/commons-parent-33.pom
[windows-jdk10] [INFO] Downloaded: https://repo.maven.apache.org/maven2/org/apache/commons/commons-parent/33/commons-parent-33.pom (53 kB at 6.6 MB/s)
[windows-jdk10] [INFO] Downloading: https://repo.maven.apache.org/maven2/commons-cli/commons-cli/1.3.1/commons-cli-1.3.1.pom
[windows-jdk10] [INFO] Downloaded: https://repo.maven.apache.org/maven2/commons-cli/commons-cli/1.3.1/commons-cli-1.3.1.pom (10 kB at 1.3 MB/s)
[windows-jdk10] [INFO] Downloading: https://repo.maven.apache.org/maven2/com/google/guava/guava/19.0/guava-19.0.pom
[windows-jdk10] [INFO] Downloaded: https://repo.maven.apache.org/maven2/com/google/guava/guava/19.0/guava-19.0.pom (6.8 kB at 755 kB/s)
[windows-jdk10] [INFO] Downloading: https://repo.maven.apache.org/maven2/com/google/guava/guava-parent/19.0/guava-parent-19.0.pom
[windows-jdk10] [INFO] Downloaded: https://repo.maven.apache.org/maven2/com/google/guava/guava-parent/19.0/guava-parent-19.0.pom (9.9 kB at 581 kB/s)
[windows-jdk10] [INFO] Downloading: https://repo.maven.apache.org/maven2/org/sonatype/oss/oss-parent/7/oss-parent-7.pom
[windows-jdk10] [INFO] Downloaded: https://repo.maven.apache.org/maven2/org/sonatype/oss/oss-parent/7/oss-parent-7.pom (4.8 kB at 124 kB/s)
[windows-jdk10] [INFO] Downloading: https://repo.maven.apache.org/maven2/javax/xml/bind/jaxb-api/2.3.0/jaxb-api-2.3.0.pom
[windows-jdk10] [INFO] Downloaded: https://repo.maven.apache.org/maven2/javax/xml/bind/jaxb-api/2.3.0/jaxb-api-2.3.0.pom (23 kB at 2.9 MB/s)
[windows-jdk10] [INFO] Downloading: https://repo.maven.apache.org/maven2/javax/xml/bind/jaxb-api-parent/2.3.0/jaxb-api-parent-2.3.0.pom
[windows-jdk10] [INFO] Downloaded: https://repo.maven.apache.org/maven2/javax/xml/bind/jaxb-api-parent/2.3.0/jaxb-api-parent-2.3.0.pom (5.6 kB at 564 kB/s)
[windows-jdk10] [INFO] Downloading: https://repo.maven.apache.org/maven2/net/java/jvnet-parent/5/jvnet-parent-5.pom
[windows-jdk10] [INFO] Downloaded: https://repo.maven.apache.org/maven2/net/java/jvnet-parent/5/jvnet-parent-5.pom (8.9 kB at 1.3 MB/s)
[windows-jdk10] [INFO] Downloading: https://repo.maven.apache.org/maven2/org/apache/maven/doxia/doxia-core/1.2/doxia-core-1.2.jar
[windows-jdk10] [INFO] Downloading: https://repo.maven.apache.org/maven2/commons-digester/commons-digester/1.6/commons-digester-1.6.jar
[windows-jdk10] [INFO] Downloading: https://repo.maven.apache.org/maven2/org/apache/maven/doxia/doxia-integration-tools/1.6/doxia-integration-tools-1.6.jar
[windows-jdk10] [INFO] Downloading: https://repo.maven.apache.org/maven2/org/apache/maven/shared/maven-shared-resources/2/maven-shared-resources-2.jar
[windows-jdk10] [INFO] Downloading: https://repo.maven.apache.org/maven2/commons-logging/commons-logging/1.0.4/commons-logging-1.0.4.jar
[windows-jdk10] [INFO] Downloaded: https://repo.maven.apache.org/maven2/org/apache/maven/doxia/doxia-core/1.2/doxia-core-1.2.jar (154 kB at 5.1 MB/s)
[windows-jdk10] [INFO] Downloading: https://repo.maven.apache.org/maven2/commons-io/commons-io/1.4/commons-io-1.4.jar
[windows-jdk10] [INFO] Downloaded: https://repo.maven.apache.org/maven2/org/apache/maven/shared/maven-shared-resources/2/maven-shared-resources-2.jar (13 kB at 318 kB/s)
[windows-jdk10] [INFO] Downloading: https://repo.maven.apache.org/maven2/org/codehaus/plexus/plexus-resources/1.1.0/plexus-resources-1.1.0.jar
[windows-jdk10] [INFO] Downloaded: https://repo.maven.apache.org/maven2/commons-digester/commons-digester/1.6/commons-digester-1.6.jar (168 kB at 3.7 MB/s)
[windows-jdk10] [INFO] Downloading: https://repo.maven.apache.org/maven2/com/puppycrawl/tools/checkstyle/6.18/checkstyle-6.18.jar
[windows-jdk10] [INFO] Downloaded: https://repo.maven.apache.org/maven2/org/apache/maven/doxia/doxia-integration-tools/1.6/doxia-integration-tools-1.6.jar (45 kB at 893 kB/s)
[windows-jdk10] [INFO] Downloading: https://repo.maven.apache.org/maven2/antlr/antlr/2.7.7/antlr-2.7.7.jar
[windows-jdk10] [INFO] Downloaded: https://repo.maven.apache.org/maven2/org/codehaus/plexus/plexus-resources/1.1.0/plexus-resources-1.1.0.jar (23 kB at 455 kB/s)
[windows-jdk10] [INFO] Downloading: https://repo.maven.apache.org/maven2/org/antlr/antlr4-runtime/4.5.3/antlr4-runtime-4.5.3.jar
[windows-jdk10] [INFO] Downloaded: https://repo.maven.apache.org/maven2/commons-io/commons-io/1.4/commons-io-1.4.jar (109 kB at 2.1 MB/s)
[windows-jdk10] [INFO] Downloading: https://repo.maven.apache.org/maven2/commons-beanutils/commons-beanutils/1.9.2/commons-beanutils-1.9.2.jar
[windows-jdk10] [INFO] Downloaded: https://repo.maven.apache.org/maven2/commons-logging/commons-logging/1.0.4/commons-logging-1.0.4.jar (38 kB at 717 kB/s)
[windows-jdk10] [INFO] Downloading: https://repo.maven.apache.org/maven2/commons-cli/commons-cli/1.3.1/commons-cli-1.3.1.jar
[windows-jdk10] [INFO] Downloaded: https://repo.maven.apache.org/maven2/commons-cli/commons-cli/1.3.1/commons-cli-1.3.1.jar (53 kB at 746 kB/s)
[windows-jdk10] [INFO] Downloading: https://repo.maven.apache.org/maven2/com/google/guava/guava/19.0/guava-19.0.jar
[windows-jdk10] [INFO] Downloaded: https://repo.maven.apache.org/maven2/org/antlr/antlr4-runtime/4.5.3/antlr4-runtime-4.5.3.jar (302 kB at 3.9 MB/s)
[windows-jdk10] [INFO] Downloading: https://repo.maven.apache.org/maven2/commons-lang/commons-lang/2.1/commons-lang-2.1.jar
[windows-jdk10] [INFO] Downloaded: https://repo.maven.apache.org/maven2/antlr/antlr/2.7.7/antlr-2.7.7.jar (445 kB at 5.4 MB/s)
[windows-jdk10] [INFO] Downloading: https://repo.maven.apache.org/maven2/javax/xml/bind/jaxb-api/2.3.0/jaxb-api-2.3.0.jar
[windows-jdk10] [INFO] Downloaded: https://repo.maven.apache.org/maven2/commons-beanutils/commons-beanutils/1.9.2/commons-beanutils-1.9.2.jar (234 kB at 2.8 MB/s)
[windows-jdk10] [INFO] Downloaded: https://repo.maven.apache.org/maven2/com/puppycrawl/tools/checkstyle/6.18/checkstyle-6.18.jar (1.2 MB at 12 MB/s)
[windows-jdk10] [INFO] Downloaded: https://repo.maven.apache.org/maven2/javax/xml/bind/jaxb-api/2.3.0/jaxb-api-2.3.0.jar (126 kB at 1.3 MB/s)
[windows-jdk10] [INFO] Downloaded: https://repo.maven.apache.org/maven2/commons-lang/commons-lang/2.1/commons-lang-2.1.jar (208 kB at 2.1 MB/s)
[windows-jdk10] [INFO] Downloaded: https://repo.maven.apache.org/maven2/com/google/guava/guava/19.0/guava-19.0.jar (2.3 MB at 17 MB/s)
[windows-jdk10] [INFO] There are 4 errors reported by Checkstyle 6.18 with config/maven_checks.xml ruleset.
[windows-jdk10] [INFO] Ignored 4 errors, 0 violation remaining.
[windows-jdk10] [INFO] 
[windows-jdk10] [INFO] --- maven-invoker-plugin:3.0.1:verify (integration-test) @ maven-javadoc-plugin ---
[windows-jdk10] [INFO] -------------------------------------------------
[windows-jdk10] [INFO] Build Summary:
[windows-jdk10] [INFO]   Passed: 33, Failed: 3, Errors: 0, Skipped: 0
[windows-jdk10] [INFO] -------------------------------------------------
[windows-jdk10] [WARNING] The following builds failed:
[windows-jdk10] [WARNING] *  detectLinks\pom.xml
[windows-jdk10] [WARNING] *  MJAVADOC-257\pom.xml
[windows-jdk10] [WARNING] *  MJAVADOC-497\pom.xml
[windows-jdk10] [INFO] -------------------------------------------------
[windows-jdk10] [WARNING] Ignoring that 3 builds failed.
[windows-jdk10] [INFO] ------------------------------------------------------------------------
[windows-jdk10] [INFO] BUILD SUCCESS
[windows-jdk10] [INFO] ------------------------------------------------------------------------
[windows-jdk10] [INFO] Total time: 12:49 min
[windows-jdk10] [INFO] Finished at: 2018-04-01T17:32:54Z
[windows-jdk10] [INFO] Final Memory: 53M/187M
[windows-jdk10] [INFO] ------------------------------------------------------------------------
[windows-jdk10] [INFO] [jenkins-event-spy] Generated F:\jenkins\jenkins-slave\workspace\javadoc-plugin_MJAVADOC-521-4VCCRI6KPRH73A3RWPEXQVQHXBYIUVYDLQPEN3Z2IPPUYMQWLG3Q@2@tmp\withMaven0b1d9b6e\maven-spy-20180401-172003-7916886538713147882465.log
[Pipeline] [windows-jdk10] }
[Pipeline] [windows-jdk10] // dir
[windows-jdk9] [INFO] run post-build script verify.bsh
[windows-jdk9] [INFO]           MJAVADOC-437\pom.xml ............................. SUCCESS (12.1 s)
[windows-jdk9] [INFO] Building: MJAVADOC-494_aggregate-repositories\pom.xml
[Pipeline] [windows-jdk10] }
[windows-jdk10] [withMaven] junitPublisher - Archive test results for Maven artifact org.apache.maven.plugins:maven-javadoc-plugin:3.0.1-SNAPSHOT generated by maven-surefire-plugin:test (default-test): m\target\surefire-reports\*.xml
[windows-jdk10] [withMaven] junitPublisher - Jenkins JUnit Attachments Plugin not found, can't publish test attachments.Recording test results
[Pipeline] [windows-jdk10] // withMaven
[Pipeline] [windows-jdk10] }
[Pipeline] [windows-jdk10] // stage
[Pipeline] [windows-jdk10] }
[Pipeline] [windows-jdk10] // node
[Pipeline] [windows-jdk10] }
[windows-jdk9] [INFO]           MJAVADOC-494_aggregate-repositories\pom.xml ...... SUCCESS (10.2 s)
[windows-jdk9] [INFO] Building: MJAVADOC-497\pom.xml
[windows-jdk9] [INFO] run post-build script verify.bsh
[windows-jdk9] [INFO]           MJAVADOC-497\pom.xml ............................. SUCCESS (9.4 s)
[windows-jdk9] [INFO] Building: MJAVADOC-498_aggr_modulepath\pom.xml
[windows-jdk9] [INFO]           MJAVADOC-498_aggr_modulepath\pom.xml ............. SUCCESS (24.0 s)
[windows-jdk9] [INFO] Building: MJAVADOC-498_mm_modulepath\pom.xml
[windows-jdk9] [INFO]           MJAVADOC-498_mm_modulepath\pom.xml ............... SUCCESS (12.7 s)
[windows-jdk9] [INFO] Building: MJAVADOC-498_modulepath\pom.xml
[windows-jdk9] [INFO] run post-build script verify.groovy
[windows-jdk9] [INFO]           MJAVADOC-498_modulepath\pom.xml .................. SUCCESS (15.1 s)
[windows-jdk9] [INFO] Building: MJAVADOC-508\pom.xml
[windows-jdk9] [INFO]           MJAVADOC-508\pom.xml ............................. SUCCESS (7.8 s)
[windows-jdk9] [INFO] Building: site-failOnError\pom.xml
[windows-jdk9] [INFO]           site-failOnError\pom.xml ......................... SUCCESS (12.8 s)
[windows-jdk9] [INFO] 
[windows-jdk9] [INFO] --- mrm-maven-plugin:1.1.0:stop (repository) @ maven-javadoc-plugin ---
[windows-jdk9] [INFO] Stopping Mock Repository Manager on http://localhost:59537
[windows-jdk9] [INFO] Stopped SocketConnector@0.0.0.0:59537
[windows-jdk9] [INFO] Mock Repository Manager http://localhost:59537 is stopped.
[windows-jdk9] [INFO] 
[windows-jdk9] [INFO] --- mrm-maven-plugin:1.1.0:stop (3rdparty) @ maven-javadoc-plugin ---
[windows-jdk9] [INFO] Stopping Mock Repository Manager on http://localhost:59538
[windows-jdk9] [INFO] Stopped SocketConnector@0.0.0.0:59538
[windows-jdk9] [INFO] Mock Repository Manager http://localhost:59538 is stopped.
[windows-jdk9] [INFO] 
[windows-jdk9] [INFO] --- maven-checkstyle-plugin:3.0.0:check (checkstyle-check) @ maven-javadoc-plugin ---
[windows-jdk9] [INFO] Downloading: https://repo.maven.apache.org/maven2/org/apache/maven/shared/maven-shared-resources/2/maven-shared-resources-2.pom
[windows-jdk9] [INFO] Downloaded: https://repo.maven.apache.org/maven2/org/apache/maven/shared/maven-shared-resources/2/maven-shared-resources-2.pom (3.0 kB at 64 kB/s)
[windows-jdk9] [INFO] Downloading: https://repo.maven.apache.org/maven2/org/codehaus/plexus/plexus-utils/3.0.10/plexus-utils-3.0.10.pom
[windows-jdk9] [INFO] Downloaded: https://repo.maven.apache.org/maven2/org/codehaus/plexus/plexus-utils/3.0.10/plexus-utils-3.0.10.pom (3.1 kB at 393 kB/s)
[windows-jdk9] [INFO] Downloading: https://repo.maven.apache.org/maven2/org/codehaus/plexus/plexus/3.3/plexus-3.3.pom
[windows-jdk9] [INFO] Downloaded: https://repo.maven.apache.org/maven2/org/codehaus/plexus/plexus/3.3/plexus-3.3.pom (20 kB at 2.0 MB/s)
[windows-jdk9] [INFO] Downloading: https://repo.maven.apache.org/maven2/org/apache/maven/doxia/doxia-integration-tools/1.6/doxia-integration-tools-1.6.pom
[windows-jdk9] [INFO] Downloaded: https://repo.maven.apache.org/maven2/org/apache/maven/doxia/doxia-integration-tools/1.6/doxia-integration-tools-1.6.pom (7.0 kB at 773 kB/s)
[windows-jdk9] [INFO] Downloading: https://repo.maven.apache.org/maven2/org/apache/maven/doxia/doxia-tools/3/doxia-tools-3.pom
[windows-jdk9] [INFO] Downloaded: https://repo.maven.apache.org/maven2/org/apache/maven/doxia/doxia-tools/3/doxia-tools-3.pom (9.9 kB at 1.2 MB/s)
[windows-jdk9] [INFO] Downloading: https://repo.maven.apache.org/maven2/org/codehaus/plexus/plexus-resources/1.1.0/plexus-resources-1.1.0.pom
[windows-jdk9] [INFO] Downloaded: https://repo.maven.apache.org/maven2/org/codehaus/plexus/plexus-resources/1.1.0/plexus-resources-1.1.0.pom (3.2 kB at 397 kB/s)
[windows-jdk9] [INFO] Downloading: https://repo.maven.apache.org/maven2/com/puppycrawl/tools/checkstyle/6.18/checkstyle-6.18.pom
[windows-jdk9] [INFO] Downloaded: https://repo.maven.apache.org/maven2/com/puppycrawl/tools/checkstyle/6.18/checkstyle-6.18.pom (71 kB at 4.2 MB/s)
[windows-jdk9] [INFO] Downloading: https://repo.maven.apache.org/maven2/antlr/antlr/2.7.7/antlr-2.7.7.pom
[windows-jdk9] [INFO] Downloaded: https://repo.maven.apache.org/maven2/antlr/antlr/2.7.7/antlr-2.7.7.pom (632 B at 90 kB/s)
[windows-jdk9] [INFO] Downloading: https://repo.maven.apache.org/maven2/org/antlr/antlr4-runtime/4.5.3/antlr4-runtime-4.5.3.pom
[windows-jdk9] [INFO] Downloaded: https://repo.maven.apache.org/maven2/org/antlr/antlr4-runtime/4.5.3/antlr4-runtime-4.5.3.pom (2.3 kB at 330 kB/s)
[windows-jdk9] [INFO] Downloading: https://repo.maven.apache.org/maven2/org/antlr/antlr4-master/4.5.3/antlr4-master-4.5.3.pom
[windows-jdk9] [INFO] Downloaded: https://repo.maven.apache.org/maven2/org/antlr/antlr4-master/4.5.3/antlr4-master-4.5.3.pom (3.7 kB at 409 kB/s)
[windows-jdk9] [INFO] Downloading: https://repo.maven.apache.org/maven2/commons-beanutils/commons-beanutils/1.9.2/commons-beanutils-1.9.2.pom
[windows-jdk9] [INFO] Downloaded: https://repo.maven.apache.org/maven2/commons-beanutils/commons-beanutils/1.9.2/commons-beanutils-1.9.2.pom (14 kB at 1.8 MB/s)
[windows-jdk9] [INFO] Downloading: https://repo.maven.apache.org/maven2/org/apache/commons/commons-parent/33/commons-parent-33.pom
[windows-jdk9] [INFO] Downloaded: https://repo.maven.apache.org/maven2/org/apache/commons/commons-parent/33/commons-parent-33.pom (53 kB at 4.8 MB/s)
[windows-jdk9] [INFO] Downloading: https://repo.maven.apache.org/maven2/commons-cli/commons-cli/1.3.1/commons-cli-1.3.1.pom
[windows-jdk9] [INFO] Downloaded: https://repo.maven.apache.org/maven2/commons-cli/commons-cli/1.3.1/commons-cli-1.3.1.pom (10 kB at 1.3 MB/s)
[windows-jdk9] [INFO] Downloading: https://repo.maven.apache.org/maven2/com/google/guava/guava/19.0/guava-19.0.pom
[windows-jdk9] [INFO] Downloaded: https://repo.maven.apache.org/maven2/com/google/guava/guava/19.0/guava-19.0.pom (6.8 kB at 849 kB/s)
[windows-jdk9] [INFO] Downloading: https://repo.maven.apache.org/maven2/com/google/guava/guava-parent/19.0/guava-parent-19.0.pom
[windows-jdk9] [INFO] Downloaded: https://repo.maven.apache.org/maven2/com/google/guava/guava-parent/19.0/guava-parent-19.0.pom (9.9 kB at 1.2 MB/s)
[windows-jdk9] [INFO] Downloading: https://repo.maven.apache.org/maven2/org/sonatype/oss/oss-parent/7/oss-parent-7.pom
[windows-jdk9] [INFO] Downloaded: https://repo.maven.apache.org/maven2/org/sonatype/oss/oss-parent/7/oss-parent-7.pom (4.8 kB at 804 kB/s)
[windows-jdk9] [INFO] Downloading: https://repo.maven.apache.org/maven2/javax/xml/bind/jaxb-api/2.3.0/jaxb-api-2.3.0.pom
[windows-jdk9] [INFO] Downloaded: https://repo.maven.apache.org/maven2/javax/xml/bind/jaxb-api/2.3.0/jaxb-api-2.3.0.pom (23 kB at 1.9 MB/s)
[windows-jdk9] [INFO] Downloading: https://repo.maven.apache.org/maven2/javax/xml/bind/jaxb-api-parent/2.3.0/jaxb-api-parent-2.3.0.pom
[windows-jdk9] [INFO] Downloaded: https://repo.maven.apache.org/maven2/javax/xml/bind/jaxb-api-parent/2.3.0/jaxb-api-parent-2.3.0.pom (5.6 kB at 513 kB/s)
[windows-jdk9] [INFO] Downloading: https://repo.maven.apache.org/maven2/net/java/jvnet-parent/5/jvnet-parent-5.pom
[windows-jdk9] [INFO] Downloaded: https://repo.maven.apache.org/maven2/net/java/jvnet-parent/5/jvnet-parent-5.pom (8.9 kB at 739 kB/s)
[windows-jdk9] [INFO] Downloading: https://repo.maven.apache.org/maven2/org/apache/maven/shared/maven-shared-resources/2/maven-shared-resources-2.jar
[windows-jdk9] [INFO] Downloading: https://repo.maven.apache.org/maven2/commons-logging/commons-logging/1.0.4/commons-logging-1.0.4.jar
[windows-jdk9] [INFO] Downloading: https://repo.maven.apache.org/maven2/org/apache/maven/doxia/doxia-core/1.2/doxia-core-1.2.jar
[windows-jdk9] [INFO] Downloading: https://repo.maven.apache.org/maven2/org/apache/maven/doxia/doxia-integration-tools/1.6/doxia-integration-tools-1.6.jar
[windows-jdk9] [INFO] Downloading: https://repo.maven.apache.org/maven2/commons-digester/commons-digester/1.6/commons-digester-1.6.jar
[windows-jdk9] [INFO] Downloaded: https://repo.maven.apache.org/maven2/org/apache/maven/doxia/doxia-integration-tools/1.6/doxia-integration-tools-1.6.jar (45 kB at 1.8 MB/s)
[windows-jdk9] [INFO] Downloading: https://repo.maven.apache.org/maven2/commons-io/commons-io/1.4/commons-io-1.4.jar
[windows-jdk9] [INFO] Downloaded: https://repo.maven.apache.org/maven2/org/apache/maven/shared/maven-shared-resources/2/maven-shared-resources-2.jar (13 kB at 335 kB/s)
[windows-jdk9] [INFO] Downloading: https://repo.maven.apache.org/maven2/org/codehaus/plexus/plexus-resources/1.1.0/plexus-resources-1.1.0.jar
[windows-jdk9] [INFO] Downloaded: https://repo.maven.apache.org/maven2/commons-logging/commons-logging/1.0.4/commons-logging-1.0.4.jar (38 kB at 1.0 MB/s)
[windows-jdk9] [INFO] Downloading: https://repo.maven.apache.org/maven2/com/puppycrawl/tools/checkstyle/6.18/checkstyle-6.18.jar
[windows-jdk9] [INFO] Downloaded: https://repo.maven.apache.org/maven2/org/apache/maven/doxia/doxia-core/1.2/doxia-core-1.2.jar (154 kB at 3.9 MB/s)
[windows-jdk9] [INFO] Downloading: https://repo.maven.apache.org/maven2/antlr/antlr/2.7.7/antlr-2.7.7.jar
[windows-jdk9] [INFO] Downloaded: https://repo.maven.apache.org/maven2/commons-io/commons-io/1.4/commons-io-1.4.jar (109 kB at 2.3 MB/s)
[windows-jdk9] [INFO] Downloading: https://repo.maven.apache.org/maven2/org/antlr/antlr4-runtime/4.5.3/antlr4-runtime-4.5.3.jar
[windows-jdk9] [INFO] Downloaded: https://repo.maven.apache.org/maven2/org/codehaus/plexus/plexus-resources/1.1.0/plexus-resources-1.1.0.jar (23 kB at 464 kB/s)
[windows-jdk9] [INFO] Downloading: https://repo.maven.apache.org/maven2/commons-beanutils/commons-beanutils/1.9.2/commons-beanutils-1.9.2.jar
[windows-jdk9] [INFO] Downloaded: https://repo.maven.apache.org/maven2/commons-digester/commons-digester/1.6/commons-digester-1.6.jar (168 kB at 3.1 MB/s)
[windows-jdk9] [INFO] Downloading: https://repo.maven.apache.org/maven2/commons-cli/commons-cli/1.3.1/commons-cli-1.3.1.jar
[windows-jdk9] [INFO] Downloaded: https://repo.maven.apache.org/maven2/commons-cli/commons-cli/1.3.1/commons-cli-1.3.1.jar (53 kB at 803 kB/s)
[windows-jdk9] [INFO] Downloading: https://repo.maven.apache.org/maven2/com/google/guava/guava/19.0/guava-19.0.jar
[windows-jdk9] [INFO] Downloaded: https://repo.maven.apache.org/maven2/antlr/antlr/2.7.7/antlr-2.7.7.jar (445 kB at 6.3 MB/s)
[windows-jdk9] [INFO] Downloading: https://repo.maven.apache.org/maven2/commons-lang/commons-lang/2.1/commons-lang-2.1.jar
[windows-jdk9] [INFO] Downloaded: https://repo.maven.apache.org/maven2/commons-beanutils/commons-beanutils/1.9.2/commons-beanutils-1.9.2.jar (234 kB at 3.3 MB/s)
[windows-jdk9] [INFO] Downloading: https://repo.maven.apache.org/maven2/javax/xml/bind/jaxb-api/2.3.0/jaxb-api-2.3.0.jar
[windows-jdk9] [INFO] Downloaded: https://repo.maven.apache.org/maven2/org/antlr/antlr4-runtime/4.5.3/antlr4-runtime-4.5.3.jar (302 kB at 4.1 MB/s)
[windows-jdk9] [INFO] Downloaded: https://repo.maven.apache.org/maven2/commons-lang/commons-lang/2.1/commons-lang-2.1.jar (208 kB at 2.3 MB/s)
[windows-jdk9] [INFO] Downloaded: https://repo.maven.apache.org/maven2/javax/xml/bind/jaxb-api/2.3.0/jaxb-api-2.3.0.jar (126 kB at 1.4 MB/s)
[windows-jdk9] [INFO] Downloaded: https://repo.maven.apache.org/maven2/com/puppycrawl/tools/checkstyle/6.18/checkstyle-6.18.jar (1.2 MB at 12 MB/s)
[windows-jdk9] [INFO] Downloaded: https://repo.maven.apache.org/maven2/com/google/guava/guava/19.0/guava-19.0.jar (2.3 MB at 16 MB/s)
[windows-jdk9] [INFO] There are 4 errors reported by Checkstyle 6.18 with config/maven_checks.xml ruleset.
[windows-jdk9] [INFO] Ignored 4 errors, 0 violation remaining.
[windows-jdk9] [INFO] 
[windows-jdk9] [INFO] --- maven-invoker-plugin:3.0.1:verify (integration-test) @ maven-javadoc-plugin ---
[windows-jdk9] [INFO] -------------------------------------------------
[windows-jdk9] [INFO] Build Summary:
[windows-jdk9] [INFO]   Passed: 35, Failed: 1, Errors: 0, Skipped: 0
[windows-jdk9] [INFO] -------------------------------------------------
[windows-jdk9] [WARNING] The following builds failed:
[windows-jdk9] [WARNING] *  detectLinks\pom.xml
[windows-jdk9] [INFO] -------------------------------------------------
[windows-jdk9] [WARNING] Ignoring that 1 build failed.
[windows-jdk9] [INFO] ------------------------------------------------------------------------
[windows-jdk9] [INFO] BUILD SUCCESS
[windows-jdk9] [INFO] ------------------------------------------------------------------------
[windows-jdk9] [INFO] Total time: 14:29 min
[windows-jdk9] [INFO] Finished at: 2018-04-01T17:34:33Z
[windows-jdk9] [INFO] Final Memory: 53M/178M
[windows-jdk9] [INFO] ------------------------------------------------------------------------
[windows-jdk9] [INFO] [jenkins-event-spy] Generated F:\jenkins\jenkins-slave\workspace\javadoc-plugin_MJAVADOC-521-4VCCRI6KPRH73A3RWPEXQVQHXBYIUVYDLQPEN3Z2IPPUYMQWLG3Q@tmp\withMaven0605b1c3\maven-spy-20180401-172003-54717256046394242989570.log
[Pipeline] [windows-jdk9] }
[Pipeline] [windows-jdk9] // dir
[Pipeline] [windows-jdk9] }
[windows-jdk9] [withMaven] junitPublisher - Archive test results for Maven artifact org.apache.maven.plugins:maven-javadoc-plugin:3.0.1-SNAPSHOT generated by maven-surefire-plugin:test (default-test): m\target\surefire-reports\*.xml
[windows-jdk9] [withMaven] junitPublisher - Jenkins JUnit Attachments Plugin not found, can't publish test attachments.Recording test results
[Pipeline] [windows-jdk9] // withMaven
[Pipeline] [windows-jdk9] }
[Pipeline] [windows-jdk9] // stage
[Pipeline] [windows-jdk9] }
[Pipeline] [windows-jdk9] // node
[Pipeline] [windows-jdk9] }
[Pipeline] // parallel
[Pipeline] stage
[Pipeline] { (Notifications)
[Pipeline] echo
Build result: UNSTABLE
[Pipeline] jiraIssueSelector
[Pipeline] jiraComment
[Pipeline] emailext
Mime
  • Unnamed multipart/mixed (inline, None, 0 bytes)
View raw message