maven-notifications mailing list archives

Site index · List index
Message view « Date » · « Thread »
Top « Date » · « Thread »
From Apache Jenkins Server <jenk...@builds.apache.org>
Subject Build failed in Jenkins: Maven TLP » maven-project-info-reports-plugin » MPIR-366 #13
Date Sun, 01 Apr 2018 14:00:08 GMT
See https://builds.apache.org/job/maven-box/job/maven-project-info-reports-plugin/job/MPIR-366/13/

Changes:

* [MPIR-366] Drop Maven2 support don't fail fast
* [MPIR-366] Drop Maven2 support don't fail fast
* [MPIR-366] Drop Maven2 support don't fail fast
* [MPIR-366] Drop Maven2 support don't fail fast

All tests passed

Build log:
[...truncated 1.28 MB...]
[windows-jdk8] [INFO] --- maven-invoker-plugin:2.0.0:verify (integration-test) @ maven-project-info-reports-plugin
---
[windows-jdk8] [INFO] -------------------------------------------------
[windows-jdk8] [INFO] Build Summary:
[windows-jdk8] [INFO]   Passed: 11, Failed: 0, Errors: 0, Skipped: 0
[windows-jdk8] [INFO] -------------------------------------------------
[windows-jdk8] [INFO] ------------------------------------------------------------------------
[windows-jdk8] [INFO] BUILD SUCCESS
[windows-jdk8] [INFO] ------------------------------------------------------------------------
[windows-jdk8] [INFO] Total time: 04:26 min
[windows-jdk8] [INFO] Finished at: 2018-04-01T13:58:39Z
[windows-jdk8] [INFO] Final Memory: 79M/2217M
[windows-jdk8] [INFO] ------------------------------------------------------------------------
[windows-jdk8] [INFO] [jenkins-event-spy] Generated F:\jenkins\jenkins-slave\workspace\nfo-reports-plugin_MPIR-366-S464FI4ATSVOULE3N7MCKV5FYYG6GVHDD7OLISMYBGUEPLQM2UNA@tmp\withMavend5a12ca5\maven-spy-20180401-135411-6358584764113453785228.log
[windows-jdk8] Picked up JAVA_TOOL_OPTIONS: -Dmaven.ext.class.path="f:\jenkins\jenkins-slave\workspace\nfo-reports-plugin_MPIR-366-S464FI4ATSVOULE3N7MCKV5FYYG6GVHDD7OLISMYBGUEPLQM2UNA@tmp\withMavend5a12ca5\pipeline-maven-spy.jar"
-Dorg.jenkinsci.plugins.pipeline.maven.reportsFolder="f:\jenkins\jenkins-slave\workspace\nfo-reports-plugin_MPIR-366-S464FI4ATSVOULE3N7MCKV5FYYG6GVHDD7OLISMYBGUEPLQM2UNA@tmp\withMavend5a12ca5"

[Pipeline] [windows-jdk8] }
[Pipeline] [windows-jdk8] // dir
[windows-jdk9] [INFO] run script verify.groovy
[windows-jdk9] [INFO] ..SUCCESS (19.6 s)
[windows-jdk9] [INFO] 
[windows-jdk9] [INFO] --- maven-checkstyle-plugin:2.15:check (checkstyle-check) @ maven-project-info-reports-plugin
---
[windows-jdk9] [INFO] Downloading: https://repo.maven.apache.org/maven2/org/apache/maven/shared/maven-shared-resources/2/maven-shared-resources-2.pom
[windows-jdk9] [INFO] Downloaded: https://repo.maven.apache.org/maven2/org/apache/maven/shared/maven-shared-resources/2/maven-shared-resources-2.pom
(3.0 kB at 197 kB/s)
[windows-jdk9] [INFO] Downloading: https://repo.maven.apache.org/maven2/org/codehaus/plexus/plexus-utils/3.0.10/plexus-utils-3.0.10.pom
[windows-jdk9] [INFO] Downloaded: https://repo.maven.apache.org/maven2/org/codehaus/plexus/plexus-utils/3.0.10/plexus-utils-3.0.10.pom
(3.1 kB at 262 kB/s)
[windows-jdk9] [INFO] Downloading: https://repo.maven.apache.org/maven2/org/codehaus/plexus/plexus-resources/1.0.1/plexus-resources-1.0.1.pom
[windows-jdk9] [INFO] Downloaded: https://repo.maven.apache.org/maven2/org/codehaus/plexus/plexus-resources/1.0.1/plexus-resources-1.0.1.pom
(1.3 kB at 101 kB/s)
[windows-jdk9] [INFO] Downloading: https://repo.maven.apache.org/maven2/com/puppycrawl/tools/checkstyle/6.1.1/checkstyle-6.1.1.pom
[windows-jdk9] [INFO] Downloaded: https://repo.maven.apache.org/maven2/com/puppycrawl/tools/checkstyle/6.1.1/checkstyle-6.1.1.pom
(30 kB at 2.2 MB/s)
[windows-jdk9] [INFO] Downloading: https://repo.maven.apache.org/maven2/org/antlr/antlr4-runtime/4.3/antlr4-runtime-4.3.pom
[windows-jdk9] [INFO] Downloaded: https://repo.maven.apache.org/maven2/org/antlr/antlr4-runtime/4.3/antlr4-runtime-4.3.pom
(4.8 kB at 399 kB/s)
[windows-jdk9] [INFO] Downloading: https://repo.maven.apache.org/maven2/org/antlr/antlr4-master/4.3/antlr4-master-4.3.pom
[windows-jdk9] [INFO] Downloaded: https://repo.maven.apache.org/maven2/org/antlr/antlr4-master/4.3/antlr4-master-4.3.pom
(7.9 kB at 566 kB/s)
[windows-jdk9] [INFO] Downloading: https://repo.maven.apache.org/maven2/org/abego/treelayout/org.abego.treelayout.core/1.0.1/org.abego.treelayout.core-1.0.1.pom
[windows-jdk9] [INFO] Downloaded: https://repo.maven.apache.org/maven2/org/abego/treelayout/org.abego.treelayout.core/1.0.1/org.abego.treelayout.core-1.0.1.pom
(3.1 kB at 259 kB/s)
[windows-jdk9] [INFO] Downloading: https://repo.maven.apache.org/maven2/org/antlr/antlr4-annotations/4.3/antlr4-annotations-4.3.pom
[windows-jdk9] [INFO] Downloaded: https://repo.maven.apache.org/maven2/org/antlr/antlr4-annotations/4.3/antlr4-annotations-4.3.pom
(1.3 kB at 106 kB/s)
[windows-jdk9] [INFO] Downloading: https://repo.maven.apache.org/maven2/commons-beanutils/commons-beanutils-core/1.8.3/commons-beanutils-core-1.8.3.pom
[windows-jdk9] [INFO] Downloaded: https://repo.maven.apache.org/maven2/commons-beanutils/commons-beanutils-core/1.8.3/commons-beanutils-core-1.8.3.pom
(1.6 kB at 126 kB/s)
[windows-jdk9] [INFO] Downloading: https://repo.maven.apache.org/maven2/com/google/guava/guava/18.0/guava-18.0.pom
[windows-jdk9] [INFO] Downloaded: https://repo.maven.apache.org/maven2/com/google/guava/guava/18.0/guava-18.0.pom
(5.7 kB at 436 kB/s)
[windows-jdk9] [INFO] Downloading: https://repo.maven.apache.org/maven2/com/google/guava/guava-parent/18.0/guava-parent-18.0.pom
[windows-jdk9] [INFO] Downloaded: https://repo.maven.apache.org/maven2/com/google/guava/guava-parent/18.0/guava-parent-18.0.pom
(7.7 kB at 699 kB/s)
[windows-jdk9] [INFO] Downloading: https://repo.maven.apache.org/maven2/com/puppycrawl/tools/checkstyle/6.1.1/checkstyle-6.1.1.jar
[windows-jdk9] [INFO] Downloading: https://repo.maven.apache.org/maven2/org/antlr/antlr4-runtime/4.3/antlr4-runtime-4.3.jar
[windows-jdk9] [INFO] Downloading: https://repo.maven.apache.org/maven2/org/codehaus/plexus/plexus-resources/1.0.1/plexus-resources-1.0.1.jar
[windows-jdk9] [INFO] Downloading: https://repo.maven.apache.org/maven2/org/abego/treelayout/org.abego.treelayout.core/1.0.1/org.abego.treelayout.core-1.0.1.jar
[windows-jdk9] [INFO] Downloading: https://repo.maven.apache.org/maven2/org/apache/maven/shared/maven-shared-resources/2/maven-shared-resources-2.jar
[windows-jdk9] [INFO] Downloaded: https://repo.maven.apache.org/maven2/com/puppycrawl/tools/checkstyle/6.1.1/checkstyle-6.1.1.jar
(1.0 MB at 21 MB/s)
[windows-jdk9] [INFO] Downloading: https://repo.maven.apache.org/maven2/org/antlr/antlr4-annotations/4.3/antlr4-annotations-4.3.jar
[windows-jdk9] [INFO] Downloaded: https://repo.maven.apache.org/maven2/org/antlr/antlr4-annotations/4.3/antlr4-annotations-4.3.jar
(10 kB at 116 kB/s)
[windows-jdk9] [INFO] Downloading: https://repo.maven.apache.org/maven2/commons-beanutils/commons-beanutils-core/1.8.3/commons-beanutils-core-1.8.3.jar
[windows-jdk9] [INFO] Downloaded: https://repo.maven.apache.org/maven2/commons-beanutils/commons-beanutils-core/1.8.3/commons-beanutils-core-1.8.3.jar
(207 kB at 1.9 MB/s)
[windows-jdk9] [INFO] Downloading: https://repo.maven.apache.org/maven2/com/google/guava/guava/18.0/guava-18.0.jar
[windows-jdk9] [INFO] Downloaded: https://repo.maven.apache.org/maven2/org/antlr/antlr4-runtime/4.3/antlr4-runtime-4.3.jar
(345 kB at 2.7 MB/s)
[windows-jdk9] [INFO] Downloaded: https://repo.maven.apache.org/maven2/org/abego/treelayout/org.abego.treelayout.core/1.0.1/org.abego.treelayout.core-1.0.1.jar
(26 kB at 158 kB/s)
[windows-jdk9] [INFO] Downloaded: https://repo.maven.apache.org/maven2/com/google/guava/guava/18.0/guava-18.0.jar
(2.3 MB at 13 MB/s)
[windows-jdk9] [INFO] Downloaded: https://repo.maven.apache.org/maven2/org/codehaus/plexus/plexus-resources/1.0.1/plexus-resources-1.0.1.jar
(22 kB at 118 kB/s)
[windows-jdk9] [INFO] Downloaded: https://repo.maven.apache.org/maven2/org/apache/maven/shared/maven-shared-resources/2/maven-shared-resources-2.jar
(13 kB at 58 kB/s)
[windows-jdk9] [INFO] There are 10 errors reported by Checkstyle 6.1.1 with config/maven_checks.xml
ruleset.
[windows-jdk9] [INFO] Ignored 10 errors, 0 violation remaining.
[windows-jdk9] [INFO] 
[windows-jdk9] [INFO] --- maven-jarsigner-plugin:1.3.2:verify (verify) @ maven-project-info-reports-plugin
---
[windows-jdk9] [WARNING] Picked up JAVA_TOOL_OPTIONS: -Dmaven.ext.class.path="f:\jenkins\jenkins-slave\workspace\nfo-reports-plugin_MPIR-366-S464FI4ATSVOULE3N7MCKV5FYYG6GVHDD7OLISMYBGUEPLQM2UNA@tmp\withMaven34645325\pipeline-maven-spy.jar"
-Dorg.jenkinsci.plugins.pipeline.maven.reportsFolder="f:\jenkins\jenkins-slave\workspace\nfo-reports-plugin_MPIR-366-S464FI4ATSVOULE3N7MCKV5FYYG6GVHDD7OLISMYBGUEPLQM2UNA@tmp\withMaven34645325"

[windows-jdk9] [INFO] 1 archive(s) processed
[windows-jdk9] [INFO] 
[windows-jdk9] [INFO] --- maven-invoker-plugin:2.0.0:verify (integration-test) @ maven-project-info-reports-plugin
---
[windows-jdk9] [INFO] -------------------------------------------------
[windows-jdk9] [INFO] Build Summary:
[windows-jdk9] [INFO]   Passed: 11, Failed: 0, Errors: 0, Skipped: 0
[windows-jdk9] [INFO] -------------------------------------------------
[windows-jdk9] [INFO] ------------------------------------------------------------------------
[windows-jdk9] [INFO] BUILD SUCCESS
[windows-jdk9] [INFO] ------------------------------------------------------------------------
[windows-jdk9] [INFO] Total time: 03:48 min
[windows-jdk9] [INFO] Finished at: 2018-04-01T13:58:41Z
[windows-jdk9] [INFO] Final Memory: 53M/177M
[windows-jdk9] [INFO] ------------------------------------------------------------------------
[windows-jdk9] [INFO] [jenkins-event-spy] Generated F:\jenkins\jenkins-slave\workspace\nfo-reports-plugin_MPIR-366-S464FI4ATSVOULE3N7MCKV5FYYG6GVHDD7OLISMYBGUEPLQM2UNA@tmp\withMaven34645325\maven-spy-20180401-135452-57511683435379337498029.log
[Pipeline] [windows-jdk8] }
[windows-jdk8] [withMaven] junitPublisher - Archive test results for Maven artifact org.apache.maven.plugins:maven-project-info-reports-plugin:2.10-SNAPSHOT
generated by maven-surefire-plugin:test (default-test): m\target\surefire-reports\*.xml
[windows-jdk8] [withMaven] junitPublisher - Jenkins JUnit Attachments Plugin not found, can't
publish test attachments.Recording test results
[windows-jdk8] [withMaven] junitPublisher - Archive test results for Maven artifact org.apache.maven.plugins.project-info-reports.its:dep:1.0-SNAPSHOT
generated by maven-surefire-plugin:test (default-test): m\target\it\multi-module\dep\target\surefire-reports\*.xml
[windows-jdk8] [withMaven] junitPublisher - Jenkins JUnit Attachments Plugin not found, can't
publish test attachments.Recording test results
[windows-jdk8] None of the test reports contained any result
[windows-jdk8] [withMaven] junitPublisher - Archive test results for Maven artifact org.apache.maven.plugins.project-info-reports.its:main:1.0-SNAPSHOT
generated by maven-surefire-plugin:test (default-test): m\target\it\multi-module\main\target\surefire-reports\*.xml
[windows-jdk8] [withMaven] junitPublisher - Jenkins JUnit Attachments Plugin not found, can't
publish test attachments.Recording test results
[windows-jdk8] None of the test reports contained any result
[Pipeline] [windows-jdk8] // withMaven
[Pipeline] [windows-jdk8] }
[Pipeline] [windows-jdk9] }
[Pipeline] [windows-jdk8] // stage
[Pipeline] [windows-jdk9] // dir
[windows-jdk10] [INFO] ..FAILED (25.1 s)
[windows-jdk10] [INFO]   The build exited with code 1. See f:\jenkins\jenkins-slave\workspace\nfo-reports-plugin_MPIR-366-S464FI4ATSVOULE3N7MCKV5FYYG6GVHDD7OLISMYBGUEPLQM2UNA@2\m\target\it\dependencies-java-1.7-and-1.8\build.log
for details.
[windows-jdk10] [INFO] Building: full-pom\pom.xml
[windows-jdk10] [INFO] ..FAILED (6.6 s)
[windows-jdk10] [INFO]   The build exited with code 1. See f:\jenkins\jenkins-slave\workspace\nfo-reports-plugin_MPIR-366-S464FI4ATSVOULE3N7MCKV5FYYG6GVHDD7OLISMYBGUEPLQM2UNA@2\m\target\it\full-pom\build.log
for details.
[windows-jdk10] [INFO] Building: git\pom.xml
[windows-jdk10] [INFO] ..FAILED (3.5 s)
[windows-jdk10] [INFO]   The build exited with code 1. See f:\jenkins\jenkins-slave\workspace\nfo-reports-plugin_MPIR-366-S464FI4ATSVOULE3N7MCKV5FYYG6GVHDD7OLISMYBGUEPLQM2UNA@2\m\target\it\git\build.log
for details.
[windows-jdk10] [INFO] Building: java-version\pom.xml
[Pipeline] [windows-jdk8] }
[Pipeline] [windows-jdk9] }
[windows-jdk9] [withMaven] junitPublisher - Archive test results for Maven artifact org.apache.maven.plugins:maven-project-info-reports-plugin:2.10-SNAPSHOT
generated by maven-surefire-plugin:test (default-test): m\target\surefire-reports\*.xml
[windows-jdk9] [withMaven] junitPublisher - Jenkins JUnit Attachments Plugin not found, can't
publish test attachments.Recording test results
[windows-jdk9] [withMaven] junitPublisher - Archive test results for Maven artifact org.apache.maven.plugins.project-info-reports.its:dep:1.0-SNAPSHOT
generated by maven-surefire-plugin:test (default-test): m\target\it\multi-module\dep\target\surefire-reports\*.xml
[windows-jdk9] [withMaven] junitPublisher - Jenkins JUnit Attachments Plugin not found, can't
publish test attachments.Recording test results
[windows-jdk9] None of the test reports contained any result
[windows-jdk9] [withMaven] junitPublisher - Archive test results for Maven artifact org.apache.maven.plugins.project-info-reports.its:main:1.0-SNAPSHOT
generated by maven-surefire-plugin:test (default-test): m\target\it\multi-module\main\target\surefire-reports\*.xml
[windows-jdk9] [withMaven] junitPublisher - Jenkins JUnit Attachments Plugin not found, can't
publish test attachments.Recording test results
[windows-jdk9] None of the test reports contained any result
[Pipeline] [windows-jdk8] // node
[Pipeline] [windows-jdk9] // withMaven
[Pipeline] [windows-jdk8] }
[Pipeline] [windows-jdk9] }
[Pipeline] [windows-jdk9] // stage
[Pipeline] [windows-jdk9] }
[Pipeline] [windows-jdk9] // node
[Pipeline] [windows-jdk9] }
[windows-jdk10] [INFO] run script verify.groovy
[windows-jdk10] WARNING: An illegal reflective access operation has occurred
[windows-jdk10] WARNING: Illegal reflective access by org.codehaus.groovy.reflection.CachedClass$3$1
(file:/f:/jenkins/jenkins-slave/workspace/nfo-reports-plugin_MPIR-366-S464FI4ATSVOULE3N7MCKV5FYYG6GVHDD7OLISMYBGUEPLQM2UNA@2/.repository/org/codehaus/groovy/groovy/2.0.1/groovy-2.0.1.jar)
to method java.lang.Object.finalize()
[windows-jdk10] WARNING: Please consider reporting this to the maintainers of org.codehaus.groovy.reflection.CachedClass$3$1
[windows-jdk10] WARNING: Use --illegal-access=warn to enable warnings of further illegal reflective
access operations
[windows-jdk10] WARNING: All illegal access operations will be denied in a future release
[windows-jdk10] [INFO] ..SUCCESS (4.2 s)
[windows-jdk10] [INFO] Building: minimal-pom\pom.xml
[windows-jdk10] [INFO] ..FAILED (3.5 s)
[windows-jdk10] [INFO]   The build exited with code 1. See f:\jenkins\jenkins-slave\workspace\nfo-reports-plugin_MPIR-366-S464FI4ATSVOULE3N7MCKV5FYYG6GVHDD7OLISMYBGUEPLQM2UNA@2\m\target\it\minimal-pom\build.log
for details.
[windows-jdk10] [INFO] Building: mpir-229\pom.xml
[windows-jdk10] [INFO] ..FAILED (3.4 s)
[windows-jdk10] [INFO]   The build exited with code 1. See f:\jenkins\jenkins-slave\workspace\nfo-reports-plugin_MPIR-366-S464FI4ATSVOULE3N7MCKV5FYYG6GVHDD7OLISMYBGUEPLQM2UNA@2\m\target\it\mpir-229\build.log
for details.
[windows-jdk10] [INFO] Building: MPIR-242\pom.xml
[windows-jdk10] [INFO] ..FAILED (3.5 s)
[windows-jdk10] [INFO]   The build exited with code 1. See f:\jenkins\jenkins-slave\workspace\nfo-reports-plugin_MPIR-366-S464FI4ATSVOULE3N7MCKV5FYYG6GVHDD7OLISMYBGUEPLQM2UNA@2\m\target\it\MPIR-242\build.log
for details.
[windows-jdk10] [INFO] Building: MPIR-251\pom.xml
[windows-jdk10] [INFO] run script verify.groovy
[windows-jdk10] [INFO] ..SUCCESS (9.1 s)
[windows-jdk10] [INFO] Building: MPIR-300\pom.xml
[windows-jdk10] [INFO] run script verify.groovy
[windows-jdk10] [INFO] ..SUCCESS (3.9 s)
[windows-jdk10] [INFO] Building: MPIR-349\parent\pom.xml
[windows-jdk10] [INFO] run script verify.groovy
[windows-jdk10] [INFO] ..SUCCESS (6.6 s)
[windows-jdk10] [INFO] Building: multi-module\pom.xml
[windows-jdk10] [INFO] ..FAILED (13.4 s)
[windows-jdk10] [INFO]   The build exited with code 1. See f:\jenkins\jenkins-slave\workspace\nfo-reports-plugin_MPIR-366-S464FI4ATSVOULE3N7MCKV5FYYG6GVHDD7OLISMYBGUEPLQM2UNA@2\m\target\it\multi-module\build.log
for details.
[windows-jdk10] [INFO] 
[windows-jdk10] [INFO] --- maven-checkstyle-plugin:2.15:check (checkstyle-check) @ maven-project-info-reports-plugin
---
[windows-jdk10] [INFO] Downloading: https://repo.maven.apache.org/maven2/org/apache/maven/shared/maven-shared-resources/2/maven-shared-resources-2.pom
[windows-jdk10] [INFO] Downloaded: https://repo.maven.apache.org/maven2/org/apache/maven/shared/maven-shared-resources/2/maven-shared-resources-2.pom
(3.0 kB at 246 kB/s)
[windows-jdk10] [INFO] Downloading: https://repo.maven.apache.org/maven2/org/codehaus/plexus/plexus-utils/3.0.10/plexus-utils-3.0.10.pom
[windows-jdk10] [INFO] Downloaded: https://repo.maven.apache.org/maven2/org/codehaus/plexus/plexus-utils/3.0.10/plexus-utils-3.0.10.pom
(3.1 kB at 262 kB/s)
[windows-jdk10] [INFO] Downloading: https://repo.maven.apache.org/maven2/org/codehaus/plexus/plexus-resources/1.0.1/plexus-resources-1.0.1.pom
[windows-jdk10] [INFO] Downloaded: https://repo.maven.apache.org/maven2/org/codehaus/plexus/plexus-resources/1.0.1/plexus-resources-1.0.1.pom
(1.3 kB at 120 kB/s)
[windows-jdk10] [INFO] Downloading: https://repo.maven.apache.org/maven2/com/puppycrawl/tools/checkstyle/6.1.1/checkstyle-6.1.1.pom
[windows-jdk10] [INFO] Downloaded: https://repo.maven.apache.org/maven2/com/puppycrawl/tools/checkstyle/6.1.1/checkstyle-6.1.1.pom
(30 kB at 2.0 MB/s)
[windows-jdk10] [INFO] Downloading: https://repo.maven.apache.org/maven2/org/antlr/antlr4-runtime/4.3/antlr4-runtime-4.3.pom
[windows-jdk10] [INFO] Downloaded: https://repo.maven.apache.org/maven2/org/antlr/antlr4-runtime/4.3/antlr4-runtime-4.3.pom
(4.8 kB at 368 kB/s)
[windows-jdk10] [INFO] Downloading: https://repo.maven.apache.org/maven2/org/antlr/antlr4-master/4.3/antlr4-master-4.3.pom
[windows-jdk10] [INFO] Downloaded: https://repo.maven.apache.org/maven2/org/antlr/antlr4-master/4.3/antlr4-master-4.3.pom
(7.9 kB at 610 kB/s)
[windows-jdk10] [INFO] Downloading: https://repo.maven.apache.org/maven2/org/abego/treelayout/org.abego.treelayout.core/1.0.1/org.abego.treelayout.core-1.0.1.pom
[windows-jdk10] [INFO] Downloaded: https://repo.maven.apache.org/maven2/org/abego/treelayout/org.abego.treelayout.core/1.0.1/org.abego.treelayout.core-1.0.1.pom
(3.1 kB at 345 kB/s)
[windows-jdk10] [INFO] Downloading: https://repo.maven.apache.org/maven2/org/antlr/antlr4-annotations/4.3/antlr4-annotations-4.3.pom
[windows-jdk10] [INFO] Downloaded: https://repo.maven.apache.org/maven2/org/antlr/antlr4-annotations/4.3/antlr4-annotations-4.3.pom
(1.3 kB at 106 kB/s)
[windows-jdk10] [INFO] Downloading: https://repo.maven.apache.org/maven2/commons-beanutils/commons-beanutils-core/1.8.3/commons-beanutils-core-1.8.3.pom
[windows-jdk10] [INFO] Downloaded: https://repo.maven.apache.org/maven2/commons-beanutils/commons-beanutils-core/1.8.3/commons-beanutils-core-1.8.3.pom
(1.6 kB at 126 kB/s)
[windows-jdk10] [INFO] Downloading: https://repo.maven.apache.org/maven2/com/google/guava/guava/18.0/guava-18.0.pom
[windows-jdk10] [INFO] Downloaded: https://repo.maven.apache.org/maven2/com/google/guava/guava/18.0/guava-18.0.pom
(5.7 kB at 472 kB/s)
[windows-jdk10] [INFO] Downloading: https://repo.maven.apache.org/maven2/com/google/guava/guava-parent/18.0/guava-parent-18.0.pom
[windows-jdk10] [INFO] Downloaded: https://repo.maven.apache.org/maven2/com/google/guava/guava-parent/18.0/guava-parent-18.0.pom
(7.7 kB at 961 kB/s)
[windows-jdk10] [INFO] Downloading: https://repo.maven.apache.org/maven2/org/apache/maven/shared/maven-shared-resources/2/maven-shared-resources-2.jar
[windows-jdk10] [INFO] Downloading: https://repo.maven.apache.org/maven2/com/puppycrawl/tools/checkstyle/6.1.1/checkstyle-6.1.1.jar
[windows-jdk10] [INFO] Downloading: https://repo.maven.apache.org/maven2/org/antlr/antlr4-runtime/4.3/antlr4-runtime-4.3.jar
[windows-jdk10] [INFO] Downloading: https://repo.maven.apache.org/maven2/org/codehaus/plexus/plexus-resources/1.0.1/plexus-resources-1.0.1.jar
[windows-jdk10] [INFO] Downloading: https://repo.maven.apache.org/maven2/org/abego/treelayout/org.abego.treelayout.core/1.0.1/org.abego.treelayout.core-1.0.1.jar
[windows-jdk10] [INFO] Downloaded: https://repo.maven.apache.org/maven2/com/puppycrawl/tools/checkstyle/6.1.1/checkstyle-6.1.1.jar
(1.0 MB at 12 MB/s)
[windows-jdk10] [INFO] Downloading: https://repo.maven.apache.org/maven2/org/antlr/antlr4-annotations/4.3/antlr4-annotations-4.3.jar
[windows-jdk10] [INFO] Downloaded: https://repo.maven.apache.org/maven2/org/codehaus/plexus/plexus-resources/1.0.1/plexus-resources-1.0.1.jar
(22 kB at 210 kB/s)
[windows-jdk10] [INFO] Downloading: https://repo.maven.apache.org/maven2/commons-beanutils/commons-beanutils-core/1.8.3/commons-beanutils-core-1.8.3.jar
[windows-jdk10] [INFO] Downloaded: https://repo.maven.apache.org/maven2/org/antlr/antlr4-runtime/4.3/antlr4-runtime-4.3.jar
(345 kB at 3.1 MB/s)
[windows-jdk10] [INFO] Downloading: https://repo.maven.apache.org/maven2/com/google/guava/guava/18.0/guava-18.0.jar
[windows-jdk10] [INFO] Downloaded: https://repo.maven.apache.org/maven2/org/antlr/antlr4-annotations/4.3/antlr4-annotations-4.3.jar
(10 kB at 78 kB/s)
[windows-jdk10] [INFO] Downloaded: https://repo.maven.apache.org/maven2/commons-beanutils/commons-beanutils-core/1.8.3/commons-beanutils-core-1.8.3.jar
(207 kB at 1.5 MB/s)
[windows-jdk10] [INFO] Downloaded: https://repo.maven.apache.org/maven2/org/apache/maven/shared/maven-shared-resources/2/maven-shared-resources-2.jar
(13 kB at 71 kB/s)
[windows-jdk10] [INFO] Downloaded: https://repo.maven.apache.org/maven2/com/google/guava/guava/18.0/guava-18.0.jar
(2.3 MB at 12 MB/s)
[windows-jdk10] [INFO] Downloaded: https://repo.maven.apache.org/maven2/org/abego/treelayout/org.abego.treelayout.core/1.0.1/org.abego.treelayout.core-1.0.1.jar
(26 kB at 122 kB/s)
[windows-jdk10] [INFO] There are 10 errors reported by Checkstyle 6.1.1 with config/maven_checks.xml
ruleset.
[windows-jdk10] [INFO] Ignored 10 errors, 0 violation remaining.
[windows-jdk10] [INFO] 
[windows-jdk10] [INFO] --- maven-jarsigner-plugin:1.3.2:verify (verify) @ maven-project-info-reports-plugin
---
[windows-jdk10] [WARNING] Picked up JAVA_TOOL_OPTIONS: -Dmaven.ext.class.path="f:\jenkins\jenkins-slave\workspace\nfo-reports-plugin_MPIR-366-S464FI4ATSVOULE3N7MCKV5FYYG6GVHDD7OLISMYBGUEPLQM2UNA@2@tmp\withMavenfdaa4ea8\pipeline-maven-spy.jar"
-Dorg.jenkinsci.plugins.pipeline.maven.reportsFolder="f:\jenkins\jenkins-slave\workspace\nfo-reports-plugin_MPIR-366-S464FI4ATSVOULE3N7MCKV5FYYG6GVHDD7OLISMYBGUEPLQM2UNA@2@tmp\withMavenfdaa4ea8"

[windows-jdk10] [INFO] 1 archive(s) processed
[windows-jdk10] [INFO] 
[windows-jdk10] [INFO] --- maven-invoker-plugin:2.0.0:verify (integration-test) @ maven-project-info-reports-plugin
---
[windows-jdk10] [INFO] -------------------------------------------------
[windows-jdk10] [INFO] Build Summary:
[windows-jdk10] [INFO]   Passed: 4, Failed: 7, Errors: 0, Skipped: 0
[windows-jdk10] [INFO] -------------------------------------------------
[windows-jdk10] [ERROR] The following builds failed:
[windows-jdk10] [ERROR] *  dependencies-java-1.7-and-1.8\pom.xml
[windows-jdk10] [ERROR] *  full-pom\pom.xml
[windows-jdk10] [ERROR] *  git\pom.xml
[windows-jdk10] [ERROR] *  minimal-pom\pom.xml
[windows-jdk10] [ERROR] *  mpir-229\pom.xml
[windows-jdk10] [ERROR] *  MPIR-242\pom.xml
[windows-jdk10] [ERROR] *  multi-module\pom.xml
[windows-jdk10] [INFO] -------------------------------------------------
[windows-jdk10] [INFO] ------------------------------------------------------------------------
[windows-jdk10] [INFO] BUILD FAILURE
[windows-jdk10] [INFO] ------------------------------------------------------------------------
[windows-jdk10] [INFO] Total time: 02:55 min
[windows-jdk10] [INFO] Finished at: 2018-04-01T13:59:47Z
[windows-jdk10] [INFO] Final Memory: 49M/174M
[windows-jdk10] [INFO] ------------------------------------------------------------------------
[windows-jdk10] [INFO] [jenkins-event-spy] Generated F:\jenkins\jenkins-slave\workspace\nfo-reports-plugin_MPIR-366-S464FI4ATSVOULE3N7MCKV5FYYG6GVHDD7OLISMYBGUEPLQM2UNA@2@tmp\withMavenfdaa4ea8\maven-spy-20180401-135651-7308561720385576008747.log
[windows-jdk10] [ERROR] Failed to execute goal org.apache.maven.plugins:maven-invoker-plugin:2.0.0:verify
(integration-test) on project maven-project-info-reports-plugin: 7 builds failed. See console
output above for details. -> [Help 1]
[windows-jdk10] [ERROR] 
[windows-jdk10] [ERROR] To see the full stack trace of the errors, re-run Maven with the -e
switch.
[windows-jdk10] [ERROR] Re-run Maven using the -X switch to enable full debug logging.
[windows-jdk10] [ERROR] 
[windows-jdk10] [ERROR] For more information about the errors and possible solutions, please
read the following articles:
[windows-jdk10] [ERROR] [Help 1] http://cwiki.apache.org/confluence/display/MAVEN/MojoFailureException
[Pipeline] [windows-jdk10] }
[Pipeline] [windows-jdk10] // dir
[Pipeline] [windows-jdk10] }
[windows-jdk10] [withMaven] junitPublisher - Archive test results for Maven artifact org.apache.maven.plugins:maven-project-info-reports-plugin:2.10-SNAPSHOT
generated by maven-surefire-plugin:test (default-test): m\target\surefire-reports\*.xml
[windows-jdk10] [withMaven] junitPublisher - Jenkins JUnit Attachments Plugin not found, can't
publish test attachments.Recording test results
[windows-jdk10] [withMaven] junitPublisher - Archive test results for Maven artifact org.apache.maven.plugins.project-info-reports.its:dep:1.0-SNAPSHOT
generated by maven-surefire-plugin:test (default-test): m\target\it\multi-module\dep\target\surefire-reports\*.xml
[windows-jdk10] [withMaven] junitPublisher - Jenkins JUnit Attachments Plugin not found, can't
publish test attachments.Recording test results
[windows-jdk10] None of the test reports contained any result
[windows-jdk10] [withMaven] junitPublisher - Archive test results for Maven artifact org.apache.maven.plugins.project-info-reports.its:main:1.0-SNAPSHOT
generated by maven-surefire-plugin:test (default-test): m\target\it\multi-module\main\target\surefire-reports\*.xml
[windows-jdk10] [withMaven] junitPublisher - Jenkins JUnit Attachments Plugin not found, can't
publish test attachments.Recording test results
[windows-jdk10] None of the test reports contained any result
[Pipeline] [windows-jdk10] // withMaven
[Pipeline] [windows-jdk10] }
[Pipeline] [windows-jdk10] // stage
[Pipeline] [windows-jdk10] }
[Pipeline] [windows-jdk10] // node
[Pipeline] [windows-jdk10] }
[windows-jdk10] Failed in branch windows-jdk10
[Pipeline] // parallel
[Pipeline] stage
[Pipeline] { (Notifications)
[Pipeline] echo
Build result: FAILURE
[Pipeline] jiraIssueSelector
[Pipeline] jiraComment
[Pipeline] emailext
Mime
  • Unnamed multipart/mixed (inline, None, 0 bytes)
View raw message