maven-notifications mailing list archives

Site index · List index
Message view « Date » · « Thread »
Top « Date » · « Thread »
From Apache Jenkins Server <jenk...@builds.apache.org>
Subject Build failed in Jenkins: Maven TLP » maven-archetypes » master #7
Date Mon, 02 Apr 2018 21:49:04 GMT
See https://builds.apache.org/job/maven-box/job/maven-archetypes/job/master/7/

Changes:

* [maven-release-plugin] prepare release maven-archetype-bundles-1.3
* [maven-release-plugin] prepare release maven-archetype-bundles-1.3
* [maven-release-plugin] prepare release maven-archetype-bundles-1.3
* [maven-release-plugin] prepare release maven-archetype-bundles-1.3
* [maven-release-plugin] prepare release maven-archetype-bundles-1.3
* [maven-release-plugin] prepare release maven-archetype-bundles-1.3
* [maven-release-plugin] prepare release maven-archetype-bundles-1.3

No tests ran.

Build log:
[...truncated 1.40 MB...]
[linux-jdk10] [INFO] Downloaded from central: https://repo.maven.apache.org/maven2/antlr/antlr/2.7.7/antlr-2.7.7.pom
(632 B at 57 kB/s)
[linux-jdk10] [INFO] Downloading from central: https://repo.maven.apache.org/maven2/org/antlr/antlr4-runtime/4.5.3/antlr4-runtime-4.5.3.pom
[linux-jdk10] [INFO] Downloaded from central: https://repo.maven.apache.org/maven2/org/antlr/antlr4-runtime/4.5.3/antlr4-runtime-4.5.3.pom
(2.3 kB at 210 kB/s)
[linux-jdk10] [INFO] Downloading from central: https://repo.maven.apache.org/maven2/org/antlr/antlr4-master/4.5.3/antlr4-master-4.5.3.pom
[linux-jdk10] [INFO] Downloaded from central: https://repo.maven.apache.org/maven2/org/antlr/antlr4-master/4.5.3/antlr4-master-4.5.3.pom
(3.7 kB at 335 kB/s)
[linux-jdk10] [INFO] Downloading from central: https://repo.maven.apache.org/maven2/commons-beanutils/commons-beanutils/1.9.2/commons-beanutils-1.9.2.pom
[linux-jdk10] [INFO] Downloaded from central: https://repo.maven.apache.org/maven2/commons-beanutils/commons-beanutils/1.9.2/commons-beanutils-1.9.2.pom
(14 kB at 1.2 MB/s)
[linux-jdk10] [INFO] Downloading from central: https://repo.maven.apache.org/maven2/org/apache/commons/commons-parent/33/commons-parent-33.pom
[linux-jdk10] [INFO] Downloaded from central: https://repo.maven.apache.org/maven2/org/apache/commons/commons-parent/33/commons-parent-33.pom
(53 kB at 4.4 MB/s)
[linux-jdk10] [INFO] Downloading from central: https://repo.maven.apache.org/maven2/commons-cli/commons-cli/1.3.1/commons-cli-1.3.1.pom
[linux-jdk10] [INFO] Downloaded from central: https://repo.maven.apache.org/maven2/commons-cli/commons-cli/1.3.1/commons-cli-1.3.1.pom
(10 kB at 945 kB/s)
[linux-jdk10] [INFO] Downloading from central: https://repo.maven.apache.org/maven2/com/google/guava/guava/19.0/guava-19.0.pom
[linux-jdk10] [INFO] Downloaded from central: https://repo.maven.apache.org/maven2/com/google/guava/guava/19.0/guava-19.0.pom
(6.8 kB at 522 kB/s)
[linux-jdk10] [INFO] Downloading from central: https://repo.maven.apache.org/maven2/com/google/guava/guava-parent/19.0/guava-parent-19.0.pom
[linux-jdk10] [INFO] Downloaded from central: https://repo.maven.apache.org/maven2/com/google/guava/guava-parent/19.0/guava-parent-19.0.pom
(9.9 kB at 823 kB/s)
[linux-jdk10] [INFO] Downloading from central: https://repo.maven.apache.org/maven2/org/sonatype/oss/oss-parent/7/oss-parent-7.pom
[linux-jdk10] [INFO] Downloaded from central: https://repo.maven.apache.org/maven2/org/sonatype/oss/oss-parent/7/oss-parent-7.pom
(4.8 kB at 371 kB/s)
[linux-jdk10] [INFO] Downloading from central: https://repo.maven.apache.org/maven2/javax/xml/bind/jaxb-api/2.3.0/jaxb-api-2.3.0.pom
[linux-jdk10] [INFO] Downloaded from central: https://repo.maven.apache.org/maven2/javax/xml/bind/jaxb-api/2.3.0/jaxb-api-2.3.0.pom
(23 kB at 1.9 MB/s)
[linux-jdk10] [INFO] Downloading from central: https://repo.maven.apache.org/maven2/javax/xml/bind/jaxb-api-parent/2.3.0/jaxb-api-parent-2.3.0.pom
[linux-jdk10] [INFO] Downloaded from central: https://repo.maven.apache.org/maven2/javax/xml/bind/jaxb-api-parent/2.3.0/jaxb-api-parent-2.3.0.pom
(5.6 kB at 513 kB/s)
[linux-jdk10] [INFO] Downloading from central: https://repo.maven.apache.org/maven2/net/java/jvnet-parent/5/jvnet-parent-5.pom
[linux-jdk10] [INFO] Downloaded from central: https://repo.maven.apache.org/maven2/net/java/jvnet-parent/5/jvnet-parent-5.pom
(8.9 kB at 739 kB/s)
[linux-jdk10] [INFO] Downloading from central: https://repo.maven.apache.org/maven2/org/apache/maven/shared/maven-shared-resources/2/maven-shared-resources-2.jar
[linux-jdk10] [INFO] Downloading from central: https://repo.maven.apache.org/maven2/org/apache/maven/reporting/maven-reporting-impl/2.3/maven-reporting-impl-2.3.jar
[linux-jdk10] [INFO] Downloading from central: https://repo.maven.apache.org/maven2/org/apache/maven/doxia/doxia-core/1.2/doxia-core-1.2.jar
[linux-jdk10] [INFO] Downloading from central: https://repo.maven.apache.org/maven2/xerces/xercesImpl/2.9.1/xercesImpl-2.9.1.jar
[linux-jdk10] [INFO] Downloading from central: https://repo.maven.apache.org/maven2/org/apache/maven/shared/maven-shared-utils/0.6/maven-shared-utils-0.6.jar
[linux-jdk10] [INFO] Downloaded from central: https://repo.maven.apache.org/maven2/org/apache/maven/reporting/maven-reporting-impl/2.3/maven-reporting-impl-2.3.jar
(18 kB at 1.4 MB/s)
[linux-jdk10] [INFO] Downloading from central: https://repo.maven.apache.org/maven2/xml-apis/xml-apis/1.3.04/xml-apis-1.3.04.jar
[linux-jdk10] [INFO] Downloaded from central: https://repo.maven.apache.org/maven2/org/apache/maven/shared/maven-shared-resources/2/maven-shared-resources-2.jar
(13 kB at 870 kB/s)
[linux-jdk10] [INFO] Downloading from central: https://repo.maven.apache.org/maven2/commons-digester/commons-digester/1.6/commons-digester-1.6.jar
[linux-jdk10] [INFO] Downloaded from central: https://repo.maven.apache.org/maven2/org/apache/maven/doxia/doxia-core/1.2/doxia-core-1.2.jar
(154 kB at 8.1 MB/s)
[linux-jdk10] [INFO] Downloading from central: https://repo.maven.apache.org/maven2/commons-logging/commons-logging/1.0.4/commons-logging-1.0.4.jar
[linux-jdk10] [INFO] Downloaded from central: https://repo.maven.apache.org/maven2/org/apache/maven/shared/maven-shared-utils/0.6/maven-shared-utils-0.6.jar
(165 kB at 7.2 MB/s)
[linux-jdk10] [INFO] Downloading from central: https://repo.maven.apache.org/maven2/org/apache/maven/doxia/doxia-sink-api/1.4/doxia-sink-api-1.4.jar
[linux-jdk10] [INFO] Downloaded from central: https://repo.maven.apache.org/maven2/commons-digester/commons-digester/1.6/commons-digester-1.6.jar
(168 kB at 6.0 MB/s)
[linux-jdk10] [INFO] Downloading from central: https://repo.maven.apache.org/maven2/org/apache/maven/doxia/doxia-logging-api/1.4/doxia-logging-api-1.4.jar
[linux-jdk10] [INFO] Downloaded from central: https://repo.maven.apache.org/maven2/commons-logging/commons-logging/1.0.4/commons-logging-1.0.4.jar
(38 kB at 1.3 MB/s)
[linux-jdk10] [INFO] Downloading from central: https://repo.maven.apache.org/maven2/org/apache/maven/doxia/doxia-decoration-model/1.4/doxia-decoration-model-1.4.jar
[linux-jdk10] [INFO] Downloaded from central: https://repo.maven.apache.org/maven2/xml-apis/xml-apis/1.3.04/xml-apis-1.3.04.jar
(194 kB at 6.5 MB/s)
[linux-jdk10] [INFO] Downloading from central: https://repo.maven.apache.org/maven2/org/apache/maven/doxia/doxia-site-renderer/1.4/doxia-site-renderer-1.4.jar
[linux-jdk10] [INFO] Downloaded from central: https://repo.maven.apache.org/maven2/org/apache/maven/doxia/doxia-sink-api/1.4/doxia-sink-api-1.4.jar
(11 kB at 340 kB/s)
[linux-jdk10] [INFO] Downloading from central: https://repo.maven.apache.org/maven2/org/apache/maven/doxia/doxia-module-xhtml/1.4/doxia-module-xhtml-1.4.jar
[linux-jdk10] [INFO] Downloaded from central: https://repo.maven.apache.org/maven2/org/apache/maven/doxia/doxia-logging-api/1.4/doxia-logging-api-1.4.jar
(11 kB at 290 kB/s)
[linux-jdk10] [INFO] Downloading from central: https://repo.maven.apache.org/maven2/org/apache/maven/doxia/doxia-module-fml/1.4/doxia-module-fml-1.4.jar
[linux-jdk10] [INFO] Downloaded from central: https://repo.maven.apache.org/maven2/org/apache/maven/doxia/doxia-site-renderer/1.4/doxia-site-renderer-1.4.jar
(53 kB at 1.3 MB/s)
[linux-jdk10] [INFO] Downloading from central: https://repo.maven.apache.org/maven2/org/apache/maven/doxia/doxia-integration-tools/1.6/doxia-integration-tools-1.6.jar
[linux-jdk10] [INFO] Downloaded from central: https://repo.maven.apache.org/maven2/org/apache/maven/doxia/doxia-decoration-model/1.4/doxia-decoration-model-1.4.jar
(61 kB at 1.4 MB/s)
[linux-jdk10] [INFO] Downloading from central: https://repo.maven.apache.org/maven2/commons-io/commons-io/1.4/commons-io-1.4.jar
[linux-jdk10] [INFO] Downloaded from central: https://repo.maven.apache.org/maven2/org/apache/maven/doxia/doxia-module-xhtml/1.4/doxia-module-xhtml-1.4.jar
(15 kB at 342 kB/s)
[linux-jdk10] [INFO] Downloading from central: https://repo.maven.apache.org/maven2/org/codehaus/plexus/plexus-resources/1.1.0/plexus-resources-1.1.0.jar
[linux-jdk10] [INFO] Downloaded from central: https://repo.maven.apache.org/maven2/org/apache/maven/doxia/doxia-module-fml/1.4/doxia-module-fml-1.4.jar
(38 kB at 756 kB/s)
[linux-jdk10] [INFO] Downloading from central: https://repo.maven.apache.org/maven2/org/codehaus/plexus/plexus-interpolation/1.24/plexus-interpolation-1.24.jar
[linux-jdk10] [INFO] Downloaded from central: https://repo.maven.apache.org/maven2/org/apache/maven/doxia/doxia-integration-tools/1.6/doxia-integration-tools-1.6.jar
(45 kB at 842 kB/s)
[linux-jdk10] [INFO] Downloading from central: https://repo.maven.apache.org/maven2/org/codehaus/plexus/plexus-velocity/1.1.8/plexus-velocity-1.1.8.jar
[linux-jdk10] [INFO] Downloaded from central: https://repo.maven.apache.org/maven2/commons-io/commons-io/1.4/commons-io-1.4.jar
(109 kB at 1.9 MB/s)
[linux-jdk10] [INFO] Downloading from central: https://repo.maven.apache.org/maven2/com/puppycrawl/tools/checkstyle/6.18/checkstyle-6.18.jar
[linux-jdk10] [INFO] Downloaded from central: https://repo.maven.apache.org/maven2/org/codehaus/plexus/plexus-resources/1.1.0/plexus-resources-1.1.0.jar
(23 kB at 407 kB/s)
[linux-jdk10] [INFO] Downloading from central: https://repo.maven.apache.org/maven2/antlr/antlr/2.7.7/antlr-2.7.7.jar
[linux-jdk10] [INFO] Downloaded from central: https://repo.maven.apache.org/maven2/org/codehaus/plexus/plexus-interpolation/1.24/plexus-interpolation-1.24.jar
(79 kB at 1.3 MB/s)
[linux-jdk10] [INFO] Downloading from central: https://repo.maven.apache.org/maven2/org/antlr/antlr4-runtime/4.5.3/antlr4-runtime-4.5.3.jar
[linux-jdk10] [INFO] Downloaded from central: https://repo.maven.apache.org/maven2/org/codehaus/plexus/plexus-velocity/1.1.8/plexus-velocity-1.1.8.jar
(7.9 kB at 123 kB/s)
[linux-jdk10] [INFO] Downloading from central: https://repo.maven.apache.org/maven2/commons-beanutils/commons-beanutils/1.9.2/commons-beanutils-1.9.2.jar
[linux-jdk10] [INFO] Downloaded from central: https://repo.maven.apache.org/maven2/xerces/xercesImpl/2.9.1/xercesImpl-2.9.1.jar
(1.2 MB at 18 MB/s)
[linux-jdk10] [INFO] Downloading from central: https://repo.maven.apache.org/maven2/commons-cli/commons-cli/1.3.1/commons-cli-1.3.1.jar
[linux-jdk10] [INFO] Downloaded from central: https://repo.maven.apache.org/maven2/antlr/antlr/2.7.7/antlr-2.7.7.jar
(445 kB at 5.6 MB/s)
[linux-jdk10] [INFO] Downloading from central: https://repo.maven.apache.org/maven2/com/google/guava/guava/19.0/guava-19.0.jar
[linux-jdk10] [INFO] Downloaded from central: https://repo.maven.apache.org/maven2/commons-beanutils/commons-beanutils/1.9.2/commons-beanutils-1.9.2.jar
(234 kB at 2.9 MB/s)
[linux-jdk10] [INFO] Downloading from central: https://repo.maven.apache.org/maven2/commons-lang/commons-lang/2.1/commons-lang-2.1.jar
[linux-jdk10] [INFO] Downloaded from central: https://repo.maven.apache.org/maven2/commons-cli/commons-cli/1.3.1/commons-cli-1.3.1.jar
(53 kB at 646 kB/s)
[linux-jdk10] [INFO] Downloading from central: https://repo.maven.apache.org/maven2/javax/xml/bind/jaxb-api/2.3.0/jaxb-api-2.3.0.jar
[linux-jdk10] [INFO] Downloaded from central: https://repo.maven.apache.org/maven2/org/antlr/antlr4-runtime/4.5.3/antlr4-runtime-4.5.3.jar
(302 kB at 3.5 MB/s)
[linux-jdk10] [INFO] Downloaded from central: https://repo.maven.apache.org/maven2/com/puppycrawl/tools/checkstyle/6.18/checkstyle-6.18.jar
(1.2 MB at 12 MB/s)
[linux-jdk10] [INFO] Downloaded from central: https://repo.maven.apache.org/maven2/javax/xml/bind/jaxb-api/2.3.0/jaxb-api-2.3.0.jar
(126 kB at 1.3 MB/s)
[linux-jdk10] [INFO] Downloaded from central: https://repo.maven.apache.org/maven2/commons-lang/commons-lang/2.1/commons-lang-2.1.jar
(208 kB at 2.1 MB/s)
[linux-jdk10] [INFO] Downloaded from central: https://repo.maven.apache.org/maven2/com/google/guava/guava/19.0/guava-19.0.jar
(2.3 MB at 16 MB/s)
[windows-jdk8] [INFO] [INFO] [jenkins-event-spy] Generate F:\jenkins\jenkins-slave\workspace\box_maven-archetypes_master-CWQIX33IMRENQAEK6YQUG4YRNL2FP25GOPO4YFHLPIHFEWUYVBDQ@tmp\withMaven4e51003d\maven-spy-20180402-214852-6577316174517371278.log.tmp
...
[windows-jdk8] [INFO] [INFO] Error stacktraces are turned on.
[windows-jdk8] [INFO] [INFO] Scanning for projects...
[windows-jdk8] [INFO] [INFO] 
[windows-jdk8] [INFO] [INFO] ------------------------------------------------------------------------
[windows-jdk8] [INFO] [INFO] Building Archetype - basic-archetype 0.1-SNAPSHOT
[windows-jdk8] [INFO] [INFO] ------------------------------------------------------------------------
[linux-jdk10] Sending interrupt signal to process
[windows-jdk7] Sending interrupt signal to process
[windows-jdk8] [INFO] [INFO] 
[windows-jdk8] [INFO] [INFO] --- maven-resources-plugin:3.0.2:resources (default-resources)
@ basic-archetype ---
[windows-jdk8] [INFO] [INFO] Using 'UTF-8' encoding to copy filtered resources.
[windows-jdk8] [INFO] [INFO] Copying 4 resources
[windows-jdk8] [INFO] [INFO] 
[windows-jdk8] [INFO] [INFO] --- maven-resources-plugin:3.0.2:testResources (default-testResources)
@ basic-archetype ---
[windows-jdk8] [INFO] [INFO] Using 'UTF-8' encoding to copy filtered resources.
[windows-jdk8] [INFO] [INFO] Copying 2 resources
[windows-jdk8] [INFO] [INFO] 
[windows-jdk8] [INFO] [INFO] --- maven-archetype-plugin:3.0.1:jar (default-jar) @ basic-archetype
---
[windows-jdk8] Sending interrupt signal to process
[windows-jdk8] [INFO] [INFO] Building archetype jar: F:\jenkins\jenkins-slave\workspace\box_maven-archetypes_master-CWQIX33IMRENQAEK6YQUG4YRNL2FP25GOPO4YFHLPIHFEWUYVBDQ\m\maven-archetype-archetype\target\test-classes\projects\it-basic\project\basic-archetype\target\basic-archetype-0.1-SNAPSHOT
[windows-jdk8] [INFO] [INFO] 
[windows-jdk8] [INFO] [INFO] --- maven-archetype-plugin:3.0.1:integration-test (default-integration-test)
@ basic-archetype ---
[windows-jdk8] [INFO] [INFO] Processing Archetype IT project: it-basic
[windows-jdk8] [INFO] [INFO] ----------------------------------------------------------------------------
[windows-jdk8] [INFO] [INFO] Using following parameters for creating project from Archetype:
basic-archetype:0.1-SNAPSHOT
[windows-jdk8] [INFO] [INFO] ----------------------------------------------------------------------------
[windows-jdk8] [INFO] [INFO] Parameter: groupId, Value: archetype.it
[windows-jdk8] [INFO] [INFO] Parameter: artifactId, Value: basic-project
[windows-jdk8] [INFO] [INFO] Parameter: version, Value: 0.1-SNAPSHOT
[windows-jdk8] [INFO] [INFO] Parameter: package, Value: it.pkg
[windows-jdk8] [INFO] [INFO] Parameter: packageInPathFormat, Value: it/pkg
[windows-jdk8] [INFO] [INFO] Parameter: package, Value: it.pkg
[windows-jdk8] [INFO] [INFO] Parameter: version, Value: 0.1-SNAPSHOT
[windows-jdk8] [INFO] [INFO] Parameter: groupId, Value: archetype.it
[windows-jdk8] [INFO] [INFO] Parameter: artifactId, Value: basic-project
[windows-jdk8] [INFO] [INFO] Project created from Archetype in dir: F:\jenkins\jenkins-slave\workspace\box_maven-archetypes_master-CWQIX33IMRENQAEK6YQUG4YRNL2FP25GOPO4YFHLPIHFEWUYVBDQ\m\maven-archetype-archetype\target\test-classes\projects\it-basic\project\basic-archetype\target\test-classes\projects\it-basic\project\basic-project
[windows-jdk8] [INFO] [INFO] Invoking post-archetype-generation goals: verify
[windows-jdk8] [INFO] [INFO] Post-archetype-generation invoker exit code: -2147483648
[windows-jdk8] [INFO] [INFO] ------------------------------------------------------------------------
[windows-jdk8] [INFO] [INFO] BUILD FAILURE
[windows-jdk8] [INFO] [INFO] ------------------------------------------------------------------------
[windows-jdk8] [INFO] [INFO] Total time: 0.969 s
[windows-jdk8] [INFO] [INFO] Finished at: 2018-04-02T21:48:53Z
[windows-jdk8] [INFO] [INFO] Final Memory: 13M/245M
[windows-jdk8] [INFO] [INFO] ------------------------------------------------------------------------
[windows-jdk8] [INFO] [INFO] [jenkins-event-spy] Generated F:\jenkins\jenkins-slave\workspace\box_maven-archetypes_master-CWQIX33IMRENQAEK6YQUG4YRNL2FP25GOPO4YFHLPIHFEWUYVBDQ@tmp\withMaven4e51003d\maven-spy-20180402-214852-6577316174517371278.log
[windows-jdk8] [INFO] [ERROR] Failed to execute goal org.apache.maven.plugins:maven-archetype-plugin:3.0.1:integration-test
(default-integration-test) on project basic-archetype: 
[windows-jdk8] [INFO] [ERROR] Archetype IT 'it-basic' failed: Execution failure: exit code
= -2147483648
[windows-jdk8] [INFO] [ERROR] -> [Help 1]
[windows-jdk8] [INFO] org.apache.maven.lifecycle.LifecycleExecutionException: Failed to execute
goal org.apache.maven.plugins:maven-archetype-plugin:3.0.1:integration-test (default-integration-test)
on project basic-archetype: 
[windows-jdk8] [INFO] Archetype IT 'it-basic' failed: Execution failure: exit code = -2147483648
[windows-jdk8] [INFO] 	at org.apache.maven.lifecycle.internal.MojoExecutor.execute(MojoExecutor.java:213)
[windows-jdk8] [INFO] 	at org.apache.maven.lifecycle.internal.MojoExecutor.execute(MojoExecutor.java:154)
[windows-jdk8] [INFO] 	at org.apache.maven.lifecycle.internal.MojoExecutor.execute(MojoExecutor.java:146)
[windows-jdk8] [INFO] 	at org.apache.maven.lifecycle.internal.LifecycleModuleBuilder.buildProject(LifecycleModuleBuilder.java:117)
[windows-jdk8] [INFO] 	at org.apache.maven.lifecycle.internal.LifecycleModuleBuilder.buildProject(LifecycleModuleBuilder.java:81)
[windows-jdk8] [INFO] 	at org.apache.maven.lifecycle.internal.builder.singlethreaded.SingleThreadedBuilder.build(SingleThreadedBuilder.java:51)
[windows-jdk8] [INFO] 	at org.apache.maven.lifecycle.internal.LifecycleStarter.execute(LifecycleStarter.java:128)
[windows-jdk8] [INFO] 	at org.apache.maven.DefaultMaven.doExecute(DefaultMaven.java:309)
[windows-jdk8] [INFO] 	at org.apache.maven.DefaultMaven.doExecute(DefaultMaven.java:194)
[windows-jdk8] [INFO] 	at org.apache.maven.DefaultMaven.execute(DefaultMaven.java:107)
[windows-jdk8] [INFO] 	at org.apache.maven.cli.MavenCli.execute(MavenCli.java:993)
[windows-jdk8] [INFO] 	at org.apache.maven.cli.MavenCli.doMain(MavenCli.java:345)
[windows-jdk8] [INFO] 	at org.apache.maven.cli.MavenCli.main(MavenCli.java:191)
[windows-jdk8] [INFO] 	at sun.reflect.NativeMethodAccessorImpl.invoke0(Native Method)
[windows-jdk8] [INFO] 	at sun.reflect.NativeMethodAccessorImpl.invoke(NativeMethodAccessorImpl.java:62)
[windows-jdk8] [INFO] 	at sun.reflect.DelegatingMethodAccessorImpl.invoke(DelegatingMethodAccessorImpl.java:43)
[windows-jdk8] [INFO] 	at java.lang.reflect.Method.invoke(Method.java:498)
[windows-jdk8] [INFO] 	at org.codehaus.plexus.classworlds.launcher.Launcher.launchEnhanced(Launcher.java:289)
[windows-jdk8] [INFO] 	at org.codehaus.plexus.classworlds.launcher.Launcher.launch(Launcher.java:229)
[windows-jdk8] [INFO] 	at org.codehaus.plexus.classworlds.launcher.Launcher.mainWithExitCode(Launcher.java:415)
[windows-jdk8] [INFO] 	at org.codehaus.plexus.classworlds.launcher.Launcher.main(Launcher.java:356)
[windows-jdk8] [INFO] Caused by: org.apache.maven.plugin.MojoExecutionException: 
[windows-jdk8] [INFO] Archetype IT 'it-basic' failed: Execution failure: exit code = -2147483648
[windows-jdk8] [INFO] 	at org.apache.maven.archetype.mojos.IntegrationTestMojo.execute(IntegrationTestMojo.java:325)
[windows-jdk8] [INFO] 	at org.apache.maven.plugin.DefaultBuildPluginManager.executeMojo(DefaultBuildPluginManager.java:134)
[windows-jdk8] [INFO] 	at org.apache.maven.lifecycle.internal.MojoExecutor.execute(MojoExecutor.java:208)
[windows-jdk8] [INFO] 	... 20 more
[windows-jdk8] [INFO] [ERROR] 
[windows-jdk8] [INFO] [ERROR] Re-run Maven using the -X switch to enable full debug logging.
[windows-jdk8] [INFO] [ERROR] 
[windows-jdk8] [INFO] [ERROR] For more information about the errors and possible solutions,
please read the following articles:
[windows-jdk8] [INFO] [ERROR] [Help 1] http://cwiki.apache.org/confluence/display/MAVEN/MojoExecutionException
[Pipeline] [windows-jdk10] }
[Pipeline] [windows-jdk10] // node
[Pipeline] [windows-jdk10] }
[windows-jdk10] Failed in branch windows-jdk10
[Pipeline] [windows-jdk7] }
[Pipeline] [linux-jdk8] }
[Pipeline] [linux-jdk7] }
[Pipeline] [linux-jdk9] }
[Pipeline] [linux-jdk10] }
[Pipeline] [windows-jdk7] // dir
[Pipeline] [linux-jdk8] // dir
[Pipeline] [linux-jdk7] // dir
[Pipeline] [linux-jdk9] // dir
[Pipeline] [linux-jdk10] // dir
[Pipeline] [windows-jdk7] }
[Pipeline] [linux-jdk8] }
[Pipeline] [linux-jdk7] }
[linux-jdk7] [withMaven] One or multiple Maven executions have been ignored by the Jenkins
Pipeline Maven Plugin because they have been interrupted before completion (1). See Pipeline
Maven Plugin FAQ for more details.
[Pipeline] [linux-jdk9] }
[linux-jdk9] [withMaven] One or multiple Maven executions have been ignored by the Jenkins
Pipeline Maven Plugin because they have been interrupted before completion (1). See Pipeline
Maven Plugin FAQ for more details.
[Pipeline] [linux-jdk10] }
[linux-jdk10] [withMaven] One or multiple Maven executions have been ignored by the Jenkins
Pipeline Maven Plugin because they have been interrupted before completion (1). See Pipeline
Maven Plugin FAQ for more details.
[Pipeline] [windows-jdk7] // withMaven
[Pipeline] [linux-jdk8] // withMaven
[Pipeline] [linux-jdk7] // withMaven
[Pipeline] [linux-jdk9] // withMaven
[Pipeline] [linux-jdk10] // withMaven
[Pipeline] [windows-jdk7] echo
[windows-jdk7] [FAIL FAST] windows-jdk9 had first failure, ignoring script returned exit code
1
[Pipeline] [windows-jdk7] }
[Pipeline] [linux-jdk8] echo
[linux-jdk8] [FAIL FAST] windows-jdk9 had first failure, ignoring script returned exit code
1
[Pipeline] [linux-jdk8] }
[Pipeline] [linux-jdk7] echo
[linux-jdk7] [FAIL FAST] windows-jdk9 had first failure, ignoring script returned exit code
143
[Pipeline] [linux-jdk7] }
[Pipeline] [linux-jdk9] echo
[linux-jdk9] [FAIL FAST] windows-jdk9 had first failure, ignoring script returned exit code
143
[Pipeline] [linux-jdk9] }
[Pipeline] [linux-jdk10] echo
[linux-jdk10] [FAIL FAST] windows-jdk9 had first failure, ignoring script returned exit code
143
[Pipeline] [linux-jdk10] }
[Pipeline] [windows-jdk7] // stage
[Pipeline] [linux-jdk8] // stage
[Pipeline] [linux-jdk7] // stage
[Pipeline] [linux-jdk9] // stage
[Pipeline] [linux-jdk10] // stage
[Pipeline] [linux-jdk7] }
[Pipeline] [linux-jdk8] }
[Pipeline] [linux-jdk9] }
[Pipeline] [linux-jdk10] }
[Pipeline] [windows-jdk7] }
[Pipeline] [linux-jdk7] // node
[Pipeline] [linux-jdk8] // node
[windows-jdk8] After 10s process did not stop
[Pipeline] [linux-jdk9] // node
[Pipeline] [linux-jdk10] // node
[Pipeline] [windows-jdk7] // node
[Pipeline] [linux-jdk7] }
[Pipeline] [linux-jdk8] }
[Pipeline] [linux-jdk9] }
[Pipeline] [linux-jdk10] }
[Pipeline] [windows-jdk7] }
[Pipeline] [windows-jdk8] }
[Pipeline] [windows-jdk8] // dir
[Pipeline] [windows-jdk8] }
[windows-jdk8] [withMaven] One or multiple Maven executions have been ignored by the Jenkins
Pipeline Maven Plugin because they have been interrupted before completion (1). See Pipeline
Maven Plugin FAQ for more details.
[Pipeline] [windows-jdk8] // withMaven
[Pipeline] [windows-jdk8] echo
[windows-jdk8] [FAIL FAST] windows-jdk9 had first failure, ignoring null
[Pipeline] [windows-jdk8] }
[Pipeline] [windows-jdk8] // stage
[Pipeline] [windows-jdk8] }
[Pipeline] [windows-jdk8] // node
[Pipeline] [windows-jdk8] }
[Pipeline] // parallel
[Pipeline] echo
***** FAST FAILURE *****

Fast failure triggered by windows-jdk9

***** FAST FAILURE *****
[Pipeline] stage
[Pipeline] { (Notifications)
[Pipeline] echo
Build result: FAILURE
[Pipeline] jiraIssueSelector
[Pipeline] emailext
Mime
  • Unnamed multipart/mixed (inline, None, 0 bytes)
View raw message