maven-notifications mailing list archives

Site index · List index
Message view « Date » · « Thread »
Top « Date » · « Thread »
From Apache Jenkins Server <jenk...@builds.apache.org>
Subject Build failed in Jenkins: Maven TLP » maven-archetype » ARCHETYPE-545 #2
Date Sat, 07 Apr 2018 14:57:23 GMT
See https://builds.apache.org/job/maven-box/job/maven-archetype/job/ARCHETYPE-545/2/

Changes:

* [ARCHETYPE-545] - Upgrade parent to 31  o Fixed checkstyle issues
* [ARCHETYPE-545] - Upgrade parent to 31  o Fixed checkstyle issues
* [ARCHETYPE-545] - Upgrade parent to 31  o Fixed checkstyle issues
* [ARCHETYPE-545] - Upgrade parent to 31  o Fixed checkstyle issues
* [ARCHETYPE-545] - Upgrade parent to 31  o Fixed checkstyle issues
* [ARCHETYPE-545] - Upgrade parent to 31  o Fixed checkstyle issues
* [ARCHETYPE-545] - Upgrade parent to 31  o Fixed checkstyle issues

No tests ran.

Build log:
[...truncated 133.54 KB...]
[windows-jdk9] [INFO] --- plexus-component-metadata:1.7:generate-metadata (default) @ archetype-models
---
[windows-jdk9] [INFO] 
[windows-jdk9] [INFO] --- maven-site-plugin:3.7:attach-descriptor (attach-descriptor) @ archetype-models
---
[windows-jdk9] [INFO] Attaching 'src\site\site.xml' site descriptor with classifier 'site'.
[windows-jdk9] [INFO] 
[windows-jdk9] [INFO] --- maven-checkstyle-plugin:3.0.0:check (checkstyle-check) @ archetype-models
---
[windows-jdk9] [INFO] 
[windows-jdk9] [INFO] ------------------------------------------------------------------------
[windows-jdk9] [INFO] Building Maven Archetype Catalog Model 3.0.2-SNAPSHOT
[windows-jdk9] [INFO] ------------------------------------------------------------------------
[windows-jdk9] [INFO] 
[windows-jdk9] [INFO] --- maven-clean-plugin:3.0.0:clean (default-clean) @ archetype-catalog
---
[windows-jdk9] [INFO] 
[windows-jdk9] [INFO] --- maven-enforcer-plugin:1.4.1:enforce (enforce-maven-version) @ archetype-catalog
---
[windows-jdk9] [INFO] 
[windows-jdk9] [INFO] --- maven-enforcer-plugin:1.4.1:enforce (enforce-bytecode-version) @
archetype-catalog ---
[windows-jdk9] [INFO] 
[windows-jdk9] [INFO] --- maven-enforcer-plugin:1.4.1:enforce (ban-known-bad-maven-versions)
@ archetype-catalog ---
[windows-jdk9] [INFO] 
[windows-jdk9] [INFO] --- apache-rat-plugin:0.12:check (rat-check) @ archetype-catalog ---
[windows-jdk9] [INFO] Enabled default license matchers.
[windows-jdk9] [INFO] Will parse SCM ignores for exclusions...
[windows-jdk9] [INFO] Finished adding exclusions from SCM ignore files.
[windows-jdk9] [INFO] 61 implicit excludes (use -debug for more details).
[windows-jdk9] [INFO] Exclude: .repository/**
[windows-jdk9] [INFO] Exclude: .maven/spy.log
[windows-jdk9] [INFO] Exclude: dependency-reduced-pom.xml
[windows-jdk9] [INFO] Exclude: .java-version
[windows-jdk9] [INFO] Exclude: README.txt
[windows-jdk9] [INFO] Exclude: *.sh
[windows-jdk9] [INFO] Exclude: archetype-samples/**
[windows-jdk9] [INFO] Exclude: **/*.sha1
[windows-jdk9] [INFO] Exclude: src/main/resources/org/apache/maven/archetype/creator/*
[windows-jdk9] [INFO] Exclude: **/Format.java
[windows-jdk9] [INFO] Exclude: **/NamespaceStack.java
[windows-jdk9] [INFO] Exclude: **/XMLOutputter.java
[windows-jdk9] [INFO] Exclude: src/it/**/goal.txt
[windows-jdk9] [INFO] Exclude: .repository/**
[windows-jdk9] [INFO] Exclude: .java-version
[windows-jdk9] [INFO] 4 resources included (use -debug for more details)
[windows-jdk9] [INFO] Rat check: Summary over all files. Unapproved: 0, unknown: 0, generated:
0, approved: 4 licenses.
[windows-jdk9] [INFO] 
[windows-jdk9] [INFO] --- modello-maven-plugin:1.8.3:java (default) @ archetype-catalog ---
[windows-jdk9] [INFO] outputDirectory: F:\jenkins\jenkins-slave\workspace\ven-archetype_ARCHETYPE-545-HILXCDUDGSSEADZWSM37YDQ4AUSZ64CLEBNX225C3MTHM3O3PQ7Q@2\m\archetype-models\archetype-catalog\target\generated-sources\modello
[windows-jdk9] [INFO] Working on model: src/main/mdo/archetype-catalog.mdo
[windows-jdk9] [INFO] Generating current version: 1.0.0
[windows-jdk9] [INFO] 
[windows-jdk9] [INFO] --- modello-maven-plugin:1.8.3:xpp3-reader (default) @ archetype-catalog
---
[windows-jdk9] [INFO] outputDirectory: F:\jenkins\jenkins-slave\workspace\ven-archetype_ARCHETYPE-545-HILXCDUDGSSEADZWSM37YDQ4AUSZ64CLEBNX225C3MTHM3O3PQ7Q@2\m\archetype-models\archetype-catalog\target\generated-sources\modello
[windows-jdk9] [INFO] Working on model: src/main/mdo/archetype-catalog.mdo
[windows-jdk8] [INFO] 
[windows-jdk8] [INFO] ------------------------------------------------------------------------
[windows-jdk8] [INFO] Building Maven Archetype Catalog Model 3.0.2-SNAPSHOT
[windows-jdk8] [INFO] ------------------------------------------------------------------------
[windows-jdk8] [INFO] 
[windows-jdk8] [INFO] --- maven-clean-plugin:3.0.0:clean (default-clean) @ archetype-catalog
---
[windows-jdk8] [INFO] 
[windows-jdk8] [INFO] --- maven-enforcer-plugin:1.4.1:enforce (enforce-maven-version) @ archetype-catalog
---
[windows-jdk8] [INFO] 
[windows-jdk8] [INFO] --- maven-enforcer-plugin:1.4.1:enforce (enforce-bytecode-version) @
archetype-catalog ---
[windows-jdk8] [INFO] 
[windows-jdk8] [INFO] --- maven-enforcer-plugin:1.4.1:enforce (ban-known-bad-maven-versions)
@ archetype-catalog ---
[windows-jdk8] [INFO] 
[windows-jdk8] [INFO] --- apache-rat-plugin:0.12:check (rat-check) @ archetype-catalog ---
[windows-jdk8] [INFO] Enabled default license matchers.
[windows-jdk8] [INFO] Will parse SCM ignores for exclusions...
[windows-jdk8] [INFO] Finished adding exclusions from SCM ignore files.
[windows-jdk8] [INFO] 61 implicit excludes (use -debug for more details).
[windows-jdk8] [INFO] Exclude: .repository/**
[windows-jdk8] [INFO] Exclude: .maven/spy.log
[windows-jdk8] [INFO] Exclude: dependency-reduced-pom.xml
[windows-jdk8] [INFO] Exclude: .java-version
[windows-jdk8] [INFO] Exclude: README.txt
[windows-jdk8] [INFO] Exclude: *.sh
[windows-jdk8] [INFO] Exclude: archetype-samples/**
[windows-jdk8] [INFO] Exclude: **/*.sha1
[windows-jdk8] [INFO] Exclude: src/main/resources/org/apache/maven/archetype/creator/*
[windows-jdk8] [INFO] Exclude: **/Format.java
[windows-jdk8] [INFO] Exclude: **/NamespaceStack.java
[windows-jdk8] [INFO] Exclude: **/XMLOutputter.java
[windows-jdk8] [INFO] Exclude: src/it/**/goal.txt
[windows-jdk8] [INFO] Exclude: .repository/**
[windows-jdk8] [INFO] Exclude: .java-version
[windows-jdk8] [INFO] 4 resources included (use -debug for more details)
[windows-jdk8] [INFO] Rat check: Summary over all files. Unapproved: 0, unknown: 0, generated:
0, approved: 4 licenses.
[windows-jdk8] [INFO] 
[windows-jdk8] [INFO] --- modello-maven-plugin:1.8.3:java (default) @ archetype-catalog ---
[windows-jdk8] Sending interrupt signal to process
[windows-jdk8] [INFO] outputDirectory: F:\jenkins\jenkins-slave\workspace\ven-archetype_ARCHETYPE-545-HILXCDUDGSSEADZWSM37YDQ4AUSZ64CLEBNX225C3MTHM3O3PQ7Q\m\archetype-models\archetype-catalog\target\generated-sources\modello
[windows-jdk8] [INFO] Working on model: src/main/mdo/archetype-catalog.mdo
[windows-jdk8] [INFO] Generating current version: 1.0.0
[windows-jdk8] [INFO] 
[windows-jdk8] [INFO] --- modello-maven-plugin:1.8.3:xpp3-reader (default) @ archetype-catalog
---
[windows-jdk8] [INFO] outputDirectory: F:\jenkins\jenkins-slave\workspace\ven-archetype_ARCHETYPE-545-HILXCDUDGSSEADZWSM37YDQ4AUSZ64CLEBNX225C3MTHM3O3PQ7Q\m\archetype-models\archetype-catalog\target\generated-sources\modello
[windows-jdk8] [INFO] Working on model: src/main/mdo/archetype-catalog.mdo
[windows-jdk8] [INFO] Generating current version: 1.0.0
[windows-jdk8] [INFO] 
[windows-jdk8] [INFO] --- modello-maven-plugin:1.8.3:xpp3-writer (default) @ archetype-catalog
---
[windows-jdk8] [INFO] outputDirectory: F:\jenkins\jenkins-slave\workspace\ven-archetype_ARCHETYPE-545-HILXCDUDGSSEADZWSM37YDQ4AUSZ64CLEBNX225C3MTHM3O3PQ7Q\m\archetype-models\archetype-catalog\target\generated-sources\modello
[windows-jdk8] [INFO] Working on model: src/main/mdo/archetype-catalog.mdo
[windows-jdk8] [INFO] Generating current version: 1.0.0
[windows-jdk8] [INFO] 
[windows-jdk8] [INFO] --- modello-maven-plugin:1.8.3:xsd (default) @ archetype-catalog ---
[windows-jdk8] [INFO] outputDirectory: F:\jenkins\jenkins-slave\workspace\ven-archetype_ARCHETYPE-545-HILXCDUDGSSEADZWSM37YDQ4AUSZ64CLEBNX225C3MTHM3O3PQ7Q\m\archetype-models\archetype-catalog\target\generated-site\resources\xsd
[windows-jdk8] [INFO] Working on model: src/main/mdo/archetype-catalog.mdo
[windows-jdk8] [INFO] Generating current version: 1.0.0
[windows-jdk8] [INFO] 
[windows-jdk8] [INFO] --- maven-remote-resources-plugin:1.5:process (process-resource-bundles)
@ archetype-catalog ---
[windows-jdk8] [INFO] 
[windows-jdk8] [INFO] --- maven-resources-plugin:3.0.2:resources (default-resources) @ archetype-catalog
---
[windows-jdk10] [INFO] Attaching 'src\site\site.xml' site descriptor with classifier 'site'.
[windows-jdk10] [INFO] 
[windows-jdk10] [INFO] --- maven-checkstyle-plugin:3.0.0:check (checkstyle-check) @ maven-archetype
---
[linux-jdk10] [INFO] Downloading from central: https://repo.maven.apache.org/maven2/org/apache/maven/plugins/maven-site-plugin/3.7/maven-site-plugin-3.7.pom
[linux-jdk10] [INFO] Downloaded from central: https://repo.maven.apache.org/maven2/org/apache/maven/plugins/maven-site-plugin/3.7/maven-site-plugin-3.7.pom
(19 kB at 961 kB/s)
[linux-jdk10] [INFO] Downloading from central: https://repo.maven.apache.org/maven2/org/apache/maven/plugins/maven-site-plugin/3.7/maven-site-plugin-3.7.jar
[linux-jdk10] [INFO] Downloaded from central: https://repo.maven.apache.org/maven2/org/apache/maven/plugins/maven-site-plugin/3.7/maven-site-plugin-3.7.jar
(134 kB at 3.8 MB/s)
[linux-jdk10] [INFO] Downloading from central: https://repo.maven.apache.org/maven2/org/codehaus/plexus/plexus-component-metadata/1.7/plexus-component-metadata-1.7.pom
[linux-jdk10] [INFO] Downloaded from central: https://repo.maven.apache.org/maven2/org/codehaus/plexus/plexus-component-metadata/1.7/plexus-component-metadata-1.7.pom
(3.9 kB at 243 kB/s)
[linux-jdk10] [INFO] Downloading from central: https://repo.maven.apache.org/maven2/org/codehaus/plexus/plexus-containers/1.7/plexus-containers-1.7.pom
[linux-jdk10] [INFO] Downloaded from central: https://repo.maven.apache.org/maven2/org/codehaus/plexus/plexus-containers/1.7/plexus-containers-1.7.pom
(4.8 kB at 340 kB/s)
[linux-jdk10] [INFO] Downloading from central: https://repo.maven.apache.org/maven2/org/codehaus/plexus/plexus/4.0/plexus-4.0.pom
[linux-jdk10] [INFO] Downloaded from central: https://repo.maven.apache.org/maven2/org/codehaus/plexus/plexus/4.0/plexus-4.0.pom
(22 kB at 1.3 MB/s)
[linux-jdk10] [INFO] Downloading from central: https://repo.maven.apache.org/maven2/org/sonatype/forge/forge-parent/10/forge-parent-10.pom
[linux-jdk10] [INFO] Downloaded from central: https://repo.maven.apache.org/maven2/org/sonatype/forge/forge-parent/10/forge-parent-10.pom
(14 kB at 798 kB/s)
[linux-jdk10] [INFO] Downloading from central: https://repo.maven.apache.org/maven2/org/codehaus/plexus/plexus-component-metadata/1.7/plexus-component-metadata-1.7.jar
[windows-jdk9] [INFO] Generating current version: 1.0.0
[windows-jdk9] [INFO] 
[windows-jdk9] [INFO] --- modello-maven-plugin:1.8.3:xpp3-writer (default) @ archetype-catalog
---
[windows-jdk9] [INFO] outputDirectory: F:\jenkins\jenkins-slave\workspace\ven-archetype_ARCHETYPE-545-HILXCDUDGSSEADZWSM37YDQ4AUSZ64CLEBNX225C3MTHM3O3PQ7Q@2\m\archetype-models\archetype-catalog\target\generated-sources\modello
[windows-jdk9] [INFO] Working on model: src/main/mdo/archetype-catalog.mdo
[windows-jdk9] [INFO] Generating current version: 1.0.0
[windows-jdk9] [INFO] 
[windows-jdk9] [INFO] --- modello-maven-plugin:1.8.3:xsd (default) @ archetype-catalog ---
[windows-jdk9] [INFO] outputDirectory: F:\jenkins\jenkins-slave\workspace\ven-archetype_ARCHETYPE-545-HILXCDUDGSSEADZWSM37YDQ4AUSZ64CLEBNX225C3MTHM3O3PQ7Q@2\m\archetype-models\archetype-catalog\target\generated-site\resources\xsd
[windows-jdk9] [INFO] Working on model: src/main/mdo/archetype-catalog.mdo
[windows-jdk9] [INFO] Generating current version: 1.0.0
[windows-jdk9] [INFO] 
[windows-jdk9] [INFO] --- maven-remote-resources-plugin:1.5:process (process-resource-bundles)
@ archetype-catalog ---
[windows-jdk9] [INFO] 
[windows-jdk9] [INFO] --- maven-resources-plugin:3.0.2:resources (default-resources) @ archetype-catalog
---
[windows-jdk9] [INFO] Using 'UTF-8' encoding to copy filtered resources.
[windows-jdk9] [INFO] skip non existing resourceDirectory F:\jenkins\jenkins-slave\workspace\ven-archetype_ARCHETYPE-545-HILXCDUDGSSEADZWSM37YDQ4AUSZ64CLEBNX225C3MTHM3O3PQ7Q@2\m\archetype-models\archetype-catalog\src\main\resources
[windows-jdk9] [INFO] Copying 3 resources
[windows-jdk9] [INFO] 
[windows-jdk9] [INFO] --- maven-compiler-plugin:3.7.0:compile (default-compile) @ archetype-catalog
---
[windows-jdk9] [INFO] Changes detected - recompiling the module!
[windows-jdk9] [INFO] Compiling 4 source files to F:\jenkins\jenkins-slave\workspace\ven-archetype_ARCHETYPE-545-HILXCDUDGSSEADZWSM37YDQ4AUSZ64CLEBNX225C3MTHM3O3PQ7Q@2\m\archetype-models\archetype-catalog\target\classes
[windows-jdk10] Sending interrupt signal to process
[windows-jdk9] Sending interrupt signal to process
[Pipeline] [windows-jdk9] }
[Pipeline] [linux-jdk8] }
[Pipeline] [linux-jdk7] }
[Pipeline] [linux-jdk9] }
[Pipeline] [linux-jdk10] }
[Pipeline] [windows-jdk9] // dir
[Pipeline] [linux-jdk8] // dir
[Pipeline] [linux-jdk7] // dir
[Pipeline] [linux-jdk9] // dir
[Pipeline] [linux-jdk10] // dir
[Pipeline] [windows-jdk9] }
[windows-jdk9] [withMaven] One or multiple Maven executions have been ignored by the Jenkins
Pipeline Maven Plugin because they have been interrupted before completion (1). See Pipeline
Maven Plugin FAQ for more details.
[Pipeline] [linux-jdk8] }
[linux-jdk8] [withMaven] One or multiple Maven executions have been ignored by the Jenkins
Pipeline Maven Plugin because they have been interrupted before completion (1). See Pipeline
Maven Plugin FAQ for more details.
[Pipeline] [linux-jdk7] }
[linux-jdk7] [withMaven] One or multiple Maven executions have been ignored by the Jenkins
Pipeline Maven Plugin because they have been interrupted before completion (1). See Pipeline
Maven Plugin FAQ for more details.
[Pipeline] [linux-jdk9] }
[linux-jdk9] [withMaven] One or multiple Maven executions have been ignored by the Jenkins
Pipeline Maven Plugin because they have been interrupted before completion (1). See Pipeline
Maven Plugin FAQ for more details.
[Pipeline] [linux-jdk10] }
[linux-jdk10] [withMaven] One or multiple Maven executions have been ignored by the Jenkins
Pipeline Maven Plugin because they have been interrupted before completion (1). See Pipeline
Maven Plugin FAQ for more details.
[Pipeline] [windows-jdk9] // withMaven
[Pipeline] [linux-jdk8] // withMaven
[Pipeline] [linux-jdk7] // withMaven
[Pipeline] [linux-jdk9] // withMaven
[Pipeline] [linux-jdk10] // withMaven
[Pipeline] [windows-jdk9] echo
[windows-jdk9] [FAIL FAST] windows-jdk7 had first failure, ignoring script returned exit code
-1
[Pipeline] [windows-jdk9] }
[Pipeline] [linux-jdk8] echo
[linux-jdk8] [FAIL FAST] windows-jdk7 had first failure, ignoring script returned exit code
143
[Pipeline] [linux-jdk8] }
[Pipeline] [linux-jdk7] echo
[linux-jdk7] [FAIL FAST] windows-jdk7 had first failure, ignoring script returned exit code
143
[Pipeline] [linux-jdk7] }
[Pipeline] [linux-jdk9] echo
[linux-jdk9] [FAIL FAST] windows-jdk7 had first failure, ignoring script returned exit code
143
[Pipeline] [linux-jdk9] }
[Pipeline] [linux-jdk10] echo
[linux-jdk10] [FAIL FAST] windows-jdk7 had first failure, ignoring script returned exit code
143
[Pipeline] [linux-jdk10] }
[Pipeline] [windows-jdk9] // stage
[Pipeline] [linux-jdk8] // stage
[Pipeline] [linux-jdk7] // stage
[Pipeline] [linux-jdk9] // stage
[Pipeline] [linux-jdk10] // stage
[Pipeline] [linux-jdk8] }
[Pipeline] [linux-jdk7] }
[Pipeline] [linux-jdk9] }
[Pipeline] [linux-jdk10] }
[Pipeline] [windows-jdk9] }
[Pipeline] [linux-jdk8] // node
[Pipeline] [linux-jdk7] // node
[Pipeline] [linux-jdk9] // node
[Pipeline] [linux-jdk10] // node
[Pipeline] [windows-jdk9] // node
[Pipeline] [linux-jdk7] }
[Pipeline] [linux-jdk8] }
[Pipeline] [linux-jdk9] }
[Pipeline] [linux-jdk10] }
[Pipeline] [windows-jdk9] }
[windows-jdk8] After 10s process did not stop
[Pipeline] [windows-jdk8] }
[Pipeline] [windows-jdk8] // dir
[Pipeline] [windows-jdk8] }
[windows-jdk8] [withMaven] One or multiple Maven executions have been ignored by the Jenkins
Pipeline Maven Plugin because they have been interrupted before completion (1). See Pipeline
Maven Plugin FAQ for more details.
[Pipeline] [windows-jdk8] // withMaven
[Pipeline] [windows-jdk8] echo
[windows-jdk8] [FAIL FAST] windows-jdk7 had first failure, ignoring null
[Pipeline] [windows-jdk8] }
[Pipeline] [windows-jdk8] // stage
[Pipeline] [windows-jdk8] }
[Pipeline] [windows-jdk8] // node
[Pipeline] [windows-jdk8] }
[windows-jdk10] After 10s process did not stop
[Pipeline] [windows-jdk10] }
[Pipeline] [windows-jdk10] // dir
[Pipeline] [windows-jdk10] }
[windows-jdk10] [withMaven] One or multiple Maven executions have been ignored by the Jenkins
Pipeline Maven Plugin because they have been interrupted before completion (1). See Pipeline
Maven Plugin FAQ for more details.
[Pipeline] [windows-jdk10] // withMaven
[Pipeline] [windows-jdk10] echo
[windows-jdk10] [FAIL FAST] windows-jdk7 had first failure, ignoring null
[Pipeline] [windows-jdk10] }
[Pipeline] [windows-jdk10] // stage
[Pipeline] [windows-jdk10] }
[Pipeline] [windows-jdk10] // node
[Pipeline] [windows-jdk10] }
[Pipeline] // parallel
[Pipeline] echo
***** FAST FAILURE *****

Fast failure triggered by windows-jdk7

***** FAST FAILURE *****
[Pipeline] stage
[Pipeline] { (Notifications)
[Pipeline] echo
Build result: FAILURE
[Pipeline] jiraIssueSelector
Mime
  • Unnamed multipart/mixed (inline, None, 0 bytes)
View raw message