maven-notifications mailing list archives

Site index · List index
Message view « Date » · « Thread »
Top « Date » · « Thread »
From Apache Jenkins Server <jenk...@builds.apache.org>
Subject Build failed in Jenkins: Maven TLP » maven-wagon » master #9
Date Fri, 06 Apr 2018 15:47:16 GMT
See https://builds.apache.org/job/maven-box/job/maven-wagon/job/master/9/

Changes:

* [WAGON-516] Upgrade Jackrabbit WebDAV to 2.16.1
* [WAGON-516] Upgrade Jackrabbit WebDAV to 2.16.1
* [WAGON-516] Upgrade Jackrabbit WebDAV to 2.16.1
* [WAGON-516] Upgrade Jackrabbit WebDAV to 2.16.1
* [WAGON-516] Upgrade Jackrabbit WebDAV to 2.16.1
* [WAGON-516] Upgrade Jackrabbit WebDAV to 2.16.1

No tests ran.

Build log:
[...truncated 504.25 KB...]
[windows-jdk7] [INFO] Tests run: 2, Failures: 0, Errors: 0, Skipped: 0, Time elapsed: 0 s
- in org.apache.maven.wagon.events.SessionEventTest
[windows-jdk7] [INFO] Running org.apache.maven.wagon.events.TransferEventSupportTest
[windows-jdk7] [INFO] Tests run: 6, Failures: 0, Errors: 0, Skipped: 0, Time elapsed: 0.001
s - in org.apache.maven.wagon.events.TransferEventSupportTest
[windows-jdk7] [INFO] Running org.apache.maven.wagon.events.TransferEventTest
[windows-jdk7] [INFO] Tests run: 2, Failures: 0, Errors: 0, Skipped: 0, Time elapsed: 0.02
s - in org.apache.maven.wagon.events.TransferEventTest
[windows-jdk7] [INFO] Running org.apache.maven.wagon.LazyFileOutputStreamTest
[windows-jdk7] [INFO] Tests run: 1, Failures: 0, Errors: 0, Skipped: 0, Time elapsed: 0 s
- in org.apache.maven.wagon.LazyFileOutputStreamTest
[windows-jdk7] [INFO] Running org.apache.maven.wagon.NotAuthorizedExceptionTest
[windows-jdk7] [INFO] Tests run: 1, Failures: 0, Errors: 0, Skipped: 0, Time elapsed: 0 s
- in org.apache.maven.wagon.NotAuthorizedExceptionTest
[windows-jdk7] [INFO] Running org.apache.maven.wagon.observers.ChecksumObserverTest
[windows-jdk7] [INFO] Tests run: 2, Failures: 0, Errors: 0, Skipped: 0, Time elapsed: 0 s
- in org.apache.maven.wagon.observers.ChecksumObserverTest
[windows-jdk7] [INFO] Running org.apache.maven.wagon.PathUtilsTest
[windows-jdk7] [INFO] Tests run: 19, Failures: 0, Errors: 0, Skipped: 0, Time elapsed: 0.001
s - in org.apache.maven.wagon.PathUtilsTest
[windows-jdk7] [INFO] Running org.apache.maven.wagon.PermissionModeUtilsTest
[windows-jdk7] [INFO] Tests run: 1, Failures: 0, Errors: 0, Skipped: 0, Time elapsed: 0 s
- in org.apache.maven.wagon.PermissionModeUtilsTest
[windows-jdk7] [INFO] Running org.apache.maven.wagon.proxy.ProxyInfoTest
[windows-jdk7] [INFO] Tests run: 1, Failures: 0, Errors: 0, Skipped: 0, Time elapsed: 0 s
- in org.apache.maven.wagon.proxy.ProxyInfoTest
[windows-jdk7] [INFO] Running org.apache.maven.wagon.proxy.ProxyInfoUtilsTest
[windows-jdk7] [INFO] Tests run: 3, Failures: 0, Errors: 0, Skipped: 0, Time elapsed: 0.001
s - in org.apache.maven.wagon.proxy.ProxyInfoUtilsTest
[windows-jdk7] [INFO] Running org.apache.maven.wagon.repository.RepositoryPermissionsTest
[windows-jdk7] [INFO] Tests run: 1, Failures: 0, Errors: 0, Skipped: 0, Time elapsed: 0 s
- in org.apache.maven.wagon.repository.RepositoryPermissionsTest
[windows-jdk7] [INFO] Running org.apache.maven.wagon.repository.RepositoryTest
[windows-jdk7] [INFO] Tests run: 2, Failures: 0, Errors: 0, Skipped: 0, Time elapsed: 0 s
- in org.apache.maven.wagon.repository.RepositoryTest
[windows-jdk7] [INFO] Running org.apache.maven.wagon.ResourceDoesNotExistExceptionTest
[windows-jdk7] [INFO] Tests run: 1, Failures: 0, Errors: 0, Skipped: 0, Time elapsed: 0 s
- in org.apache.maven.wagon.ResourceDoesNotExistExceptionTest
[windows-jdk7] [INFO] Running org.apache.maven.wagon.StreamWagonTest
[linux-jdk9] [INFO] 
[linux-jdk9] [INFO] --- maven-site-plugin:3.7:attach-descriptor (attach-descriptor) @ wagon-providers
---
[linux-jdk9] [INFO] Attaching 'src/site/site.xml' site descriptor with classifier 'site'.
[linux-jdk9] [INFO] 
[linux-jdk9] [INFO] --- maven-checkstyle-plugin:3.0.0:check (checkstyle-check) @ wagon-providers
---
[linux-jdk9] [INFO] 
[linux-jdk9] [INFO] ------------------------------------------------------------------------
[linux-jdk9] [INFO] Building Apache Maven Wagon :: Providers :: File Provider 3.0.1-SNAPSHOT
[linux-jdk9] [INFO] ------------------------------------------------------------------------
[linux-jdk9] [INFO] Downloading from central: https://repo.maven.apache.org/maven2/org/slf4j/slf4j-simple/1.7.25/slf4j-simple-1.7.25.pom
[linux-jdk9] [INFO] Downloaded from central: https://repo.maven.apache.org/maven2/org/slf4j/slf4j-simple/1.7.25/slf4j-simple-1.7.25.pom
(1.0 kB at 68 kB/s)
[linux-jdk9] [INFO] Downloading from central: https://repo.maven.apache.org/maven2/org/slf4j/slf4j-simple/1.7.25/slf4j-simple-1.7.25.jar
[linux-jdk9] [INFO] Downloaded from central: https://repo.maven.apache.org/maven2/org/slf4j/slf4j-simple/1.7.25/slf4j-simple-1.7.25.jar
(15 kB at 1.1 MB/s)
[linux-jdk9] [INFO] 
[linux-jdk9] [INFO] --- maven-clean-plugin:3.0.0:clean (default-clean) @ wagon-file ---
[linux-jdk9] [INFO] 
[linux-jdk9] [INFO] --- maven-enforcer-plugin:1.4.1:enforce (enforce-maven-version) @ wagon-file
---
[linux-jdk9] [INFO] 
[linux-jdk9] [INFO] --- maven-enforcer-plugin:1.4.1:enforce (enforce-bytecode-version) @ wagon-file
---
[linux-jdk9] [INFO] 
[linux-jdk9] [INFO] --- maven-enforcer-plugin:1.4.1:enforce (ban-known-bad-maven-versions)
@ wagon-file ---
[linux-jdk9] [INFO] 
[linux-jdk9] [INFO] --- maven-enforcer-plugin:1.4.1:enforce (default) @ wagon-file ---
[linux-jdk9] [INFO] 
[linux-jdk9] [INFO] --- apache-rat-plugin:0.12:check (rat-check) @ wagon-file ---
[linux-jdk9] [INFO] Enabled default license matchers.
[linux-jdk9] [INFO] Will parse SCM ignores for exclusions...
[linux-jdk9] [INFO] Finished adding exclusions from SCM ignore files.
[linux-jdk9] [INFO] 61 implicit excludes (use -debug for more details).
[linux-jdk9] [INFO] Exclude: .checkstyle
[linux-jdk9] [INFO] Exclude: **/*.odg
[linux-jdk9] [INFO] Exclude: src/test/resources/**
[linux-jdk9] [INFO] Exclude: src/main/resources/default-server-root/**
[linux-jdk9] [INFO] Exclude: src/main/resources/ssh-keys/**
[linux-jdk9] [INFO] Exclude: src/test/ssh-keys/**
[linux-jdk9] [INFO] Exclude: .repository/**
[linux-jdk9] [INFO] Exclude: out/**
[linux-jdk9] [INFO] Exclude: .repository/**
[linux-jdk9] [INFO] Exclude: .maven/spy.log
[linux-jdk9] [INFO] Exclude: dependency-reduced-pom.xml
[linux-jdk9] [INFO] Exclude: .java-version
[linux-jdk9] [INFO] 5 resources included (use -debug for more details)
[linux-jdk9] [INFO] Rat check: Summary over all files. Unapproved: 0, unknown: 0, generated:
0, approved: 5 licenses.
[linux-jdk9] [INFO] 
[linux-jdk9] [INFO] --- maven-remote-resources-plugin:1.5:process (process-resource-bundles)
@ wagon-file ---
[linux-jdk9] [INFO] 
[linux-jdk9] [INFO] --- maven-resources-plugin:3.0.2:resources (default-resources) @ wagon-file
---
[linux-jdk9] [INFO] Using 'UTF-8' encoding to copy filtered resources.
[linux-jdk9] [INFO] skip non existing resourceDirectory /home/jenkins/jenkins-slave/workspace/aven-box_maven-wagon_master-XZVDTOWPBGAU5B2ZTHNA6F4MQMMNHGQARGBUDFHBYYQHQ7B4WPHA/m/wagon-providers/wagon-file/src/main/resources
[linux-jdk9] [INFO] Copying 3 resources
[linux-jdk9] [INFO] 
[linux-jdk9] [INFO] --- maven-compiler-plugin:3.7.0:compile (default-compile) @ wagon-file
---
[linux-jdk9] [INFO] Changes detected - recompiling the module!
[linux-jdk9] [INFO] Compiling 1 source file to /home/jenkins/jenkins-slave/workspace/aven-box_maven-wagon_master-XZVDTOWPBGAU5B2ZTHNA6F4MQMMNHGQARGBUDFHBYYQHQ7B4WPHA/m/wagon-providers/wagon-file/target/classes
[linux-jdk9] [INFO] 
[linux-jdk9] [INFO] --- plexus-component-metadata:1.7.1:generate-metadata (generate) @ wagon-file
---
[linux-jdk9] [INFO] Discovered 1 component descriptors(s)
[linux-jdk9] [INFO] 
[linux-jdk9] [INFO] --- animal-sniffer-maven-plugin:1.15:check (check-java-1.7-compat) @ wagon-file
---
[linux-jdk9] [INFO] Checking unresolved references to org.codehaus.mojo.signature:java17:1.0
[linux-jdk9] Sending interrupt signal to process
[windows-jdk8] [INFO] Downloading: https://repo.maven.apache.org/maven2/org/apache/maven/surefire/maven-surefire-common/2.20/maven-surefire-common-2.20.pom
[windows-jdk8] [INFO] Downloaded: https://repo.maven.apache.org/maven2/org/apache/maven/surefire/maven-surefire-common/2.20/maven-surefire-common-2.20.pom
(9.4 kB at 21 kB/s)
[windows-jdk8] [INFO] Downloading: https://repo.maven.apache.org/maven2/org/apache/maven/plugin-tools/maven-plugin-annotations/3.3/maven-plugin-annotations-3.3.pom
[windows-jdk8] [INFO] Downloaded: https://repo.maven.apache.org/maven2/org/apache/maven/plugin-tools/maven-plugin-annotations/3.3/maven-plugin-annotations-3.3.pom
(1.6 kB at 102 kB/s)
[windows-jdk8] [INFO] Downloading: https://repo.maven.apache.org/maven2/org/apache/maven/plugin-tools/maven-plugin-tools/3.3/maven-plugin-tools-3.3.pom
[windows-jdk8] [INFO] Downloaded: https://repo.maven.apache.org/maven2/org/apache/maven/plugin-tools/maven-plugin-tools/3.3/maven-plugin-tools-3.3.pom
(13 kB at 744 kB/s)
[windows-jdk8] [INFO] Downloading: https://repo.maven.apache.org/maven2/org/apache/maven/surefire/surefire-api/2.20/surefire-api-2.20.pom
[windows-jdk8] [INFO] Downloaded: https://repo.maven.apache.org/maven2/org/apache/maven/surefire/surefire-api/2.20/surefire-api-2.20.pom
(3.7 kB at 161 kB/s)
[windows-jdk8] [INFO] Downloading: https://repo.maven.apache.org/maven2/org/apache/maven/surefire/surefire-logger-api/2.20/surefire-logger-api-2.20.pom
[windows-jdk8] [INFO] Downloaded: https://repo.maven.apache.org/maven2/org/apache/maven/surefire/surefire-logger-api/2.20/surefire-logger-api-2.20.pom
(2.0 kB at 122 kB/s)
[windows-jdk8] [INFO] Downloading: https://repo.maven.apache.org/maven2/org/apache/maven/surefire/surefire-booter/2.20/surefire-booter-2.20.pom
[windows-jdk8] [INFO] Downloaded: https://repo.maven.apache.org/maven2/org/apache/maven/surefire/surefire-booter/2.20/surefire-booter-2.20.pom
(3.2 kB at 212 kB/s)
[windows-jdk8] [INFO] Downloading: https://repo.maven.apache.org/maven2/org/apache/commons/commons-lang3/3.1/commons-lang3-3.1.pom
[windows-jdk9] [INFO] Downloading: https://repo.maven.apache.org/maven2/javax/xml/bind/jaxb-api/2.3.0/jaxb-api-2.3.0.jar
[windows-jdk9] [INFO] Downloaded: https://repo.maven.apache.org/maven2/javax/xml/bind/jaxb-api/2.3.0/jaxb-api-2.3.0.jar
(126 kB at 3.8 MB/s)
[windows-jdk7] [INFO] Tests run: 18, Failures: 0, Errors: 0, Skipped: 0, Time elapsed: 0.03
s - in org.apache.maven.wagon.StreamWagonTest
[windows-jdk7] [INFO] Running org.apache.maven.wagon.TransferFailedExceptionTest
[windows-jdk7] [INFO] Tests run: 1, Failures: 0, Errors: 0, Skipped: 0, Time elapsed: 0 s
- in org.apache.maven.wagon.TransferFailedExceptionTest
[windows-jdk7] [INFO] 
[windows-jdk7] [INFO] Results:
[windows-jdk7] [INFO] 
[windows-jdk7] [INFO] Tests run: 93, Failures: 0, Errors: 0, Skipped: 0
[windows-jdk7] [INFO] 
[windows-jdk7] [INFO] 
[windows-jdk7] [INFO] --- maven-jar-plugin:3.0.2:jar (default-jar) @ wagon-provider-api ---
[windows-jdk7] [INFO] Downloading: https://repo.maven.apache.org/maven2/org/apache/maven/shared/maven-shared-utils/3.0.1/maven-shared-utils-3.0.1.jar
[windows-jdk7] [INFO] Downloaded: https://repo.maven.apache.org/maven2/org/apache/maven/shared/maven-shared-utils/3.0.1/maven-shared-utils-3.0.1.jar
(154 kB at 4.8 MB/s)
[linux-jdk9] [INFO] 
[linux-jdk9] [INFO] --- maven-resources-plugin:3.0.2:testResources (default-testResources)
@ wagon-file ---
[linux-jdk9] [INFO] Using 'UTF-8' encoding to copy filtered resources.
[linux-jdk9] [INFO] skip non existing resourceDirectory /home/jenkins/jenkins-slave/workspace/aven-box_maven-wagon_master-XZVDTOWPBGAU5B2ZTHNA6F4MQMMNHGQARGBUDFHBYYQHQ7B4WPHA/m/wagon-providers/wagon-file/src/test/resources
[linux-jdk9] [INFO] Copying 3 resources
[linux-jdk9] [INFO] 
[linux-jdk9] [INFO] --- maven-compiler-plugin:3.7.0:testCompile (default-testCompile) @ wagon-file
---
[linux-jdk9] [INFO] Changes detected - recompiling the module!
[linux-jdk9] [INFO] Compiling 1 source file to /home/jenkins/jenkins-slave/workspace/aven-box_maven-wagon_master-XZVDTOWPBGAU5B2ZTHNA6F4MQMMNHGQARGBUDFHBYYQHQ7B4WPHA/m/wagon-providers/wagon-file/target/test-classes
[linux-jdk9] [INFO] /home/jenkins/jenkins-slave/workspace/aven-box_maven-wagon_master-XZVDTOWPBGAU5B2ZTHNA6F4MQMMNHGQARGBUDFHBYYQHQ7B4WPHA/m/wagon-providers/wagon-file/src/test/java/org/apache/maven/wagon/providers/file/FileWagonTest.java:
/home/jenkins/jenkins-slave/workspace/aven-box_maven-wagon_master-XZVDTOWPBGAU5B2ZTHNA6F4MQMMNHGQARGBUDFHBYYQHQ7B4WPHA/m/wagon-providers/wagon-file/src/test/java/org/apache/maven/wagon/providers/file/FileWagonTest.java
uses or overrides a deprecated API.
[linux-jdk9] [INFO] /home/jenkins/jenkins-slave/workspace/aven-box_maven-wagon_master-XZVDTOWPBGAU5B2ZTHNA6F4MQMMNHGQARGBUDFHBYYQHQ7B4WPHA/m/wagon-providers/wagon-file/src/test/java/org/apache/maven/wagon/providers/file/FileWagonTest.java:
Recompile with -Xlint:deprecation for details.
[linux-jdk9] [INFO] 
[linux-jdk9] [INFO] --- maven-surefire-plugin:2.20:test (default-test) @ wagon-file ---
[windows-jdk8] [INFO] Downloaded: https://repo.maven.apache.org/maven2/org/apache/commons/commons-lang3/3.1/commons-lang3-3.1.pom
(17 kB at 983 kB/s)
[windows-jdk8] [INFO] Downloading: https://repo.maven.apache.org/maven2/org/apache/commons/commons-parent/22/commons-parent-22.pom
[windows-jdk8] [INFO] Downloaded: https://repo.maven.apache.org/maven2/org/apache/commons/commons-parent/22/commons-parent-22.pom
(42 kB at 2.2 MB/s)
[windows-jdk8] [INFO] Downloading: https://repo.maven.apache.org/maven2/org/apache/maven/surefire/surefire-booter/2.20/surefire-booter-2.20.jar
[windows-jdk8] [INFO] Downloading: https://repo.maven.apache.org/maven2/org/apache/commons/commons-lang3/3.1/commons-lang3-3.1.jar
[windows-jdk8] [INFO] Downloading: https://repo.maven.apache.org/maven2/org/apache/maven/surefire/surefire-api/2.20/surefire-api-2.20.jar
[windows-jdk8] [INFO] Downloading: https://repo.maven.apache.org/maven2/org/apache/maven/surefire/surefire-logger-api/2.20/surefire-logger-api-2.20.jar
[windows-jdk8] [INFO] Downloading: https://repo.maven.apache.org/maven2/org/apache/maven/surefire/maven-surefire-common/2.20/maven-surefire-common-2.20.jar
[windows-jdk8] [INFO] Downloaded: https://repo.maven.apache.org/maven2/org/apache/maven/surefire/surefire-logger-api/2.20/surefire-logger-api-2.20.jar
(13 kB at 174 kB/s)
[windows-jdk8] [INFO] Downloading: https://repo.maven.apache.org/maven2/org/apache/maven/plugin-tools/maven-plugin-annotations/3.3/maven-plugin-annotations-3.3.jar
[windows-jdk8] [INFO] Downloaded: https://repo.maven.apache.org/maven2/org/apache/maven/plugin-tools/maven-plugin-annotations/3.3/maven-plugin-annotations-3.3.jar
(14 kB at 143 kB/s)
[windows-jdk8] [INFO] Downloaded: https://repo.maven.apache.org/maven2/org/apache/commons/commons-lang3/3.1/commons-lang3-3.1.jar
(316 kB at 3.1 MB/s)
[windows-jdk8] [INFO] Downloaded: https://repo.maven.apache.org/maven2/org/apache/maven/surefire/surefire-api/2.20/surefire-api-2.20.jar
(182 kB at 1.7 MB/s)
[windows-jdk8] [INFO] Downloaded: https://repo.maven.apache.org/maven2/org/apache/maven/surefire/surefire-booter/2.20/surefire-booter-2.20.jar
(50 kB at 363 kB/s)
[windows-jdk8] [INFO] Downloaded: https://repo.maven.apache.org/maven2/org/apache/maven/surefire/maven-surefire-common/2.20/maven-surefire-common-2.20.jar
(331 kB at 2.3 MB/s)
[windows-jdk8] Sending interrupt signal to process
[windows-jdk9] Sending interrupt signal to process
[windows-jdk7] Sending interrupt signal to process
[windows-jdk7] [INFO] Building jar: F:\jenkins\jenkins-slave\workspace\aven-box_maven-wagon_master-XZVDTOWPBGAU5B2ZTHNA6F4MQMMNHGQARGBUDFHBYYQHQ7B4WPHA\m\wagon-provider-api\target\wagon-provider-api-3.0.1-SNAPSHOT.jar
[windows-jdk7] [INFO] 
[windows-jdk7] [INFO] --- maven-site-plugin:3.7:attach-descriptor (attach-descriptor) @ wagon-provider-api
---
[windows-jdk7] [INFO] Skipping because packaging 'jar' is not pom.
[windows-jdk7] [INFO] 
[windows-jdk7] [INFO] --- maven-checkstyle-plugin:3.0.0:check (checkstyle-check) @ wagon-provider-api
---
[windows-jdk10] Sending interrupt signal to process
[Pipeline] [windows-jdk7] }
[Pipeline] [linux-jdk9] }
[Pipeline] [windows-jdk8] }
[Pipeline] [linux-jdk7] }
[Pipeline] [linux-jdk8] }
[Pipeline] [windows-jdk10] }
[Pipeline] [windows-jdk7] // dir
[Pipeline] [linux-jdk9] // dir
[Pipeline] [windows-jdk8] // dir
[Pipeline] [linux-jdk7] // dir
[Pipeline] [linux-jdk8] // dir
[Pipeline] [windows-jdk10] // dir
[Pipeline] [windows-jdk7] }
[windows-jdk7] [withMaven] One or multiple Maven executions have been ignored by the Jenkins
Pipeline Maven Plugin because they have been interrupted before completion (1). See Pipeline
Maven Plugin FAQ for more details.
[Pipeline] [linux-jdk9] }
[linux-jdk9] [withMaven] One or multiple Maven executions have been ignored by the Jenkins
Pipeline Maven Plugin because they have been interrupted before completion (1). See Pipeline
Maven Plugin FAQ for more details.
[Pipeline] [windows-jdk8] }
[windows-jdk8] [withMaven] One or multiple Maven executions have been ignored by the Jenkins
Pipeline Maven Plugin because they have been interrupted before completion (1). See Pipeline
Maven Plugin FAQ for more details.
[Pipeline] [linux-jdk7] }
[linux-jdk7] [withMaven] One or multiple Maven executions have been ignored by the Jenkins
Pipeline Maven Plugin because they have been interrupted before completion (1). See Pipeline
Maven Plugin FAQ for more details.
[Pipeline] [linux-jdk8] }
[linux-jdk8] [withMaven] One or multiple Maven executions have been ignored by the Jenkins
Pipeline Maven Plugin because they have been interrupted before completion (1). See Pipeline
Maven Plugin FAQ for more details.
[Pipeline] [windows-jdk10] }
[Pipeline] [windows-jdk7] // withMaven
[Pipeline] [linux-jdk9] // withMaven
[Pipeline] [windows-jdk8] // withMaven
[Pipeline] [linux-jdk7] // withMaven
[Pipeline] [linux-jdk8] // withMaven
[Pipeline] [windows-jdk10] // withMaven
[Pipeline] [windows-jdk7] echo
[windows-jdk7] [FAIL FAST] linux-jdk10 had first failure, ignoring script returned exit code
-1
[Pipeline] [windows-jdk7] }
[Pipeline] [linux-jdk9] echo
[linux-jdk9] [FAIL FAST] linux-jdk10 had first failure, ignoring script returned exit code
143
[Pipeline] [linux-jdk9] }
[Pipeline] [windows-jdk8] echo
[windows-jdk8] [FAIL FAST] linux-jdk10 had first failure, ignoring script returned exit code
-1
[Pipeline] [windows-jdk8] }
[Pipeline] [linux-jdk7] echo
[linux-jdk7] [FAIL FAST] linux-jdk10 had first failure, ignoring script returned exit code
143
[Pipeline] [linux-jdk7] }
[Pipeline] [linux-jdk8] echo
[linux-jdk8] [FAIL FAST] linux-jdk10 had first failure, ignoring script returned exit code
143
[Pipeline] [linux-jdk8] }
[Pipeline] [windows-jdk10] echo
[windows-jdk10] [FAIL FAST] linux-jdk10 had first failure, ignoring script returned exit code
1
[Pipeline] [windows-jdk10] }
[Pipeline] [windows-jdk7] // stage
[Pipeline] [linux-jdk9] // stage
[Pipeline] [windows-jdk8] // stage
[Pipeline] [linux-jdk7] // stage
[Pipeline] [linux-jdk8] // stage
[Pipeline] [windows-jdk10] // stage
[Pipeline] [linux-jdk7] }
[Pipeline] [linux-jdk8] }
[Pipeline] [linux-jdk9] }
[Pipeline] [windows-jdk7] }
[Pipeline] [windows-jdk8] }
[Pipeline] [windows-jdk10] }
[Pipeline] [linux-jdk7] // node
[Pipeline] [linux-jdk8] // node
[Pipeline] [linux-jdk9] // node
[Pipeline] [windows-jdk7] // node
[Pipeline] [windows-jdk8] // node
[Pipeline] [windows-jdk10] // node
[Pipeline] [linux-jdk7] }
[Pipeline] [linux-jdk8] }
[Pipeline] [linux-jdk9] }
[Pipeline] [windows-jdk7] }
[Pipeline] [windows-jdk8] }
[Pipeline] [windows-jdk10] }
[windows-jdk9] After 10s process did not stop
[Pipeline] [windows-jdk9] }
[Pipeline] [windows-jdk9] // dir
[Pipeline] [windows-jdk9] }
[windows-jdk9] [withMaven] One or multiple Maven executions have been ignored by the Jenkins
Pipeline Maven Plugin because they have been interrupted before completion (1). See Pipeline
Maven Plugin FAQ for more details.
[Pipeline] [windows-jdk9] // withMaven
[Pipeline] [windows-jdk9] echo
[windows-jdk9] [FAIL FAST] linux-jdk10 had first failure, ignoring null
[Pipeline] [windows-jdk9] }
[Pipeline] [windows-jdk9] // stage
[Pipeline] [windows-jdk9] }
[Pipeline] [windows-jdk9] // node
[Pipeline] [windows-jdk9] }
[Pipeline] // parallel
[Pipeline] echo
***** FAST FAILURE *****

Fast failure triggered by linux-jdk10

***** FAST FAILURE *****
[Pipeline] stage
[Pipeline] { (Notifications)
[Pipeline] echo
Build result: FAILURE
[Pipeline] jiraIssueSelector
[Pipeline] emailext
Mime
  • Unnamed multipart/mixed (inline, None, 0 bytes)
View raw message