maven-notifications mailing list archives

Site index · List index
Message view « Date » · « Thread »
Top « Date » · « Thread »
From Apache Jenkins Server <jenk...@builds.apache.org>
Subject Build unstable in Jenkins: Maven TLP » maven-dependency-plugin » MDEP-584 #3
Date Mon, 02 Apr 2018 11:36:27 GMT
See https://builds.apache.org/job/maven-box/job/maven-dependency-plugin/job/MDEP-584/3/

Changes:

* [MDEP-584] - Upgrade plexus-utils to version 3.1.0  o Code patch applied
* [MDEP-584] - Upgrade plexus-utils to version 3.1.0  o Code patch applied
* [MDEP-584] - Upgrade plexus-utils to version 3.1.0  o Code patch applied
* [MDEP-584] - Upgrade plexus-utils to version 3.1.0  o Code patch applied
* [MDEP-584] - Upgrade plexus-utils to version 3.1.0  o Code patch applied
* [MDEP-584] - Upgrade plexus-utils to version 3.1.0  o Code patch applied
* [MDEP-584] - Upgrade plexus-utils to version 3.1.0  o Code patch applied

16 tests failed.
FAILED:  org.apache.maven.plugins.dependency.fromDependencies.TestCopyDependenciesMojo.testDontOverWriteSnap

Error Message:
expected:<1000> but was:<2000>

Stack Trace:
junit.framework.AssertionFailedError: expected:<1000> but was:<2000>
	at org.apache.maven.plugins.dependency.fromDependencies.TestCopyDependenciesMojo.testDontOverWriteSnap(TestCopyDependenciesMojo.java:614)


FAILED:  org.apache.maven.plugins.dependency.fromDependencies.TestCopyDependenciesMojo.testDontOverWriteSnap

Error Message:
expected:<1000> but was:<2000>

Stack Trace:
junit.framework.AssertionFailedError: expected:<1000> but was:<2000>
	at org.apache.maven.plugins.dependency.fromDependencies.TestCopyDependenciesMojo.testDontOverWriteSnap(TestCopyDependenciesMojo.java:614)


FAILED:  org.apache.maven.plugins.dependency.fromDependencies.TestCopyDependenciesMojo.testDontOverWriteSnap

Error Message:
expected:<1000> but was:<2000>

Stack Trace:
junit.framework.AssertionFailedError: expected:<1000> but was:<2000>
	at org.apache.maven.plugins.dependency.fromDependencies.TestCopyDependenciesMojo.testDontOverWriteSnap(TestCopyDependenciesMojo.java:614)


FAILED:  org.apache.maven.plugins.dependency.fromDependencies.TestCopyDependenciesMojo.testDontOverWriteSnap

Error Message:
expected:<1000> but was:<2000>

Stack Trace:
junit.framework.AssertionFailedError: expected:<1000> but was:<2000>
	at org.apache.maven.plugins.dependency.fromDependencies.TestCopyDependenciesMojo.testDontOverWriteSnap(TestCopyDependenciesMojo.java:614)


FAILED:  org.apache.maven.plugins.dependency.fromDependencies.TestCopyDependenciesMojo.testDontOverWriteSnap

Error Message:
expected:<1000> but was:<2000>

Stack Trace:
junit.framework.AssertionFailedError: expected:<1000> but was:<2000>
	at org.apache.maven.plugins.dependency.fromDependencies.TestCopyDependenciesMojo.testDontOverWriteSnap(TestCopyDependenciesMojo.java:614)


FAILED:  org.apache.maven.plugins.dependency.fromDependencies.TestCopyDependenciesMojo.testDontOverWriteSnap

Error Message:
expected:<1000> but was:<2000>

Stack Trace:
junit.framework.AssertionFailedError: expected:<1000> but was:<2000>
	at org.apache.maven.plugins.dependency.fromDependencies.TestCopyDependenciesMojo.testDontOverWriteSnap(TestCopyDependenciesMojo.java:614)


FAILED:  org.apache.maven.plugins.dependency.fromDependencies.TestCopyDependenciesMojo.testDontOverWriteSnap

Error Message:
expected:<1000> but was:<2000>

Stack Trace:
junit.framework.AssertionFailedError: expected:<1000> but was:<2000>
	at org.apache.maven.plugins.dependency.fromDependencies.TestCopyDependenciesMojo.testDontOverWriteSnap(TestCopyDependenciesMojo.java:614)


FAILED:  org.apache.maven.plugins.dependency.fromDependencies.TestCopyDependenciesMojo.testDontOverWriteSnap

Error Message:
expected:<1000> but was:<2000>

Stack Trace:
junit.framework.AssertionFailedError: expected:<1000> but was:<2000>
	at org.apache.maven.plugins.dependency.fromDependencies.TestCopyDependenciesMojo.testDontOverWriteSnap(TestCopyDependenciesMojo.java:614)


FAILED:  org.apache.maven.plugins.dependency.fromDependencies.TestCopyDependenciesMojo.testOverWriteSnap

Error Message:
null

Stack Trace:
junit.framework.AssertionFailedError
	at org.apache.maven.plugins.dependency.fromDependencies.TestCopyDependenciesMojo.testOverWriteSnap(TestCopyDependenciesMojo.java:649)


FAILED:  org.apache.maven.plugins.dependency.fromDependencies.TestCopyDependenciesMojo.testOverWriteSnap

Error Message:
null

Stack Trace:
junit.framework.AssertionFailedError
	at org.apache.maven.plugins.dependency.fromDependencies.TestCopyDependenciesMojo.testOverWriteSnap(TestCopyDependenciesMojo.java:649)


FAILED:  org.apache.maven.plugins.dependency.fromDependencies.TestCopyDependenciesMojo.testOverWriteSnap

Error Message:
null

Stack Trace:
junit.framework.AssertionFailedError
	at org.apache.maven.plugins.dependency.fromDependencies.TestCopyDependenciesMojo.testOverWriteSnap(TestCopyDependenciesMojo.java:649)


FAILED:  org.apache.maven.plugins.dependency.fromDependencies.TestCopyDependenciesMojo.testOverWriteSnap

Error Message:
null

Stack Trace:
junit.framework.AssertionFailedError
	at org.apache.maven.plugins.dependency.fromDependencies.TestCopyDependenciesMojo.testOverWriteSnap(TestCopyDependenciesMojo.java:649)


FAILED:  org.apache.maven.plugins.dependency.fromDependencies.TestCopyDependenciesMojo.testOverWriteSnap

Error Message:
null

Stack Trace:
junit.framework.AssertionFailedError
	at org.apache.maven.plugins.dependency.fromDependencies.TestCopyDependenciesMojo.testOverWriteSnap(TestCopyDependenciesMojo.java:649)


FAILED:  org.apache.maven.plugins.dependency.fromDependencies.TestCopyDependenciesMojo.testOverWriteSnap

Error Message:
null

Stack Trace:
junit.framework.AssertionFailedError
	at org.apache.maven.plugins.dependency.fromDependencies.TestCopyDependenciesMojo.testOverWriteSnap(TestCopyDependenciesMojo.java:649)


FAILED:  org.apache.maven.plugins.dependency.fromDependencies.TestCopyDependenciesMojo.testOverWriteSnap

Error Message:
null

Stack Trace:
junit.framework.AssertionFailedError
	at org.apache.maven.plugins.dependency.fromDependencies.TestCopyDependenciesMojo.testOverWriteSnap(TestCopyDependenciesMojo.java:649)


FAILED:  org.apache.maven.plugins.dependency.fromDependencies.TestCopyDependenciesMojo.testOverWriteSnap

Error Message:
null

Stack Trace:
junit.framework.AssertionFailedError
	at org.apache.maven.plugins.dependency.fromDependencies.TestCopyDependenciesMojo.testOverWriteSnap(TestCopyDependenciesMojo.java:649)




Build log:
[...truncated 2.89 MB...]
[linux-jdk10] [INFO] run pre-build script setup.bsh
[linux-jdk10] [INFO] artifact org.apache.maven.its.dependency.fake-remote-copy:1.0: checking
for updates from central
[linux-jdk10] [INFO] org.apache.maven.its.dependency.fake-remote-copy.1.0: checking for updates
from central
[linux-jdk10] [INFO] run post-build script verify.bsh
[linux-jdk10] [INFO]           copy-from-remote-repository/pom.xml .............. SUCCESS
(5.8 s)
[linux-jdk10] [INFO] Building: mdep-439-analyze-java8/pom.xml
[linux-jdk10] [INFO]           mdep-439-analyze-java8/pom.xml ................... SUCCESS
(6.2 s)
[linux-jdk10] [INFO] Building: unpack-cli/pom.xml
[linux-jdk10] [INFO] run post-build script verify.bsh
[linux-jdk10] [INFO]           unpack-cli/pom.xml ............................... SUCCESS
(4.5 s)
[linux-jdk10] [INFO] Building: mdep-572-unpack-tar-long-file/pom.xml
[linux-jdk10] [INFO] run post-build script verify.bsh
[linux-jdk10] [INFO]           mdep-572-unpack-tar-long-file/pom.xml ............ SUCCESS
(5.8 s)
[linux-jdk10] [INFO] Building: build-classpath/pom.xml
[linux-jdk10] [INFO] run post-build script verify.bsh
[linux-jdk10] [INFO]           build-classpath/pom.xml .......................... SUCCESS
(4.4 s)
[linux-jdk10] [INFO] Building: analyze-dep-mgt/pom.xml
[linux-jdk10] [INFO]           analyze-dep-mgt/pom.xml .......................... SUCCESS
(4.5 s)
[linux-jdk10] [INFO] Building: analyze-ignore-dependency/pom.xml
[linux-jdk7] [INFO] run post-build script verify.bsh
[linux-jdk7] [INFO]           purge-local-repository-version-range/pom.xml ..... SUCCESS (905.7
s)
[linux-jdk7] [INFO] Building: mdep-580_display-manifest-automodules/pom.xml
[linux-jdk7] [INFO]           mdep-580_display-manifest-automodules/pom.xml .... SKIPPED due
to JRE version
[linux-jdk7] [INFO] Building: purge-local-repository-reresolve/pom.xml
[linux-jdk7] [INFO] run post-build script verify.bsh
[linux-jdk7] [INFO]           purge-local-repository-reresolve/pom.xml ......... SUCCESS (5.8
s)
[linux-jdk7] [INFO] Building: analyze/pom.xml
[linux-jdk7] [INFO] run post-build script verify.bsh
[linux-jdk7] [INFO]           analyze/pom.xml .................................. SUCCESS (7.4
s)
[linux-jdk7] [INFO] Building: unpack-from-remote-repository/pom.xml
[linux-jdk7] [INFO] run pre-build script setup.bsh
[linux-jdk10] [INFO]           analyze-ignore-dependency/pom.xml ................ SUCCESS
(5.8 s)
[linux-jdk10] [INFO] Building: purge-local-repository-without-pom
[linux-jdk10] [INFO] run pre-build script setup.bsh
[linux-jdk10] [INFO] run post-build script verify.bsh
[linux-jdk10] [INFO]           purge-local-repository-without-pom ............... SUCCESS
(4.3 s)
[linux-jdk10] [INFO] 
[linux-jdk10] [INFO] --- mrm-maven-plugin:1.0.0:stop (default) @ maven-dependency-plugin ---
[linux-jdk10] [INFO] Stopping Mock Repository Manager on http://localhost:46606
[linux-jdk10] [INFO] Mock Repository Manager http://localhost:46606 is stopped.
[linux-jdk10] [INFO] 
[linux-jdk10] [INFO] --- maven-checkstyle-plugin:3.0.0:check (checkstyle-check) @ maven-dependency-plugin
---
[linux-jdk10] [INFO] Downloading from central: https://repo.maven.apache.org/maven2/org/apache/maven/shared/maven-shared-resources/2/maven-shared-resources-2.pom
[linux-jdk10] [INFO] Downloaded from central: https://repo.maven.apache.org/maven2/org/apache/maven/shared/maven-shared-resources/2/maven-shared-resources-2.pom
(3.0 kB at 211 kB/s)
[linux-jdk10] [INFO] Downloading from central: https://repo.maven.apache.org/maven2/org/apache/maven/doxia/doxia-integration-tools/1.6/doxia-integration-tools-1.6.pom
[linux-jdk10] [INFO] Downloaded from central: https://repo.maven.apache.org/maven2/org/apache/maven/doxia/doxia-integration-tools/1.6/doxia-integration-tools-1.6.pom
(7.0 kB at 580 kB/s)
[linux-jdk10] [INFO] Downloading from central: https://repo.maven.apache.org/maven2/org/apache/maven/doxia/doxia-tools/3/doxia-tools-3.pom
[linux-jdk10] [INFO] Downloaded from central: https://repo.maven.apache.org/maven2/org/apache/maven/doxia/doxia-tools/3/doxia-tools-3.pom
(9.9 kB at 827 kB/s)
[linux-jdk10] [INFO] Downloading from central: https://repo.maven.apache.org/maven2/org/codehaus/plexus/plexus-resources/1.1.0/plexus-resources-1.1.0.pom
[linux-jdk10] [INFO] Downloaded from central: https://repo.maven.apache.org/maven2/org/codehaus/plexus/plexus-resources/1.1.0/plexus-resources-1.1.0.pom
(3.2 kB at 244 kB/s)
[linux-jdk10] [INFO] Downloading from central: https://repo.maven.apache.org/maven2/com/puppycrawl/tools/checkstyle/6.18/checkstyle-6.18.pom
[linux-jdk10] [INFO] Downloaded from central: https://repo.maven.apache.org/maven2/com/puppycrawl/tools/checkstyle/6.18/checkstyle-6.18.pom
(71 kB at 3.6 MB/s)
[linux-jdk10] [INFO] Downloading from central: https://repo.maven.apache.org/maven2/antlr/antlr/2.7.7/antlr-2.7.7.pom
[linux-jdk10] [INFO] Downloaded from central: https://repo.maven.apache.org/maven2/antlr/antlr/2.7.7/antlr-2.7.7.pom
(632 B at 57 kB/s)
[linux-jdk10] [INFO] Downloading from central: https://repo.maven.apache.org/maven2/org/antlr/antlr4-runtime/4.5.3/antlr4-runtime-4.5.3.pom
[linux-jdk10] [INFO] Downloaded from central: https://repo.maven.apache.org/maven2/org/antlr/antlr4-runtime/4.5.3/antlr4-runtime-4.5.3.pom
(2.3 kB at 210 kB/s)
[linux-jdk10] [INFO] Downloading from central: https://repo.maven.apache.org/maven2/org/antlr/antlr4-master/4.5.3/antlr4-master-4.5.3.pom
[linux-jdk10] [INFO] Downloaded from central: https://repo.maven.apache.org/maven2/org/antlr/antlr4-master/4.5.3/antlr4-master-4.5.3.pom
(3.7 kB at 335 kB/s)
[linux-jdk10] [INFO] Downloading from central: https://repo.maven.apache.org/maven2/commons-beanutils/commons-beanutils/1.9.2/commons-beanutils-1.9.2.pom
[linux-jdk10] [INFO] Downloaded from central: https://repo.maven.apache.org/maven2/commons-beanutils/commons-beanutils/1.9.2/commons-beanutils-1.9.2.pom
(14 kB at 1.1 MB/s)
[linux-jdk10] [INFO] Downloading from central: https://repo.maven.apache.org/maven2/commons-cli/commons-cli/1.3.1/commons-cli-1.3.1.pom
[linux-jdk10] [INFO] Downloaded from central: https://repo.maven.apache.org/maven2/commons-cli/commons-cli/1.3.1/commons-cli-1.3.1.pom
(10 kB at 945 kB/s)
[linux-jdk10] [INFO] Downloading from central: https://repo.maven.apache.org/maven2/com/google/guava/guava/19.0/guava-19.0.pom
[linux-jdk10] [INFO] Downloaded from central: https://repo.maven.apache.org/maven2/com/google/guava/guava/19.0/guava-19.0.pom
(6.8 kB at 566 kB/s)
[linux-jdk10] [INFO] Downloading from central: https://repo.maven.apache.org/maven2/com/google/guava/guava-parent/19.0/guava-parent-19.0.pom
[linux-jdk10] [INFO] Downloaded from central: https://repo.maven.apache.org/maven2/com/google/guava/guava-parent/19.0/guava-parent-19.0.pom
(9.9 kB at 898 kB/s)
[linux-jdk10] [INFO] Downloading from central: https://repo.maven.apache.org/maven2/org/sonatype/oss/oss-parent/7/oss-parent-7.pom
[linux-jdk10] [INFO] Downloaded from central: https://repo.maven.apache.org/maven2/org/sonatype/oss/oss-parent/7/oss-parent-7.pom
(4.8 kB at 402 kB/s)
[linux-jdk10] [INFO] Downloading from central: https://repo.maven.apache.org/maven2/javax/xml/bind/jaxb-api/2.3.0/jaxb-api-2.3.0.pom
[linux-jdk10] [INFO] Downloaded from central: https://repo.maven.apache.org/maven2/javax/xml/bind/jaxb-api/2.3.0/jaxb-api-2.3.0.pom
(23 kB at 1.8 MB/s)
[linux-jdk10] [INFO] Downloading from central: https://repo.maven.apache.org/maven2/javax/xml/bind/jaxb-api-parent/2.3.0/jaxb-api-parent-2.3.0.pom
[linux-jdk10] [INFO] Downloaded from central: https://repo.maven.apache.org/maven2/javax/xml/bind/jaxb-api-parent/2.3.0/jaxb-api-parent-2.3.0.pom
(5.6 kB at 470 kB/s)
[linux-jdk10] [INFO] Downloading from central: https://repo.maven.apache.org/maven2/net/java/jvnet-parent/5/jvnet-parent-5.pom
[linux-jdk10] [INFO] Downloaded from central: https://repo.maven.apache.org/maven2/net/java/jvnet-parent/5/jvnet-parent-5.pom
(8.9 kB at 739 kB/s)
[linux-jdk10] [INFO] Downloading from central: https://repo.maven.apache.org/maven2/org/apache/maven/shared/maven-shared-resources/2/maven-shared-resources-2.jar
[linux-jdk10] [INFO] Downloading from central: https://repo.maven.apache.org/maven2/org/apache/maven/doxia/doxia-integration-tools/1.6/doxia-integration-tools-1.6.jar
[linux-jdk10] [INFO] Downloading from central: https://repo.maven.apache.org/maven2/org/codehaus/plexus/plexus-resources/1.1.0/plexus-resources-1.1.0.jar
[linux-jdk10] [INFO] Downloading from central: https://repo.maven.apache.org/maven2/com/puppycrawl/tools/checkstyle/6.18/checkstyle-6.18.jar
[linux-jdk10] [INFO] Downloading from central: https://repo.maven.apache.org/maven2/antlr/antlr/2.7.7/antlr-2.7.7.jar
[linux-jdk10] [INFO] Downloaded from central: https://repo.maven.apache.org/maven2/org/codehaus/plexus/plexus-resources/1.1.0/plexus-resources-1.1.0.jar
(23 kB at 1.1 MB/s)
[linux-jdk10] [INFO] Downloading from central: https://repo.maven.apache.org/maven2/org/antlr/antlr4-runtime/4.5.3/antlr4-runtime-4.5.3.jar
[linux-jdk10] [INFO] Downloaded from central: https://repo.maven.apache.org/maven2/org/apache/maven/doxia/doxia-integration-tools/1.6/doxia-integration-tools-1.6.jar
(45 kB at 1.5 MB/s)
[linux-jdk10] [INFO] Downloading from central: https://repo.maven.apache.org/maven2/commons-beanutils/commons-beanutils/1.9.2/commons-beanutils-1.9.2.jar
[linux-jdk10] [INFO] Downloaded from central: https://repo.maven.apache.org/maven2/antlr/antlr/2.7.7/antlr-2.7.7.jar
(445 kB at 8.9 MB/s)
[linux-jdk10] [INFO] Downloading from central: https://repo.maven.apache.org/maven2/commons-cli/commons-cli/1.3.1/commons-cli-1.3.1.jar
[linux-jdk10] [INFO] Downloaded from central: https://repo.maven.apache.org/maven2/org/antlr/antlr4-runtime/4.5.3/antlr4-runtime-4.5.3.jar
(302 kB at 5.5 MB/s)
[linux-jdk10] [INFO] Downloading from central: https://repo.maven.apache.org/maven2/com/google/guava/guava/19.0/guava-19.0.jar
[linux-jdk10] [INFO] Downloaded from central: https://repo.maven.apache.org/maven2/org/apache/maven/shared/maven-shared-resources/2/maven-shared-resources-2.jar
(13 kB at 207 kB/s)
[linux-jdk10] [INFO] Downloading from central: https://repo.maven.apache.org/maven2/javax/xml/bind/jaxb-api/2.3.0/jaxb-api-2.3.0.jar
[linux-jdk10] [INFO] Downloaded from central: https://repo.maven.apache.org/maven2/commons-cli/commons-cli/1.3.1/commons-cli-1.3.1.jar
(53 kB at 855 kB/s)
[linux-jdk10] [INFO] Downloaded from central: https://repo.maven.apache.org/maven2/commons-beanutils/commons-beanutils/1.9.2/commons-beanutils-1.9.2.jar
(234 kB at 3.5 MB/s)
[linux-jdk10] [INFO] Downloaded from central: https://repo.maven.apache.org/maven2/javax/xml/bind/jaxb-api/2.3.0/jaxb-api-2.3.0.jar
(126 kB at 1.5 MB/s)
[linux-jdk10] [INFO] Downloaded from central: https://repo.maven.apache.org/maven2/com/puppycrawl/tools/checkstyle/6.18/checkstyle-6.18.jar
(1.2 MB at 9.2 MB/s)
[linux-jdk10] [INFO] Downloaded from central: https://repo.maven.apache.org/maven2/com/google/guava/guava/19.0/guava-19.0.jar
(2.3 MB at 14 MB/s)
[linux-jdk10] [INFO] There is 1 error reported by Checkstyle 6.18 with config/maven_checks.xml
ruleset.
[linux-jdk10] [INFO] Ignored 1 error, 0 violation remaining.
[linux-jdk10] [INFO] 
[linux-jdk10] [INFO] --- maven-invoker-plugin:3.0.1:verify (integration-test) @ maven-dependency-plugin
---
[linux-jdk10] [INFO] -------------------------------------------------
[linux-jdk10] [INFO] Build Summary:
[linux-jdk10] [INFO]   Passed: 57, Failed: 0, Errors: 0, Skipped: 1
[linux-jdk10] [INFO] -------------------------------------------------
[linux-jdk10] [INFO] ------------------------------------------------------------------------
[linux-jdk10] [INFO] BUILD SUCCESS
[linux-jdk10] [INFO] ------------------------------------------------------------------------
[linux-jdk10] [INFO] Total time: 21:09 min
[linux-jdk10] [INFO] Finished at: 2018-04-02T11:35:21Z
[linux-jdk10] [INFO] Final Memory: 52M/256M
[linux-jdk10] [INFO] ------------------------------------------------------------------------
[linux-jdk10] [INFO] [jenkins-event-spy] Generated /home/jenkins/jenkins-slave/workspace/-dependency-plugin_MDEP-584-BWYUMMJPNAGFBD3O5TKOGKIHGPKUTZG3QJ423DJRDMSIFVDEDTUQ@tmp/withMaven7f56febb/maven-spy-20180402-111411-20714591326671346218819.log
[Pipeline] [linux-jdk10] }
[Pipeline] [linux-jdk10] // dir
[linux-jdk7] [INFO] artifact org.apache.maven.its.dependency.fake-remote-unpack:1.0: checking
for updates from central
[linux-jdk7] [INFO] org.apache.maven.its.dependency.fake-remote-unpack.1.0: checking for updates
from central
[linux-jdk7] [INFO] run post-build script verify.bsh
[linux-jdk7] [INFO]           unpack-from-remote-repository/pom.xml ............ SUCCESS (7.8
s)
[linux-jdk7] [INFO] Building: copy/pom.xml
[Pipeline] [linux-jdk10] }
[linux-jdk10] [withMaven] junitPublisher - Archive test results for Maven artifact org.apache.maven.plugins:maven-dependency-plugin:3.1.0-SNAPSHOT
generated by maven-surefire-plugin:test (default-test): m/target/surefire-reports/*.xml
[linux-jdk10] [withMaven] junitPublisher - Jenkins JUnit Attachments Plugin not found, can't
publish test attachments.Recording test results
[Pipeline] [linux-jdk10] // withMaven
[Pipeline] [linux-jdk10] }
[Pipeline] [linux-jdk10] // stage
[Pipeline] [linux-jdk10] }
[Pipeline] [linux-jdk10] // node
[Pipeline] [linux-jdk10] }
[linux-jdk7] [INFO] run post-build script verify.bsh
[linux-jdk7] [INFO]           copy/pom.xml ..................................... SUCCESS (5.8
s)
[linux-jdk7] [INFO] Building: list-repositories/pom.xml
[linux-jdk7] [INFO]           list-repositories/pom.xml ........................ SUCCESS (5.4
s)
[linux-jdk7] [INFO] Building: get-artifact-maven-plugin/pom.xml
[linux-jdk7] [INFO] run pre-build script setup.bsh
[linux-jdk7] [INFO] run post-build script verify.bsh
[linux-jdk7] [INFO]           get-artifact-maven-plugin/pom.xml ................ SUCCESS (5.8
s)
[linux-jdk7] [INFO] Building: analyze-ignore-unused-declared-dependency/pom.xml
[linux-jdk7] [INFO]           analyze-ignore-unused-declared-dependency/pom.xml  SUCCESS (7.2
s)
[linux-jdk7] [INFO] Building: tree-multimodule/pom.xml
[linux-jdk7] [INFO] snapshot org.apache.maven.its.dependency:tree-multimodule-module-a:1.0-SNAPSHOT:
checking for updates from Nexus
[linux-jdk7] [INFO] artifact org.apache.maven.its.dependency.tree-multimodule-module-a:1.0-SNAPSHOT:
checking for updates from central
[linux-jdk7] [INFO] org.apache.maven.its.dependency.tree-multimodule-module-a.1.0-SNAPSHOT:
checking for updates from central
[linux-jdk7] [INFO] run post-build script verify.bsh
[linux-jdk7] [INFO]           tree-multimodule/pom.xml ......................... SUCCESS (6.3
s)
[linux-jdk7] [INFO] Building: purge-local-repository-multi-module-execution/pom.xml
[linux-jdk7] [INFO] run pre-build script setup.bsh
[linux-jdk7] [INFO] run post-build script verify.bsh
[linux-jdk7] [INFO]           purge-local-repository-multi-module-execution/pom.xml SUCCESS
(6.4 s)
[linux-jdk7] [INFO] Building: purge-local-repository/pom.xml
[linux-jdk7] [INFO] run pre-build script setup.bsh
[linux-jdk7] [INFO] run post-build script verify.bsh
[linux-jdk7] [INFO]           purge-local-repository/pom.xml ................... SUCCESS (5.9
s)
[linux-jdk7] [INFO] Building: analyze-dep-mgt/pom.xml
[linux-jdk7] [INFO]           analyze-dep-mgt/pom.xml .......................... SUCCESS (5.7
s)
[linux-jdk7] [INFO] Building: purge-local-repository-without-pom
[linux-jdk7] [INFO] run pre-build script setup.bsh
[linux-jdk7] [INFO] run post-build script verify.bsh
[linux-jdk7] [INFO]           purge-local-repository-without-pom ............... SUCCESS (5.8
s)
[linux-jdk7] [INFO] 
[linux-jdk7] [INFO] --- mrm-maven-plugin:1.0.0:stop (default) @ maven-dependency-plugin ---
[linux-jdk7] [INFO] Stopping Mock Repository Manager on http://localhost:35337
[linux-jdk7] [INFO] Mock Repository Manager http://localhost:35337 is stopped.
[linux-jdk7] [INFO] 
[linux-jdk7] [INFO] --- maven-checkstyle-plugin:3.0.0:check (checkstyle-check) @ maven-dependency-plugin
---
[linux-jdk7] [INFO] Downloading from central: https://repo.maven.apache.org/maven2/org/apache/maven/shared/maven-shared-resources/2/maven-shared-resources-2.pom
[linux-jdk7] [INFO] Downloaded from central: https://repo.maven.apache.org/maven2/org/apache/maven/shared/maven-shared-resources/2/maven-shared-resources-2.pom
(3.0 kB at 106 kB/s)
[linux-jdk7] [INFO] Downloading from central: https://repo.maven.apache.org/maven2/org/apache/maven/doxia/doxia-integration-tools/1.6/doxia-integration-tools-1.6.pom
[linux-jdk7] [INFO] Downloaded from central: https://repo.maven.apache.org/maven2/org/apache/maven/doxia/doxia-integration-tools/1.6/doxia-integration-tools-1.6.pom
(7.0 kB at 580 kB/s)
[linux-jdk7] [INFO] Downloading from central: https://repo.maven.apache.org/maven2/org/apache/maven/doxia/doxia-tools/3/doxia-tools-3.pom
[linux-jdk7] [INFO] Downloaded from central: https://repo.maven.apache.org/maven2/org/apache/maven/doxia/doxia-tools/3/doxia-tools-3.pom
(9.9 kB at 764 kB/s)
[linux-jdk7] [INFO] Downloading from central: https://repo.maven.apache.org/maven2/org/codehaus/plexus/plexus-resources/1.1.0/plexus-resources-1.1.0.pom
[linux-jdk7] [INFO] Downloaded from central: https://repo.maven.apache.org/maven2/org/codehaus/plexus/plexus-resources/1.1.0/plexus-resources-1.1.0.pom
(3.2 kB at 265 kB/s)
[linux-jdk7] [INFO] Downloading from central: https://repo.maven.apache.org/maven2/com/puppycrawl/tools/checkstyle/6.18/checkstyle-6.18.pom
[linux-jdk7] [INFO] Downloaded from central: https://repo.maven.apache.org/maven2/com/puppycrawl/tools/checkstyle/6.18/checkstyle-6.18.pom
(71 kB at 3.2 MB/s)
[linux-jdk7] [INFO] Downloading from central: https://repo.maven.apache.org/maven2/antlr/antlr/2.7.7/antlr-2.7.7.pom
[linux-jdk7] [INFO] Downloaded from central: https://repo.maven.apache.org/maven2/antlr/antlr/2.7.7/antlr-2.7.7.pom
(632 B at 45 kB/s)
[linux-jdk7] [INFO] Downloading from central: https://repo.maven.apache.org/maven2/org/antlr/antlr4-runtime/4.5.3/antlr4-runtime-4.5.3.pom
[linux-jdk7] [INFO] Downloaded from central: https://repo.maven.apache.org/maven2/org/antlr/antlr4-runtime/4.5.3/antlr4-runtime-4.5.3.pom
(2.3 kB at 192 kB/s)
[linux-jdk7] [INFO] Downloading from central: https://repo.maven.apache.org/maven2/org/antlr/antlr4-master/4.5.3/antlr4-master-4.5.3.pom
[linux-jdk7] [INFO] Downloaded from central: https://repo.maven.apache.org/maven2/org/antlr/antlr4-master/4.5.3/antlr4-master-4.5.3.pom
(3.7 kB at 307 kB/s)
[linux-jdk7] [INFO] Downloading from central: https://repo.maven.apache.org/maven2/commons-beanutils/commons-beanutils/1.9.2/commons-beanutils-1.9.2.pom
[linux-jdk7] [INFO] Downloaded from central: https://repo.maven.apache.org/maven2/commons-beanutils/commons-beanutils/1.9.2/commons-beanutils-1.9.2.pom
(14 kB at 1.1 MB/s)
[linux-jdk7] [INFO] Downloading from central: https://repo.maven.apache.org/maven2/commons-cli/commons-cli/1.3.1/commons-cli-1.3.1.pom
[linux-jdk7] [INFO] Downloaded from central: https://repo.maven.apache.org/maven2/commons-cli/commons-cli/1.3.1/commons-cli-1.3.1.pom
(10 kB at 866 kB/s)
[linux-jdk7] [INFO] Downloading from central: https://repo.maven.apache.org/maven2/com/google/guava/guava/19.0/guava-19.0.pom
[linux-jdk7] [INFO] Downloaded from central: https://repo.maven.apache.org/maven2/com/google/guava/guava/19.0/guava-19.0.pom
(6.8 kB at 522 kB/s)
[linux-jdk7] [INFO] Downloading from central: https://repo.maven.apache.org/maven2/com/google/guava/guava-parent/19.0/guava-parent-19.0.pom
[linux-jdk7] [INFO] Downloaded from central: https://repo.maven.apache.org/maven2/com/google/guava/guava-parent/19.0/guava-parent-19.0.pom
(9.9 kB at 760 kB/s)
[linux-jdk7] [INFO] Downloading from central: https://repo.maven.apache.org/maven2/org/sonatype/oss/oss-parent/7/oss-parent-7.pom
[linux-jdk7] [INFO] Downloaded from central: https://repo.maven.apache.org/maven2/org/sonatype/oss/oss-parent/7/oss-parent-7.pom
(4.8 kB at 371 kB/s)
[linux-jdk7] [INFO] Downloading from central: https://repo.maven.apache.org/maven2/org/apache/maven/shared/maven-shared-resources/2/maven-shared-resources-2.jar
[linux-jdk7] [INFO] Downloading from central: https://repo.maven.apache.org/maven2/org/apache/maven/doxia/doxia-integration-tools/1.6/doxia-integration-tools-1.6.jar
[linux-jdk7] [INFO] Downloading from central: https://repo.maven.apache.org/maven2/org/codehaus/plexus/plexus-resources/1.1.0/plexus-resources-1.1.0.jar
[linux-jdk7] [INFO] Downloading from central: https://repo.maven.apache.org/maven2/com/puppycrawl/tools/checkstyle/6.18/checkstyle-6.18.jar
[linux-jdk7] [INFO] Downloading from central: https://repo.maven.apache.org/maven2/antlr/antlr/2.7.7/antlr-2.7.7.jar
[linux-jdk7] [INFO] Downloaded from central: https://repo.maven.apache.org/maven2/org/apache/maven/shared/maven-shared-resources/2/maven-shared-resources-2.jar
(13 kB at 870 kB/s)
[linux-jdk7] [INFO] Downloading from central: https://repo.maven.apache.org/maven2/org/antlr/antlr4-runtime/4.5.3/antlr4-runtime-4.5.3.jar
[linux-jdk7] [INFO] Downloaded from central: https://repo.maven.apache.org/maven2/org/codehaus/plexus/plexus-resources/1.1.0/plexus-resources-1.1.0.jar
(23 kB at 645 kB/s)
[linux-jdk7] [INFO] Downloading from central: https://repo.maven.apache.org/maven2/commons-beanutils/commons-beanutils/1.9.2/commons-beanutils-1.9.2.jar
[linux-jdk7] [INFO] Downloaded from central: https://repo.maven.apache.org/maven2/org/apache/maven/doxia/doxia-integration-tools/1.6/doxia-integration-tools-1.6.jar
(45 kB at 1.0 MB/s)
[linux-jdk7] [INFO] Downloading from central: https://repo.maven.apache.org/maven2/commons-cli/commons-cli/1.3.1/commons-cli-1.3.1.jar
[linux-jdk7] [INFO] Downloaded from central: https://repo.maven.apache.org/maven2/commons-cli/commons-cli/1.3.1/commons-cli-1.3.1.jar
(53 kB at 869 kB/s)
[linux-jdk7] [INFO] Downloading from central: https://repo.maven.apache.org/maven2/com/google/guava/guava/19.0/guava-19.0.jar
[linux-jdk7] [INFO] Downloaded from central: https://repo.maven.apache.org/maven2/org/antlr/antlr4-runtime/4.5.3/antlr4-runtime-4.5.3.jar
(302 kB at 5.0 MB/s)
[linux-jdk7] [INFO] Downloaded from central: https://repo.maven.apache.org/maven2/commons-beanutils/commons-beanutils/1.9.2/commons-beanutils-1.9.2.jar
(234 kB at 3.2 MB/s)
[linux-jdk7] [INFO] Downloaded from central: https://repo.maven.apache.org/maven2/antlr/antlr/2.7.7/antlr-2.7.7.jar
(445 kB at 6.1 MB/s)
[linux-jdk7] [INFO] Downloaded from central: https://repo.maven.apache.org/maven2/com/puppycrawl/tools/checkstyle/6.18/checkstyle-6.18.jar
(1.2 MB at 8.9 MB/s)
[linux-jdk7] [INFO] Downloaded from central: https://repo.maven.apache.org/maven2/com/google/guava/guava/19.0/guava-19.0.jar
(2.3 MB at 11 MB/s)
[linux-jdk7] [INFO] There is 1 error reported by Checkstyle 6.18 with config/maven_checks.xml
ruleset.
[linux-jdk7] [INFO] Ignored 1 error, 0 violation remaining.
[linux-jdk7] [INFO] 
[linux-jdk7] [INFO] --- maven-invoker-plugin:3.0.1:verify (integration-test) @ maven-dependency-plugin
---
[linux-jdk7] [INFO] -------------------------------------------------
[linux-jdk7] [INFO] Build Summary:
[linux-jdk7] [INFO]   Passed: 52, Failed: 0, Errors: 0, Skipped: 6
[linux-jdk7] [INFO] -------------------------------------------------
[linux-jdk7] [INFO] ------------------------------------------------------------------------
[linux-jdk7] [INFO] BUILD SUCCESS
[linux-jdk7] [INFO] ------------------------------------------------------------------------
[linux-jdk7] [INFO] Total time: 22:04 min
[linux-jdk7] [INFO] Finished at: 2018-04-02T11:36:19Z
[linux-jdk7] [INFO] Final Memory: 56M/1741M
[linux-jdk7] [INFO] ------------------------------------------------------------------------
[linux-jdk7] [INFO] [jenkins-event-spy] Generated /home/jenkins/jenkins-slave/workspace/-dependency-plugin_MDEP-584-BWYUMMJPNAGFBD3O5TKOGKIHGPKUTZG3QJ423DJRDMSIFVDEDTUQ@tmp/withMaven818f4b38/maven-spy-20180402-111415-2422099929947584753495.log
[Pipeline] [linux-jdk7] }
[Pipeline] [linux-jdk7] // dir
[Pipeline] [linux-jdk7] }
[linux-jdk7] [withMaven] artifactsPublisher - Archive artifact m/pom.xml under org/apache/maven/plugins/maven-dependency-plugin/3.1.0-SNAPSHOT/maven-dependency-plugin-3.1.0-SNAPSHOT.pom
[linux-jdk7] [withMaven] artifactsPublisher - Archive artifact m/target/maven-dependency-plugin-3.1.0-SNAPSHOT.jar
under org/apache/maven/plugins/maven-dependency-plugin/3.1.0-SNAPSHOT/maven-dependency-plugin-3.1.0-SNAPSHOT.jar
[linux-jdk7] [withMaven] junitPublisher - Archive test results for Maven artifact org.apache.maven.plugins:maven-dependency-plugin:3.1.0-SNAPSHOT
generated by maven-surefire-plugin:test (default-test): m/target/surefire-reports/*.xml
[linux-jdk7] [withMaven] junitPublisher - Jenkins JUnit Attachments Plugin not found, can't
publish test attachments.Recording test results
[linux-jdk7] [withMaven] openTasksPublisher - Scan Tasks for Maven artifact org.apache.maven.plugins:maven-dependency-plugin:3.1.0-SNAPSHOT
in source directory m/src/main/java
[linux-jdk7] [TASKS] Scanning folder '/home/jenkins/jenkins-slave/workspace/-dependency-plugin_MDEP-584-BWYUMMJPNAGFBD3O5TKOGKIHGPKUTZG3QJ423DJRDMSIFVDEDTUQ'
for files matching the pattern 'm/src/main/java/**/*' - excludes: null
[linux-jdk7] [TASKS] Found 48 files to scan for tasks
[linux-jdk7] [TASKS] Found 4 open tasks.
[linux-jdk7] Skipping warnings blame since pipelines do not have an SCM link.%n
[linux-jdk7] [TASKS] Computing warning deltas based on reference build #2
[Pipeline] [linux-jdk7] // withMaven
[Pipeline] [linux-jdk7] }
[Pipeline] [linux-jdk7] // stage
[Pipeline] [linux-jdk7] }
[Pipeline] [linux-jdk7] // node
[Pipeline] [linux-jdk7] }
[Pipeline] // parallel
[Pipeline] stage
[Pipeline] { (Notifications)
[Pipeline] echo
Build result: UNSTABLE
[Pipeline] jiraIssueSelector
[Pipeline] jiraComment
[Pipeline] emailext
Mime
  • Unnamed multipart/mixed (inline, None, 0 bytes)
View raw message