maven-notifications mailing list archives

Site index · List index
Message view « Date » · « Thread »
Top « Date » · « Thread »
From Apache Jenkins Server <jenk...@builds.apache.org>
Subject Build failed in Jenkins: Maven TLP » maven-doxia » DOXIA-572 #3
Date Sat, 07 Apr 2018 17:36:35 GMT
See https://builds.apache.org/job/maven-box/job/maven-doxia/job/DOXIA-572/3/

Changes:

* [DOXIA-572] - Upgrade parent to 31  o Fixed issues based on the upgrade.
* [DOXIA-572] - Upgrade parent to 31  o Fixed issues based on the upgrade.
* [DOXIA-572] - Upgrade parent to 31  o Fixed issues based on the upgrade.
* [DOXIA-572] - Upgrade parent to 31  o Fixed issues based on the upgrade.
* [DOXIA-572] - Upgrade parent to 31  o Fixed issues based on the upgrade.

All tests passed

Build log:
[...truncated 831.03 KB...]
[windows-jdk9] [INFO] 
[windows-jdk9] [INFO] --- maven-remote-resources-plugin:1.5:process (process-resource-bundles)
@ doxia-module-apt ---
[Pipeline] [linux-jdk8] // withMaven
[Pipeline] [windows-jdk7] // withMaven
[Pipeline] [linux-jdk9] }
[linux-jdk9] Failed in branch linux-jdk9
[Pipeline] [linux-jdk7] echo
[linux-jdk7] [FAIL FAST] linux-jdk9 had first failure, ignoring script returned exit code
1
[Pipeline] [linux-jdk7] }
[Pipeline] [linux-jdk10] }
[Pipeline] [linux-jdk8] echo
[linux-jdk8] [FAIL FAST] linux-jdk9 had first failure, ignoring script returned exit code
1
[Pipeline] [linux-jdk8] }
[Pipeline] [windows-jdk7] echo
[windows-jdk7] [FAIL FAST] linux-jdk9 had first failure, ignoring script returned exit code
1
[Pipeline] [windows-jdk7] }
[Pipeline] [windows-jdk10] }
[windows-jdk8] Sending interrupt signal to process
[windows-jdk8] [INFO] Tests run: 19, Failures: 0, Errors: 0, Skipped: 0, Time elapsed: 0.795
s - in org.apache.maven.doxia.module.apt.AptParserTest
[windows-jdk8] [INFO] Running org.apache.maven.doxia.module.apt.AptSinkTest
[windows-jdk8] [INFO] Tests run: 32, Failures: 0, Errors: 0, Skipped: 0, Time elapsed: 0.001
s - in org.apache.maven.doxia.module.apt.AptSinkTest
[windows-jdk8] [INFO] Running org.apache.maven.doxia.module.apt.AptUtilsTest
[windows-jdk8] [INFO] Tests run: 6, Failures: 0, Errors: 0, Skipped: 0, Time elapsed: 0 s
- in org.apache.maven.doxia.module.apt.AptUtilsTest
[windows-jdk8] [INFO] 
[windows-jdk8] [INFO] Results:
[windows-jdk8] [INFO] 
[windows-jdk8] [INFO] Tests run: 58, Failures: 0, Errors: 0, Skipped: 0
[windows-jdk8] [INFO] 
[windows-jdk8] [ERROR] There are test failures.
[windows-jdk8] 
[windows-jdk8] Please refer to F:\jenkins\jenkins-slave\workspace\n-box_maven-doxia_DOXIA-572-5R4NBZTF6OOVPHGZS5FHJPBGRCYJ7S7J6B5UOTIUNEFPJ4N4ZRYQ\m\doxia-modules\doxia-module-apt\target\surefire-reports
for the individual test results.
[windows-jdk8] Please refer to dump files (if any exist) [date]-jvmRun[N].dump, [date].dumpstream
and [date]-jvmRun[N].dumpstream.
[windows-jdk8] Error occurred in starting fork, check output in log
[windows-jdk8] org.apache.maven.surefire.booter.SurefireBooterForkException: Error occurred
in starting fork, check output in log
[windows-jdk8] 	at org.apache.maven.plugin.surefire.booterclient.ForkStarter.fork(ForkStarter.java:624)
[windows-jdk8] 	at org.apache.maven.plugin.surefire.booterclient.ForkStarter.fork(ForkStarter.java:533)
[windows-jdk8] 	at org.apache.maven.plugin.surefire.booterclient.ForkStarter.run(ForkStarter.java:278)
[windows-jdk8] 	at org.apache.maven.plugin.surefire.booterclient.ForkStarter.run(ForkStarter.java:244)
[windows-jdk8] 	at org.apache.maven.plugin.surefire.AbstractSurefireMojo.executeProvider(AbstractSurefireMojo.java:1149)
[windows-jdk8] 	at org.apache.maven.plugin.surefire.AbstractSurefireMojo.executeAfterPreconditionsChecked(AbstractSurefireMojo.java:978)
[windows-jdk8] 	at org.apache.maven.plugin.surefire.AbstractSurefireMojo.execute(AbstractSurefireMojo.java:854)
[windows-jdk8] 	at org.apache.maven.plugin.DefaultBuildPluginManager.executeMojo(DefaultBuildPluginManager.java:134)
[windows-jdk8] 	at org.apache.maven.lifecycle.internal.MojoExecutor.execute(MojoExecutor.java:208)
[windows-jdk8] 	at org.apache.maven.lifecycle.internal.MojoExecutor.execute(MojoExecutor.java:154)
[windows-jdk8] 	at org.apache.maven.lifecycle.internal.MojoExecutor.execute(MojoExecutor.java:146)
[windows-jdk8] 	at org.apache.maven.lifecycle.internal.LifecycleModuleBuilder.buildProject(LifecycleModuleBuilder.java:117)
[windows-jdk8] 	at org.apache.maven.lifecycle.internal.LifecycleModuleBuilder.buildProject(LifecycleModuleBuilder.java:81)
[windows-jdk8] 	at org.apache.maven.lifecycle.internal.builder.singlethreaded.SingleThreadedBuilder.build(SingleThreadedBuilder.java:51)
[windows-jdk8] 	at org.apache.maven.lifecycle.internal.LifecycleStarter.execute(LifecycleStarter.java:128)
[windows-jdk8] 	at org.apache.maven.DefaultMaven.doExecute(DefaultMaven.java:309)
[windows-jdk8] 	at org.apache.maven.DefaultMaven.doExecute(DefaultMaven.java:194)
[windows-jdk8] 	at org.apache.maven.DefaultMaven.execute(DefaultMaven.java:107)
[windows-jdk8] 	at org.apache.maven.cli.MavenCli.execute(MavenCli.java:993)
[windows-jdk8] 	at org.apache.maven.cli.MavenCli.doMain(MavenCli.java:345)
[windows-jdk8] 	at org.apache.maven.cli.MavenCli.main(MavenCli.java:191)
[windows-jdk8] 	at sun.reflect.NativeMethodAccessorImpl.invoke0(Native Method)
[windows-jdk8] 	at sun.reflect.NativeMethodAccessorImpl.invoke(NativeMethodAccessorImpl.java:62)
[windows-jdk8] 	at sun.reflect.DelegatingMethodAccessorImpl.invoke(DelegatingMethodAccessorImpl.java:43)
[windows-jdk8] 	at java.lang.reflect.Method.invoke(Method.java:498)
[windows-jdk8] 	at org.codehaus.plexus.classworlds.launcher.Launcher.launchEnhanced(Launcher.java:289)
[windows-jdk8] 	at org.codehaus.plexus.classworlds.launcher.Launcher.launch(Launcher.java:229)
[windows-jdk8] 	at org.codehaus.plexus.classworlds.launcher.Launcher.mainWithExitCode(Launcher.java:415)
[windows-jdk8] 	at org.codehaus.plexus.classworlds.launcher.Launcher.main(Launcher.java:356)
[windows-jdk8] 
[windows-jdk8] [INFO] 
[windows-jdk8] [INFO] --- maven-jar-plugin:3.0.2:jar (default-jar) @ doxia-module-apt ---
[windows-jdk9] [INFO] 
[windows-jdk9] [INFO] --- maven-resources-plugin:3.0.2:resources (default-resources) @ doxia-module-apt
---
[windows-jdk9] [INFO] Using 'UTF-8' encoding to copy filtered resources.
[windows-jdk9] [INFO] skip non existing resourceDirectory F:\jenkins\jenkins-slave\workspace\n-box_maven-doxia_DOXIA-572-5R4NBZTF6OOVPHGZS5FHJPBGRCYJ7S7J6B5UOTIUNEFPJ4N4ZRYQ@2\m\doxia-modules\doxia-module-apt\src\main\resources
[windows-jdk9] [INFO] skip non existing resourceDirectory F:\jenkins\jenkins-slave\workspace\n-box_maven-doxia_DOXIA-572-5R4NBZTF6OOVPHGZS5FHJPBGRCYJ7S7J6B5UOTIUNEFPJ4N4ZRYQ@2\m\doxia-modules\doxia-module-apt\target\generated-site\xsd
[windows-jdk9] [INFO] Copying 3 resources
[windows-jdk9] [INFO] 
[windows-jdk9] [INFO] --- maven-compiler-plugin:3.7.0:compile (default-compile) @ doxia-module-apt
---
[windows-jdk9] [INFO] Changes detected - recompiling the module!
[windows-jdk9] [INFO] Compiling 9 source files to F:\jenkins\jenkins-slave\workspace\n-box_maven-doxia_DOXIA-572-5R4NBZTF6OOVPHGZS5FHJPBGRCYJ7S7J6B5UOTIUNEFPJ4N4ZRYQ@2\m\doxia-modules\doxia-module-apt\target\classes
[windows-jdk9] [INFO] /F:/jenkins/jenkins-slave/workspace/n-box_maven-doxia_DOXIA-572-5R4NBZTF6OOVPHGZS5FHJPBGRCYJ7S7J6B5UOTIUNEFPJ4N4ZRYQ@2/m/doxia-modules/doxia-module-apt/src/main/java/org/apache/maven/doxia/module/apt/AptParser.java:
F:\jenkins\jenkins-slave\workspace\n-box_maven-doxia_DOXIA-572-5R4NBZTF6OOVPHGZS5FHJPBGRCYJ7S7J6B5UOTIUNEFPJ4N4ZRYQ@2\m\doxia-modules\doxia-module-apt\src\main\java\org\apache\maven\doxia\module\apt\AptParser.java
uses or overrides a deprecated API.
[windows-jdk9] [INFO] /F:/jenkins/jenkins-slave/workspace/n-box_maven-doxia_DOXIA-572-5R4NBZTF6OOVPHGZS5FHJPBGRCYJ7S7J6B5UOTIUNEFPJ4N4ZRYQ@2/m/doxia-modules/doxia-module-apt/src/main/java/org/apache/maven/doxia/module/apt/AptParser.java:
Recompile with -Xlint:deprecation for details.
[windows-jdk9] [INFO] 
[windows-jdk9] [INFO] --- plexus-component-metadata:1.7.1:generate-metadata (default) @ doxia-module-apt
---
[windows-jdk9] Sending interrupt signal to process
[windows-jdk9] [INFO] Discovered 3 component descriptors(s)
[windows-jdk9] [INFO] 
[windows-jdk9] [INFO] --- maven-resources-plugin:3.0.2:testResources (default-testResources)
@ doxia-module-apt ---
[windows-jdk9] [INFO] Using 'UTF-8' encoding to copy filtered resources.
[windows-jdk9] [INFO] Copying 7 resources
[windows-jdk9] [INFO] Copying 3 resources
[windows-jdk9] [INFO] 
[windows-jdk9] [INFO] --- maven-compiler-plugin:3.7.0:testCompile (default-testCompile) @
doxia-module-apt ---
[windows-jdk9] [INFO] Changes detected - recompiling the module!
[windows-jdk9] [INFO] Compiling 4 source files to F:\jenkins\jenkins-slave\workspace\n-box_maven-doxia_DOXIA-572-5R4NBZTF6OOVPHGZS5FHJPBGRCYJ7S7J6B5UOTIUNEFPJ4N4ZRYQ@2\m\doxia-modules\doxia-module-apt\target\test-classes
[windows-jdk9] [INFO] /F:/jenkins/jenkins-slave/workspace/n-box_maven-doxia_DOXIA-572-5R4NBZTF6OOVPHGZS5FHJPBGRCYJ7S7J6B5UOTIUNEFPJ4N4ZRYQ@2/m/doxia-modules/doxia-module-apt/src/test/java/org/apache/maven/doxia/module/apt/AptUtilsTest.java:
F:\jenkins\jenkins-slave\workspace\n-box_maven-doxia_DOXIA-572-5R4NBZTF6OOVPHGZS5FHJPBGRCYJ7S7J6B5UOTIUNEFPJ4N4ZRYQ@2\m\doxia-modules\doxia-module-apt\src\test\java\org\apache\maven\doxia\module\apt\AptUtilsTest.java
uses or overrides a deprecated API.
[windows-jdk9] [INFO] /F:/jenkins/jenkins-slave/workspace/n-box_maven-doxia_DOXIA-572-5R4NBZTF6OOVPHGZS5FHJPBGRCYJ7S7J6B5UOTIUNEFPJ4N4ZRYQ@2/m/doxia-modules/doxia-module-apt/src/test/java/org/apache/maven/doxia/module/apt/AptUtilsTest.java:
Recompile with -Xlint:deprecation for details.
[windows-jdk9] [INFO] 
[windows-jdk9] [INFO] --- maven-surefire-plugin:2.21.0:test (default-test) @ doxia-module-apt
---
[windows-jdk9] [INFO] 
[windows-jdk9] [INFO] -------------------------------------------------------
[windows-jdk9] [INFO]  T E S T S
[windows-jdk9] [INFO] -------------------------------------------------------
[windows-jdk9] [INFO] 
[windows-jdk9] [INFO] Results:
[windows-jdk9] [INFO] 
[windows-jdk9] [INFO] Tests run: 0, Failures: 0, Errors: 0, Skipped: 0
[windows-jdk9] [INFO] 
[windows-jdk9] [ERROR] There are test failures.
[windows-jdk9] 
[windows-jdk9] Please refer to F:\jenkins\jenkins-slave\workspace\n-box_maven-doxia_DOXIA-572-5R4NBZTF6OOVPHGZS5FHJPBGRCYJ7S7J6B5UOTIUNEFPJ4N4ZRYQ@2\m\doxia-modules\doxia-module-apt\target\surefire-reports
for the individual test results.
[windows-jdk9] Please refer to dump files (if any exist) [date]-jvmRun[N].dump, [date].dumpstream
and [date]-jvmRun[N].dumpstream.
[windows-jdk9] The forked VM terminated without properly saying goodbye. VM crash or System.exit
called?
[windows-jdk9] Command was cmd.exe /X /C "f:\jenkins\tools\java\latest9\bin\java -jar C:\Users\jenkins\AppData\Local\Temp\1\surefire10725858988230070929\surefirebooter3873934688940210557.jar
C:\Users\jenkins\AppData\Local\Temp\1\surefire10725858988230070929 2018-04-07T17-35-45_177-jvmRun1
surefire2730988544257139852tmp surefire_1873455812734955666tmp"
[windows-jdk9] Error occurred in starting fork, check output in log
[windows-jdk9] Process Exit Code: -1
[windows-jdk9] org.apache.maven.surefire.booter.SurefireBooterForkException: The forked VM
terminated without properly saying goodbye. VM crash or System.exit called?
[windows-jdk9] Command was cmd.exe /X /C "f:\jenkins\tools\java\latest9\bin\java -jar C:\Users\jenkins\AppData\Local\Temp\1\surefire10725858988230070929\surefirebooter3873934688940210557.jar
C:\Users\jenkins\AppData\Local\Temp\1\surefire10725858988230070929 2018-04-07T17-35-45_177-jvmRun1
surefire2730988544257139852tmp surefire_1873455812734955666tmp"
[windows-jdk9] Error occurred in starting fork, check output in log
[windows-jdk9] Process Exit Code: -1
[windows-jdk9] 	at org.apache.maven.plugin.surefire.booterclient.ForkStarter.fork(ForkStarter.java:671)
[windows-jdk9] 	at org.apache.maven.plugin.surefire.booterclient.ForkStarter.fork(ForkStarter.java:533)
[windows-jdk9] 	at org.apache.maven.plugin.surefire.booterclient.ForkStarter.run(ForkStarter.java:278)
[windows-jdk9] 	at org.apache.maven.plugin.surefire.booterclient.ForkStarter.run(ForkStarter.java:244)
[windows-jdk9] 	at org.apache.maven.plugin.surefire.AbstractSurefireMojo.executeProvider(AbstractSurefireMojo.java:1149)
[windows-jdk9] 	at org.apache.maven.plugin.surefire.AbstractSurefireMojo.executeAfterPreconditionsChecked(AbstractSurefireMojo.java:978)
[windows-jdk9] 	at org.apache.maven.plugin.surefire.AbstractSurefireMojo.execute(AbstractSurefireMojo.java:854)
[windows-jdk9] 	at org.apache.maven.plugin.DefaultBuildPluginManager.executeMojo(DefaultBuildPluginManager.java:134)
[windows-jdk9] 	at org.apache.maven.lifecycle.internal.MojoExecutor.execute(MojoExecutor.java:208)
[windows-jdk9] 	at org.apache.maven.lifecycle.internal.MojoExecutor.execute(MojoExecutor.java:154)
[windows-jdk9] 	at org.apache.maven.lifecycle.internal.MojoExecutor.execute(MojoExecutor.java:146)
[windows-jdk9] 	at org.apache.maven.lifecycle.internal.LifecycleModuleBuilder.buildProject(LifecycleModuleBuilder.java:117)
[windows-jdk9] 	at org.apache.maven.lifecycle.internal.LifecycleModuleBuilder.buildProject(LifecycleModuleBuilder.java:81)
[windows-jdk9] 	at org.apache.maven.lifecycle.internal.builder.singlethreaded.SingleThreadedBuilder.build(SingleThreadedBuilder.java:51)
[windows-jdk9] 	at org.apache.maven.lifecycle.internal.LifecycleStarter.execute(LifecycleStarter.java:128)
[windows-jdk9] 	at org.apache.maven.DefaultMaven.doExecute(DefaultMaven.java:309)
[windows-jdk9] 	at org.apache.maven.DefaultMaven.doExecute(DefaultMaven.java:194)
[windows-jdk9] 	at org.apache.maven.DefaultMaven.execute(DefaultMaven.java:107)
[windows-jdk9] 	at org.apache.maven.cli.MavenCli.execute(MavenCli.java:993)
[windows-jdk9] 	at org.apache.maven.cli.MavenCli.doMain(MavenCli.java:345)
[windows-jdk9] 	at org.apache.maven.cli.MavenCli.main(MavenCli.java:191)
[windows-jdk9] 	at java.base/jdk.internal.reflect.NativeMethodAccessorImpl.invoke0(Native
Method)
[windows-jdk9] 	at java.base/jdk.internal.reflect.NativeMethodAccessorImpl.invoke(NativeMethodAccessorImpl.java:62)
[windows-jdk9] 	at java.base/jdk.internal.reflect.DelegatingMethodAccessorImpl.invoke(DelegatingMethodAccessorImpl.java:43)
[windows-jdk9] 	at java.base/java.lang.reflect.Method.invoke(Method.java:564)
[windows-jdk9] 	at org.codehaus.plexus.classworlds.launcher.Launcher.launchEnhanced(Launcher.java:289)
[windows-jdk9] 	at org.codehaus.plexus.classworlds.launcher.Launcher.launch(Launcher.java:229)
[windows-jdk9] 	at org.codehaus.plexus.classworlds.launcher.Launcher.mainWithExitCode(Launcher.java:415)
[windows-jdk9] 	at org.codehaus.plexus.classworlds.launcher.Launcher.main(Launcher.java:356)
[windows-jdk9] 
[windows-jdk9] [INFO] 
[windows-jdk9] [INFO] --- maven-jar-plugin:3.0.2:jar (default-jar) @ doxia-module-apt ---
[windows-jdk9] [INFO] Building jar: F:\jenkins\jenkins-slave\workspace\n-box_maven-doxia_DOXIA-572-5R4NBZTF6OOVPHGZS5FHJPBGRCYJ7S7J6B5UOTIUNEFPJ4N4ZRYQ@2\m\doxia-modules\doxia-module-apt\target\doxia-module-apt-1.9-SNAPSHOT.jar
[windows-jdk9] [INFO] 
[windows-jdk9] [INFO] --- maven-site-plugin:3.7:attach-descriptor (attach-descriptor) @ doxia-module-apt
---
[windows-jdk9] [INFO] Skipping because packaging 'jar' is not pom.
[windows-jdk9] [INFO] 
[windows-jdk9] [INFO] --- maven-checkstyle-plugin:3.0.0:check (checkstyle-check) @ doxia-module-apt
---
[Pipeline] [linux-jdk7] // stage
[Pipeline] [linux-jdk10] // dir
[Pipeline] [linux-jdk8] // stage
[Pipeline] [windows-jdk7] // stage
[Pipeline] [windows-jdk10] // dir
[Pipeline] [linux-jdk7] }
[Pipeline] [linux-jdk8] }
[Pipeline] [windows-jdk7] }
[Pipeline] [linux-jdk10] }
[linux-jdk10] [withMaven] junitPublisher - Archive test results for Maven artifact org.apache.maven.doxia:doxia-logging-api:1.9-SNAPSHOT
generated by maven-surefire-plugin:test (default-test): m/doxia-logging-api/target/surefire-reports/*.xml
[linux-jdk10] [withMaven] junitPublisher - Jenkins JUnit Attachments Plugin not found, can't
publish test attachments.Recording test results
[linux-jdk10] None of the test reports contained any result
[linux-jdk10] [withMaven] junitPublisher - Archive test results for Maven artifact org.apache.maven.doxia:doxia-sink-api:1.9-SNAPSHOT
generated by maven-surefire-plugin:test (default-test): m/doxia-sink-api/target/surefire-reports/*.xml
[linux-jdk10] [withMaven] junitPublisher - Jenkins JUnit Attachments Plugin not found, can't
publish test attachments.Recording test results
[linux-jdk10] None of the test reports contained any result
[linux-jdk10] [withMaven] junitPublisher - Archive test results for Maven artifact org.apache.maven.doxia:doxia-test-docs:1.9-SNAPSHOT
generated by maven-surefire-plugin:test (default-test): m/doxia-test-docs/target/surefire-reports/*.xml
[linux-jdk10] [withMaven] junitPublisher - Jenkins JUnit Attachments Plugin not found, can't
publish test attachments.Recording test results
[linux-jdk10] None of the test reports contained any result
[linux-jdk10] [withMaven] junitPublisher - Archive test results for Maven artifact org.apache.maven.doxia:doxia-core:1.9-SNAPSHOT
generated by maven-surefire-plugin:test (default-test): m/doxia-core/target/surefire-reports/*.xml
[linux-jdk10] [withMaven] junitPublisher - Jenkins JUnit Attachments Plugin not found, can't
publish test attachments.Recording test results
[linux-jdk10] [withMaven] junitPublisher - Archive test results for Maven artifact org.apache.maven.doxia:doxia-module-apt:1.9-SNAPSHOT
generated by maven-surefire-plugin:test (default-test): m/doxia-modules/doxia-module-apt/target/surefire-reports/*.xml
[linux-jdk10] [withMaven] junitPublisher - Jenkins JUnit Attachments Plugin not found, can't
publish test attachments.Recording test results
[Pipeline] [windows-jdk8] }
[Pipeline] [windows-jdk10] }
[windows-jdk10] [withMaven] junitPublisher - Archive test results for Maven artifact org.apache.maven.doxia:doxia-logging-api:1.9-SNAPSHOT
generated by maven-surefire-plugin:test (default-test): m\doxia-logging-api\target\surefire-reports\*.xml
[windows-jdk10] [withMaven] junitPublisher - Jenkins JUnit Attachments Plugin not found, can't
publish test attachments.Recording test results
[windows-jdk10] None of the test reports contained any result
[windows-jdk10] [withMaven] junitPublisher - Archive test results for Maven artifact org.apache.maven.doxia:doxia-sink-api:1.9-SNAPSHOT
generated by maven-surefire-plugin:test (default-test): m\doxia-sink-api\target\surefire-reports\*.xml
[windows-jdk10] [withMaven] junitPublisher - Jenkins JUnit Attachments Plugin not found, can't
publish test attachments.Recording test results
[windows-jdk10] None of the test reports contained any result
[windows-jdk10] [withMaven] junitPublisher - Archive test results for Maven artifact org.apache.maven.doxia:doxia-test-docs:1.9-SNAPSHOT
generated by maven-surefire-plugin:test (default-test): m\doxia-test-docs\target\surefire-reports\*.xml
[windows-jdk10] [withMaven] junitPublisher - Jenkins JUnit Attachments Plugin not found, can't
publish test attachments.Recording test results
[windows-jdk10] None of the test reports contained any result
[windows-jdk10] [withMaven] junitPublisher - Archive test results for Maven artifact org.apache.maven.doxia:doxia-core:1.9-SNAPSHOT
generated by maven-surefire-plugin:test (default-test): m\doxia-core\target\surefire-reports\*.xml
[windows-jdk10] [withMaven] junitPublisher - Jenkins JUnit Attachments Plugin not found, can't
publish test attachments.Recording test results
[windows-jdk10] [withMaven] junitPublisher - Archive test results for Maven artifact org.apache.maven.doxia:doxia-module-apt:1.9-SNAPSHOT
generated by maven-surefire-plugin:test (default-test): m\doxia-modules\doxia-module-apt\target\surefire-reports\*.xml
[windows-jdk10] [withMaven] junitPublisher - Jenkins JUnit Attachments Plugin not found, can't
publish test attachments.Recording test results
[Pipeline] [linux-jdk7] // node
[Pipeline] [linux-jdk8] // node
[Pipeline] [windows-jdk7] // node
[Pipeline] [linux-jdk10] // withMaven
[Pipeline] [windows-jdk8] // dir
[Pipeline] [windows-jdk10] // withMaven
[Pipeline] [linux-jdk7] }
[Pipeline] [linux-jdk8] }
[Pipeline] [windows-jdk7] }
[Pipeline] [linux-jdk10] echo
[linux-jdk10] [FAIL FAST] linux-jdk9 had first failure, ignoring script returned exit code
1
[Pipeline] [linux-jdk10] }
[Pipeline] [windows-jdk8] }
[windows-jdk8] [withMaven] One or multiple Maven executions have been ignored by the Jenkins
Pipeline Maven Plugin because they have been interrupted before completion (1). See Pipeline
Maven Plugin FAQ for more details.
[Pipeline] [windows-jdk9] }
[Pipeline] [windows-jdk10] echo
[windows-jdk10] [FAIL FAST] linux-jdk9 had first failure, ignoring script returned exit code
1
[Pipeline] [windows-jdk10] }
[Pipeline] [linux-jdk10] // stage
[Pipeline] [windows-jdk8] // withMaven
[Pipeline] [windows-jdk9] // dir
[Pipeline] [windows-jdk10] // stage
[Pipeline] [linux-jdk10] }
[Pipeline] [windows-jdk8] echo
[windows-jdk8] [FAIL FAST] linux-jdk9 had first failure, ignoring script returned exit code
-1
[Pipeline] [windows-jdk8] }
[Pipeline] [windows-jdk10] }
[Pipeline] [windows-jdk9] }
[windows-jdk9] [withMaven] One or multiple Maven executions have been ignored by the Jenkins
Pipeline Maven Plugin because they have been interrupted before completion (1). See Pipeline
Maven Plugin FAQ for more details.
[Pipeline] [linux-jdk10] // node
[Pipeline] [windows-jdk8] // stage
[Pipeline] [windows-jdk10] // node
[Pipeline] [windows-jdk9] // withMaven
[Pipeline] [linux-jdk10] }
[Pipeline] [windows-jdk10] }
[Pipeline] [windows-jdk8] }
[Pipeline] [windows-jdk9] echo
[windows-jdk9] [FAIL FAST] linux-jdk9 had first failure, ignoring script returned exit code
-1
[Pipeline] [windows-jdk9] }
[Pipeline] [windows-jdk8] // node
[Pipeline] [windows-jdk9] // stage
[Pipeline] [windows-jdk8] }
[Pipeline] [windows-jdk9] }
[Pipeline] [windows-jdk9] // node
[Pipeline] [windows-jdk9] }
[Pipeline] // parallel
[Pipeline] echo
***** FAST FAILURE *****

Fast failure triggered by linux-jdk9

***** FAST FAILURE *****
[Pipeline] stage
[Pipeline] { (Notifications)
[Pipeline] echo
Build result: FAILURE
[Pipeline] jiraIssueSelector
[Pipeline] emailext
Mime
  • Unnamed multipart/mixed (inline, None, 0 bytes)
View raw message