maven-notifications mailing list archives

Site index · List index
Message view « Date » · « Thread »
Top « Date » · « Thread »
From Apache Jenkins Server <jenk...@builds.apache.org>
Subject Build unstable in Jenkins: Maven TLP » maven-dependency-plugin » MDEP-585 #5
Date Mon, 02 Apr 2018 12:15:19 GMT
See https://builds.apache.org/job/maven-box/job/maven-dependency-plugin/job/MDEP-585/5/

Changes:

* [MDEP-584] - Upgrade plexus-utils to version 3.1.0  o Code patch applied
* [MDEP-585] - Upgrade plexus-archiver to 3.5.  - Required upgrade of JDK
* [MDEP-584] - Upgrade plexus-utils to version 3.1.0  o Code patch applied
* [MDEP-585] - Upgrade plexus-archiver to 3.5.  - Required upgrade of JDK
* [MDEP-584] - Upgrade plexus-utils to version 3.1.0  o Code patch applied
* [MDEP-585] - Upgrade plexus-archiver to 3.5.  - Required upgrade of JDK
* [MDEP-584] - Upgrade plexus-utils to version 3.1.0  o Code patch applied
* [MDEP-585] - Upgrade plexus-archiver to 3.5.  - Required upgrade of JDK
* [MDEP-584] - Upgrade plexus-utils to version 3.1.0  o Code patch applied
* [MDEP-585] - Upgrade plexus-archiver to 3.5.  - Required upgrade of JDK
* [MDEP-584] - Upgrade plexus-utils to version 3.1.0  o Code patch applied
* [MDEP-585] - Upgrade plexus-archiver to 3.5.  - Required upgrade of JDK
* [MDEP-584] - Upgrade plexus-utils to version 3.1.0  o Code patch applied
* [MDEP-585] - Upgrade plexus-archiver to 3.5.  - Required upgrade of JDK

168 tests failed.
FAILED:  org.apache.maven.plugins.dependency.fromConfiguration.TestUnpackMojo.testUnpackToLocation

Error Message:
org/codehaus/plexus/components/io/attributes/AttributeUtils

Stack Trace:
java.lang.NoClassDefFoundError: org/codehaus/plexus/components/io/attributes/AttributeUtils
	at org.apache.maven.plugins.dependency.fromConfiguration.TestUnpackMojo.testUnpackToLocation(TestUnpackMojo.java:171)
Caused by: java.lang.ClassNotFoundException: org.codehaus.plexus.components.io.attributes.AttributeUtils
	at org.apache.maven.plugins.dependency.fromConfiguration.TestUnpackMojo.testUnpackToLocation(TestUnpackMojo.java:171)


FAILED:  org.apache.maven.plugins.dependency.fromConfiguration.TestUnpackMojo.testUnpackToLocationWhereLocationCannotBeCreatedThrowsException

Error Message:
org/codehaus/plexus/components/io/attributes/AttributeUtils

Stack Trace:
java.lang.NoClassDefFoundError: org/codehaus/plexus/components/io/attributes/AttributeUtils
	at org.apache.maven.plugins.dependency.fromConfiguration.TestUnpackMojo.testUnpackToLocationWhereLocationCannotBeCreatedThrowsException(TestUnpackMojo.java:203)


FAILED:  org.apache.maven.plugins.dependency.fromConfiguration.TestUnpackMojo.testMissingVersionFromDependenciesWithClassifier

Error Message:
org/codehaus/plexus/components/io/attributes/AttributeUtils

Stack Trace:
java.lang.NoClassDefFoundError: org/codehaus/plexus/components/io/attributes/AttributeUtils
	at org.apache.maven.plugins.dependency.fromConfiguration.TestUnpackMojo.testMissingVersionFromDependenciesWithClassifier(TestUnpackMojo.java:299)


FAILED:  org.apache.maven.plugins.dependency.fromConfiguration.TestUnpackMojo.testUnpackDontOverWriteSnapshots

Error Message:
org/codehaus/plexus/components/io/attributes/AttributeUtils

Stack Trace:
java.lang.NoClassDefFoundError: org/codehaus/plexus/components/io/attributes/AttributeUtils
	at org.apache.maven.plugins.dependency.fromConfiguration.TestUnpackMojo.testUnpackDontOverWriteSnapshots(TestUnpackMojo.java:484)


FAILED:  org.apache.maven.plugins.dependency.fromConfiguration.TestUnpackMojo.testUnpackOverWriteReleases

Error Message:
org/codehaus/plexus/components/io/attributes/AttributeUtils

Stack Trace:
java.lang.NoClassDefFoundError: org/codehaus/plexus/components/io/attributes/AttributeUtils
	at org.apache.maven.plugins.dependency.fromConfiguration.TestUnpackMojo.testUnpackOverWriteReleases(TestUnpackMojo.java:504)


FAILED:  org.apache.maven.plugins.dependency.fromConfiguration.TestUnpackMojo.testUnpackDontOverWriteReleases

Error Message:
org/codehaus/plexus/components/io/attributes/AttributeUtils

Stack Trace:
java.lang.NoClassDefFoundError: org/codehaus/plexus/components/io/attributes/AttributeUtils
	at org.apache.maven.plugins.dependency.fromConfiguration.TestUnpackMojo.testUnpackDontOverWriteReleases(TestUnpackMojo.java:464)


FAILED:  org.apache.maven.plugins.dependency.fromConfiguration.TestUnpackMojo.testMissingVersionFromDependencies

Error Message:
org/codehaus/plexus/components/io/attributes/AttributeUtils

Stack Trace:
java.lang.NoClassDefFoundError: org/codehaus/plexus/components/io/attributes/AttributeUtils
	at org.apache.maven.plugins.dependency.fromConfiguration.TestUnpackMojo.testMissingVersionFromDependencies(TestUnpackMojo.java:277)


FAILED:  org.apache.maven.plugins.dependency.fromConfiguration.TestUnpackMojo.testUnpackOverWriteIfNewer

Error Message:
org/codehaus/plexus/components/io/attributes/AttributeUtils

Stack Trace:
java.lang.NoClassDefFoundError: org/codehaus/plexus/components/io/attributes/AttributeUtils
	at org.apache.maven.plugins.dependency.fromConfiguration.TestUnpackMojo.testUnpackOverWriteIfNewer(TestUnpackMojo.java:545)


FAILED:  org.apache.maven.plugins.dependency.fromConfiguration.TestUnpackMojo.testMissingVersionFromDependencyMgt

Error Message:
org/codehaus/plexus/components/io/attributes/AttributeUtils

Stack Trace:
java.lang.NoClassDefFoundError: org/codehaus/plexus/components/io/attributes/AttributeUtils
	at org.apache.maven.plugins.dependency.fromConfiguration.TestUnpackMojo.testMissingVersionFromDependencyMgt(TestUnpackMojo.java:354)


FAILED:  org.apache.maven.plugins.dependency.fromConfiguration.TestUnpackMojo.testUnpackFile

Error Message:
org/codehaus/plexus/components/io/attributes/AttributeUtils

Stack Trace:
java.lang.NoClassDefFoundError: org/codehaus/plexus/components/io/attributes/AttributeUtils
	at org.apache.maven.plugins.dependency.fromConfiguration.TestUnpackMojo.testUnpackFile(TestUnpackMojo.java:144)


FAILED:  org.apache.maven.plugins.dependency.fromConfiguration.TestUnpackMojo.testUnpackOverWriteSnapshot

Error Message:
org/codehaus/plexus/components/io/attributes/AttributeUtils

Stack Trace:
java.lang.NoClassDefFoundError: org/codehaus/plexus/components/io/attributes/AttributeUtils
	at org.apache.maven.plugins.dependency.fromConfiguration.TestUnpackMojo.testUnpackOverWriteSnapshot(TestUnpackMojo.java:525)


FAILED:  org.apache.maven.plugins.dependency.fromConfiguration.TestUnpackMojo.testMissingVersionFromDependencyMgtWithClassifier

Error Message:
org/codehaus/plexus/components/io/attributes/AttributeUtils

Stack Trace:
java.lang.NoClassDefFoundError: org/codehaus/plexus/components/io/attributes/AttributeUtils
	at org.apache.maven.plugins.dependency.fromConfiguration.TestUnpackMojo.testMissingVersionFromDependencyMgtWithClassifier(TestUnpackMojo.java:391)


FAILED:  org.apache.maven.plugins.dependency.fromConfiguration.TestUnpackMojo.testUnpackToLocation

Error Message:
org/codehaus/plexus/components/io/attributes/AttributeUtils

Stack Trace:
java.lang.NoClassDefFoundError: org/codehaus/plexus/components/io/attributes/AttributeUtils
	at org.apache.maven.plugins.dependency.fromConfiguration.TestUnpackMojo.testUnpackToLocation(TestUnpackMojo.java:171)
Caused by: java.lang.ClassNotFoundException: org.codehaus.plexus.components.io.attributes.AttributeUtils
	at org.apache.maven.plugins.dependency.fromConfiguration.TestUnpackMojo.testUnpackToLocation(TestUnpackMojo.java:171)


FAILED:  org.apache.maven.plugins.dependency.fromConfiguration.TestUnpackMojo.testUnpackToLocationWhereLocationCannotBeCreatedThrowsException

Error Message:
org/codehaus/plexus/components/io/attributes/AttributeUtils

Stack Trace:
java.lang.NoClassDefFoundError: org/codehaus/plexus/components/io/attributes/AttributeUtils
	at org.apache.maven.plugins.dependency.fromConfiguration.TestUnpackMojo.testUnpackToLocationWhereLocationCannotBeCreatedThrowsException(TestUnpackMojo.java:203)


FAILED:  org.apache.maven.plugins.dependency.fromConfiguration.TestUnpackMojo.testMissingVersionFromDependenciesWithClassifier

Error Message:
org/codehaus/plexus/components/io/attributes/AttributeUtils

Stack Trace:
java.lang.NoClassDefFoundError: org/codehaus/plexus/components/io/attributes/AttributeUtils
	at org.apache.maven.plugins.dependency.fromConfiguration.TestUnpackMojo.testMissingVersionFromDependenciesWithClassifier(TestUnpackMojo.java:299)


FAILED:  org.apache.maven.plugins.dependency.fromConfiguration.TestUnpackMojo.testUnpackDontOverWriteSnapshots

Error Message:
org/codehaus/plexus/components/io/attributes/AttributeUtils

Stack Trace:
java.lang.NoClassDefFoundError: org/codehaus/plexus/components/io/attributes/AttributeUtils
	at org.apache.maven.plugins.dependency.fromConfiguration.TestUnpackMojo.testUnpackDontOverWriteSnapshots(TestUnpackMojo.java:484)


FAILED:  org.apache.maven.plugins.dependency.fromConfiguration.TestUnpackMojo.testUnpackOverWriteReleases

Error Message:
org/codehaus/plexus/components/io/attributes/AttributeUtils

Stack Trace:
java.lang.NoClassDefFoundError: org/codehaus/plexus/components/io/attributes/AttributeUtils
	at org.apache.maven.plugins.dependency.fromConfiguration.TestUnpackMojo.testUnpackOverWriteReleases(TestUnpackMojo.java:504)


FAILED:  org.apache.maven.plugins.dependency.fromConfiguration.TestUnpackMojo.testUnpackDontOverWriteReleases

Error Message:
org/codehaus/plexus/components/io/attributes/AttributeUtils

Stack Trace:
java.lang.NoClassDefFoundError: org/codehaus/plexus/components/io/attributes/AttributeUtils
	at org.apache.maven.plugins.dependency.fromConfiguration.TestUnpackMojo.testUnpackDontOverWriteReleases(TestUnpackMojo.java:464)


FAILED:  org.apache.maven.plugins.dependency.fromConfiguration.TestUnpackMojo.testMissingVersionFromDependencies

Error Message:
org/codehaus/plexus/components/io/attributes/AttributeUtils

Stack Trace:
java.lang.NoClassDefFoundError: org/codehaus/plexus/components/io/attributes/AttributeUtils
	at org.apache.maven.plugins.dependency.fromConfiguration.TestUnpackMojo.testMissingVersionFromDependencies(TestUnpackMojo.java:277)


FAILED:  org.apache.maven.plugins.dependency.fromConfiguration.TestUnpackMojo.testUnpackOverWriteIfNewer

Error Message:
org/codehaus/plexus/components/io/attributes/AttributeUtils

Stack Trace:
java.lang.NoClassDefFoundError: org/codehaus/plexus/components/io/attributes/AttributeUtils
	at org.apache.maven.plugins.dependency.fromConfiguration.TestUnpackMojo.testUnpackOverWriteIfNewer(TestUnpackMojo.java:545)


FAILED:  org.apache.maven.plugins.dependency.fromConfiguration.TestUnpackMojo.testMissingVersionFromDependencyMgt

Error Message:
org/codehaus/plexus/components/io/attributes/AttributeUtils

Stack Trace:
java.lang.NoClassDefFoundError: org/codehaus/plexus/components/io/attributes/AttributeUtils
	at org.apache.maven.plugins.dependency.fromConfiguration.TestUnpackMojo.testMissingVersionFromDependencyMgt(TestUnpackMojo.java:354)


FAILED:  org.apache.maven.plugins.dependency.fromConfiguration.TestUnpackMojo.testUnpackFile

Error Message:
org/codehaus/plexus/components/io/attributes/AttributeUtils

Stack Trace:
java.lang.NoClassDefFoundError: org/codehaus/plexus/components/io/attributes/AttributeUtils
	at org.apache.maven.plugins.dependency.fromConfiguration.TestUnpackMojo.testUnpackFile(TestUnpackMojo.java:144)


FAILED:  org.apache.maven.plugins.dependency.fromConfiguration.TestUnpackMojo.testUnpackOverWriteSnapshot

Error Message:
org/codehaus/plexus/components/io/attributes/AttributeUtils

Stack Trace:
java.lang.NoClassDefFoundError: org/codehaus/plexus/components/io/attributes/AttributeUtils
	at org.apache.maven.plugins.dependency.fromConfiguration.TestUnpackMojo.testUnpackOverWriteSnapshot(TestUnpackMojo.java:525)


FAILED:  org.apache.maven.plugins.dependency.fromConfiguration.TestUnpackMojo.testMissingVersionFromDependencyMgtWithClassifier

Error Message:
org/codehaus/plexus/components/io/attributes/AttributeUtils

Stack Trace:
java.lang.NoClassDefFoundError: org/codehaus/plexus/components/io/attributes/AttributeUtils
	at org.apache.maven.plugins.dependency.fromConfiguration.TestUnpackMojo.testMissingVersionFromDependencyMgtWithClassifier(TestUnpackMojo.java:391)


FAILED:  org.apache.maven.plugins.dependency.fromConfiguration.TestUnpackMojo.testUnpackToLocation

Error Message:
org/codehaus/plexus/components/io/attributes/AttributeUtils

Stack Trace:
java.lang.NoClassDefFoundError: org/codehaus/plexus/components/io/attributes/AttributeUtils
	at org.apache.maven.plugins.dependency.fromConfiguration.TestUnpackMojo.testUnpackToLocation(TestUnpackMojo.java:171)
Caused by: java.lang.ClassNotFoundException: org.codehaus.plexus.components.io.attributes.AttributeUtils
	at org.apache.maven.plugins.dependency.fromConfiguration.TestUnpackMojo.testUnpackToLocation(TestUnpackMojo.java:171)


FAILED:  org.apache.maven.plugins.dependency.fromConfiguration.TestUnpackMojo.testUnpackToLocationWhereLocationCannotBeCreatedThrowsException

Error Message:
org/codehaus/plexus/components/io/attributes/AttributeUtils

Stack Trace:
java.lang.NoClassDefFoundError: org/codehaus/plexus/components/io/attributes/AttributeUtils
	at org.apache.maven.plugins.dependency.fromConfiguration.TestUnpackMojo.testUnpackToLocationWhereLocationCannotBeCreatedThrowsException(TestUnpackMojo.java:203)


FAILED:  org.apache.maven.plugins.dependency.fromConfiguration.TestUnpackMojo.testMissingVersionFromDependenciesWithClassifier

Error Message:
org/codehaus/plexus/components/io/attributes/AttributeUtils

Stack Trace:
java.lang.NoClassDefFoundError: org/codehaus/plexus/components/io/attributes/AttributeUtils
	at org.apache.maven.plugins.dependency.fromConfiguration.TestUnpackMojo.testMissingVersionFromDependenciesWithClassifier(TestUnpackMojo.java:299)


FAILED:  org.apache.maven.plugins.dependency.fromConfiguration.TestUnpackMojo.testUnpackDontOverWriteSnapshots

Error Message:
org/codehaus/plexus/components/io/attributes/AttributeUtils

Stack Trace:
java.lang.NoClassDefFoundError: org/codehaus/plexus/components/io/attributes/AttributeUtils
	at org.apache.maven.plugins.dependency.fromConfiguration.TestUnpackMojo.testUnpackDontOverWriteSnapshots(TestUnpackMojo.java:484)


FAILED:  org.apache.maven.plugins.dependency.fromConfiguration.TestUnpackMojo.testUnpackOverWriteReleases

Error Message:
org/codehaus/plexus/components/io/attributes/AttributeUtils

Stack Trace:
java.lang.NoClassDefFoundError: org/codehaus/plexus/components/io/attributes/AttributeUtils
	at org.apache.maven.plugins.dependency.fromConfiguration.TestUnpackMojo.testUnpackOverWriteReleases(TestUnpackMojo.java:504)


FAILED:  org.apache.maven.plugins.dependency.fromConfiguration.TestUnpackMojo.testUnpackDontOverWriteReleases

Error Message:
org/codehaus/plexus/components/io/attributes/AttributeUtils

Stack Trace:
java.lang.NoClassDefFoundError: org/codehaus/plexus/components/io/attributes/AttributeUtils
	at org.apache.maven.plugins.dependency.fromConfiguration.TestUnpackMojo.testUnpackDontOverWriteReleases(TestUnpackMojo.java:464)


FAILED:  org.apache.maven.plugins.dependency.fromConfiguration.TestUnpackMojo.testMissingVersionFromDependencies

Error Message:
org/codehaus/plexus/components/io/attributes/AttributeUtils

Stack Trace:
java.lang.NoClassDefFoundError: org/codehaus/plexus/components/io/attributes/AttributeUtils
	at org.apache.maven.plugins.dependency.fromConfiguration.TestUnpackMojo.testMissingVersionFromDependencies(TestUnpackMojo.java:277)


FAILED:  org.apache.maven.plugins.dependency.fromConfiguration.TestUnpackMojo.testUnpackOverWriteIfNewer

Error Message:
org/codehaus/plexus/components/io/attributes/AttributeUtils

Stack Trace:
java.lang.NoClassDefFoundError: org/codehaus/plexus/components/io/attributes/AttributeUtils
	at org.apache.maven.plugins.dependency.fromConfiguration.TestUnpackMojo.testUnpackOverWriteIfNewer(TestUnpackMojo.java:545)


FAILED:  org.apache.maven.plugins.dependency.fromConfiguration.TestUnpackMojo.testMissingVersionFromDependencyMgt

Error Message:
org/codehaus/plexus/components/io/attributes/AttributeUtils

Stack Trace:
java.lang.NoClassDefFoundError: org/codehaus/plexus/components/io/attributes/AttributeUtils
	at org.apache.maven.plugins.dependency.fromConfiguration.TestUnpackMojo.testMissingVersionFromDependencyMgt(TestUnpackMojo.java:354)


FAILED:  org.apache.maven.plugins.dependency.fromConfiguration.TestUnpackMojo.testUnpackFile

Error Message:
org/codehaus/plexus/components/io/attributes/AttributeUtils

Stack Trace:
java.lang.NoClassDefFoundError: org/codehaus/plexus/components/io/attributes/AttributeUtils
	at org.apache.maven.plugins.dependency.fromConfiguration.TestUnpackMojo.testUnpackFile(TestUnpackMojo.java:144)


FAILED:  org.apache.maven.plugins.dependency.fromConfiguration.TestUnpackMojo.testUnpackOverWriteSnapshot

Error Message:
org/codehaus/plexus/components/io/attributes/AttributeUtils

Stack Trace:
java.lang.NoClassDefFoundError: org/codehaus/plexus/components/io/attributes/AttributeUtils
	at org.apache.maven.plugins.dependency.fromConfiguration.TestUnpackMojo.testUnpackOverWriteSnapshot(TestUnpackMojo.java:525)


FAILED:  org.apache.maven.plugins.dependency.fromConfiguration.TestUnpackMojo.testMissingVersionFromDependencyMgtWithClassifier

Error Message:
org/codehaus/plexus/components/io/attributes/AttributeUtils

Stack Trace:
java.lang.NoClassDefFoundError: org/codehaus/plexus/components/io/attributes/AttributeUtils
	at org.apache.maven.plugins.dependency.fromConfiguration.TestUnpackMojo.testMissingVersionFromDependencyMgtWithClassifier(TestUnpackMojo.java:391)


FAILED:  org.apache.maven.plugins.dependency.fromConfiguration.TestUnpackMojo.testUnpackToLocation

Error Message:
org/codehaus/plexus/components/io/attributes/AttributeUtils

Stack Trace:
java.lang.NoClassDefFoundError: org/codehaus/plexus/components/io/attributes/AttributeUtils
	at org.apache.maven.plugins.dependency.fromConfiguration.TestUnpackMojo.testUnpackToLocation(TestUnpackMojo.java:171)
Caused by: java.lang.ClassNotFoundException: org.codehaus.plexus.components.io.attributes.AttributeUtils
	at org.apache.maven.plugins.dependency.fromConfiguration.TestUnpackMojo.testUnpackToLocation(TestUnpackMojo.java:171)


FAILED:  org.apache.maven.plugins.dependency.fromConfiguration.TestUnpackMojo.testUnpackToLocationWhereLocationCannotBeCreatedThrowsException

Error Message:
org/codehaus/plexus/components/io/attributes/AttributeUtils

Stack Trace:
java.lang.NoClassDefFoundError: org/codehaus/plexus/components/io/attributes/AttributeUtils
	at org.apache.maven.plugins.dependency.fromConfiguration.TestUnpackMojo.testUnpackToLocationWhereLocationCannotBeCreatedThrowsException(TestUnpackMojo.java:203)


FAILED:  org.apache.maven.plugins.dependency.fromConfiguration.TestUnpackMojo.testMissingVersionFromDependenciesWithClassifier

Error Message:
org/codehaus/plexus/components/io/attributes/AttributeUtils

Stack Trace:
java.lang.NoClassDefFoundError: org/codehaus/plexus/components/io/attributes/AttributeUtils
	at org.apache.maven.plugins.dependency.fromConfiguration.TestUnpackMojo.testMissingVersionFromDependenciesWithClassifier(TestUnpackMojo.java:299)


FAILED:  org.apache.maven.plugins.dependency.fromConfiguration.TestUnpackMojo.testUnpackDontOverWriteSnapshots

Error Message:
org/codehaus/plexus/components/io/attributes/AttributeUtils

Stack Trace:
java.lang.NoClassDefFoundError: org/codehaus/plexus/components/io/attributes/AttributeUtils
	at org.apache.maven.plugins.dependency.fromConfiguration.TestUnpackMojo.testUnpackDontOverWriteSnapshots(TestUnpackMojo.java:484)


FAILED:  org.apache.maven.plugins.dependency.fromConfiguration.TestUnpackMojo.testUnpackOverWriteReleases

Error Message:
org/codehaus/plexus/components/io/attributes/AttributeUtils

Stack Trace:
java.lang.NoClassDefFoundError: org/codehaus/plexus/components/io/attributes/AttributeUtils
	at org.apache.maven.plugins.dependency.fromConfiguration.TestUnpackMojo.testUnpackOverWriteReleases(TestUnpackMojo.java:504)


FAILED:  org.apache.maven.plugins.dependency.fromConfiguration.TestUnpackMojo.testUnpackDontOverWriteReleases

Error Message:
org/codehaus/plexus/components/io/attributes/AttributeUtils

Stack Trace:
java.lang.NoClassDefFoundError: org/codehaus/plexus/components/io/attributes/AttributeUtils
	at org.apache.maven.plugins.dependency.fromConfiguration.TestUnpackMojo.testUnpackDontOverWriteReleases(TestUnpackMojo.java:464)


FAILED:  org.apache.maven.plugins.dependency.fromConfiguration.TestUnpackMojo.testMissingVersionFromDependencies

Error Message:
org/codehaus/plexus/components/io/attributes/AttributeUtils

Stack Trace:
java.lang.NoClassDefFoundError: org/codehaus/plexus/components/io/attributes/AttributeUtils
	at org.apache.maven.plugins.dependency.fromConfiguration.TestUnpackMojo.testMissingVersionFromDependencies(TestUnpackMojo.java:277)


FAILED:  org.apache.maven.plugins.dependency.fromConfiguration.TestUnpackMojo.testUnpackOverWriteIfNewer

Error Message:
org/codehaus/plexus/components/io/attributes/AttributeUtils

Stack Trace:
java.lang.NoClassDefFoundError: org/codehaus/plexus/components/io/attributes/AttributeUtils
	at org.apache.maven.plugins.dependency.fromConfiguration.TestUnpackMojo.testUnpackOverWriteIfNewer(TestUnpackMojo.java:545)


FAILED:  org.apache.maven.plugins.dependency.fromConfiguration.TestUnpackMojo.testMissingVersionFromDependencyMgt

Error Message:
org/codehaus/plexus/components/io/attributes/AttributeUtils

Stack Trace:
java.lang.NoClassDefFoundError: org/codehaus/plexus/components/io/attributes/AttributeUtils
	at org.apache.maven.plugins.dependency.fromConfiguration.TestUnpackMojo.testMissingVersionFromDependencyMgt(TestUnpackMojo.java:354)


FAILED:  org.apache.maven.plugins.dependency.fromConfiguration.TestUnpackMojo.testUnpackFile

Error Message:
org/codehaus/plexus/components/io/attributes/AttributeUtils

Stack Trace:
java.lang.NoClassDefFoundError: org/codehaus/plexus/components/io/attributes/AttributeUtils
	at org.apache.maven.plugins.dependency.fromConfiguration.TestUnpackMojo.testUnpackFile(TestUnpackMojo.java:144)


FAILED:  org.apache.maven.plugins.dependency.fromConfiguration.TestUnpackMojo.testUnpackOverWriteSnapshot

Error Message:
org/codehaus/plexus/components/io/attributes/AttributeUtils

Stack Trace:
java.lang.NoClassDefFoundError: org/codehaus/plexus/components/io/attributes/AttributeUtils
	at org.apache.maven.plugins.dependency.fromConfiguration.TestUnpackMojo.testUnpackOverWriteSnapshot(TestUnpackMojo.java:525)


FAILED:  org.apache.maven.plugins.dependency.fromConfiguration.TestUnpackMojo.testMissingVersionFromDependencyMgtWithClassifier

Error Message:
org/codehaus/plexus/components/io/attributes/AttributeUtils

Stack Trace:
java.lang.NoClassDefFoundError: org/codehaus/plexus/components/io/attributes/AttributeUtils
	at org.apache.maven.plugins.dependency.fromConfiguration.TestUnpackMojo.testMissingVersionFromDependencyMgtWithClassifier(TestUnpackMojo.java:391)


FAILED:  org.apache.maven.plugins.dependency.fromDependencies.TestUnpackDependenciesMojo.testExcludeSystemScope

Error Message:
org/codehaus/plexus/components/io/attributes/AttributeUtils

Stack Trace:
java.lang.NoClassDefFoundError: org/codehaus/plexus/components/io/attributes/AttributeUtils
	at org.apache.maven.plugins.dependency.fromDependencies.TestUnpackDependenciesMojo.testExcludeSystemScope(TestUnpackDependenciesMojo.java:193)


FAILED:  org.apache.maven.plugins.dependency.fromDependencies.TestUnpackDependenciesMojo.testIncludeGroupId

Error Message:
org/codehaus/plexus/components/io/attributes/AttributeUtils

Stack Trace:
java.lang.NoClassDefFoundError: org/codehaus/plexus/components/io/attributes/AttributeUtils
	at org.apache.maven.plugins.dependency.fromDependencies.TestUnpackDependenciesMojo.testIncludeGroupId(TestUnpackDependenciesMojo.java:508)


FAILED:  org.apache.maven.plugins.dependency.fromDependencies.TestUnpackDependenciesMojo.testIncludeRuntimeScope

Error Message:
org/codehaus/plexus/components/io/attributes/AttributeUtils

Stack Trace:
java.lang.NoClassDefFoundError: org/codehaus/plexus/components/io/attributes/AttributeUtils
	at org.apache.maven.plugins.dependency.fromDependencies.TestUnpackDependenciesMojo.testIncludeRuntimeScope(TestUnpackDependenciesMojo.java:390)


FAILED:  org.apache.maven.plugins.dependency.fromDependencies.TestUnpackDependenciesMojo.testExcludeCompileScope

Error Message:
org/codehaus/plexus/components/io/attributes/AttributeUtils

Stack Trace:
java.lang.NoClassDefFoundError: org/codehaus/plexus/components/io/attributes/AttributeUtils
	at org.apache.maven.plugins.dependency.fromDependencies.TestUnpackDependenciesMojo.testExcludeCompileScope(TestUnpackDependenciesMojo.java:208)


FAILED:  org.apache.maven.plugins.dependency.fromDependencies.TestUnpackDependenciesMojo.testMojo

Error Message:
org/codehaus/plexus/components/io/attributes/AttributeUtils

Stack Trace:
java.lang.NoClassDefFoundError: org/codehaus/plexus/components/io/attributes/AttributeUtils
	at org.apache.maven.plugins.dependency.fromDependencies.TestUnpackDependenciesMojo.testMojo(TestUnpackDependenciesMojo.java:136)


FAILED:  org.apache.maven.plugins.dependency.fromDependencies.TestUnpackDependenciesMojo.testSubPerArtifact

Error Message:
org/codehaus/plexus/components/io/attributes/AttributeUtils

Stack Trace:
java.lang.NoClassDefFoundError: org/codehaus/plexus/components/io/attributes/AttributeUtils
	at org.apache.maven.plugins.dependency.fromDependencies.TestUnpackDependenciesMojo.testSubPerArtifact(TestUnpackDependenciesMojo.java:301)


FAILED:  org.apache.maven.plugins.dependency.fromDependencies.TestUnpackDependenciesMojo.testSubPerArtifactRemoveVersion

Error Message:
org/codehaus/plexus/components/io/attributes/AttributeUtils

Stack Trace:
java.lang.NoClassDefFoundError: org/codehaus/plexus/components/io/attributes/AttributeUtils
	at org.apache.maven.plugins.dependency.fromDependencies.TestUnpackDependenciesMojo.testSubPerArtifactRemoveVersion(TestUnpackDependenciesMojo.java:329)


FAILED:  org.apache.maven.plugins.dependency.fromDependencies.TestUnpackDependenciesMojo.testIncludeArtifactId

Error Message:
org/codehaus/plexus/components/io/attributes/AttributeUtils

Stack Trace:
java.lang.NoClassDefFoundError: org/codehaus/plexus/components/io/attributes/AttributeUtils
	at org.apache.maven.plugins.dependency.fromDependencies.TestUnpackDependenciesMojo.testIncludeArtifactId(TestUnpackDependenciesMojo.java:446)


FAILED:  org.apache.maven.plugins.dependency.fromDependencies.TestUnpackDependenciesMojo.testCDMType

Error Message:
org/codehaus/plexus/components/io/attributes/AttributeUtils

Stack Trace:
java.lang.NoClassDefFoundError: org/codehaus/plexus/components/io/attributes/AttributeUtils
	at org.apache.maven.plugins.dependency.fromDependencies.TestUnpackDependenciesMojo.dotestClassifierType(TestUnpackDependenciesMojo.java:552)
	at org.apache.maven.plugins.dependency.fromDependencies.TestUnpackDependenciesMojo.testCDMType(TestUnpackDependenciesMojo.java:529)


FAILED:  org.apache.maven.plugins.dependency.fromDependencies.TestUnpackDependenciesMojo.testExcludeProvidedScope

Error Message:
org/codehaus/plexus/components/io/attributes/AttributeUtils

Stack Trace:
java.lang.NoClassDefFoundError: org/codehaus/plexus/components/io/attributes/AttributeUtils
	at org.apache.maven.plugins.dependency.fromDependencies.TestUnpackDependenciesMojo.testExcludeProvidedScope(TestUnpackDependenciesMojo.java:176)


FAILED:  org.apache.maven.plugins.dependency.fromDependencies.TestUnpackDependenciesMojo.testCDMClassifier

Error Message:
org/codehaus/plexus/components/io/attributes/AttributeUtils

Stack Trace:
java.lang.NoClassDefFoundError: org/codehaus/plexus/components/io/attributes/AttributeUtils
	at org.apache.maven.plugins.dependency.fromDependencies.TestUnpackDependenciesMojo.dotestClassifierType(TestUnpackDependenciesMojo.java:552)
	at org.apache.maven.plugins.dependency.fromDependencies.TestUnpackDependenciesMojo.testCDMClassifier(TestUnpackDependenciesMojo.java:523)


FAILED:  org.apache.maven.plugins.dependency.fromDependencies.TestUnpackDependenciesMojo.testIncludeType

Error Message:
org/codehaus/plexus/components/io/attributes/AttributeUtils

Stack Trace:
java.lang.NoClassDefFoundError: org/codehaus/plexus/components/io/attributes/AttributeUtils
	at org.apache.maven.plugins.dependency.fromDependencies.TestUnpackDependenciesMojo.testIncludeType(TestUnpackDependenciesMojo.java:272)


FAILED:  org.apache.maven.plugins.dependency.fromDependencies.TestUnpackDependenciesMojo.testSubPerArtifactAndType

Error Message:
org/codehaus/plexus/components/io/attributes/AttributeUtils

Stack Trace:
java.lang.NoClassDefFoundError: org/codehaus/plexus/components/io/attributes/AttributeUtils
	at org.apache.maven.plugins.dependency.fromDependencies.TestUnpackDependenciesMojo.testSubPerArtifactAndType(TestUnpackDependenciesMojo.java:316)


FAILED:  org.apache.maven.plugins.dependency.fromDependencies.TestUnpackDependenciesMojo.testIncludesystemScope

Error Message:
org/codehaus/plexus/components/io/attributes/AttributeUtils

Stack Trace:
java.lang.NoClassDefFoundError: org/codehaus/plexus/components/io/attributes/AttributeUtils
	at org.apache.maven.plugins.dependency.fromDependencies.TestUnpackDependenciesMojo.testIncludesystemScope(TestUnpackDependenciesMojo.java:420)


FAILED:  org.apache.maven.plugins.dependency.fromDependencies.TestUnpackDependenciesMojo.testIncludeTestScope

Error Message:
org/codehaus/plexus/components/io/attributes/AttributeUtils

Stack Trace:
java.lang.NoClassDefFoundError: org/codehaus/plexus/components/io/attributes/AttributeUtils
	at org.apache.maven.plugins.dependency.fromDependencies.TestUnpackDependenciesMojo.testIncludeTestScope(TestUnpackDependenciesMojo.java:375)


FAILED:  org.apache.maven.plugins.dependency.fromDependencies.TestUnpackDependenciesMojo.testExcludeRuntimeScope

Error Message:
org/codehaus/plexus/components/io/attributes/AttributeUtils

Stack Trace:
java.lang.NoClassDefFoundError: org/codehaus/plexus/components/io/attributes/AttributeUtils
	at org.apache.maven.plugins.dependency.fromDependencies.TestUnpackDependenciesMojo.testExcludeRuntimeScope(TestUnpackDependenciesMojo.java:242)


FAILED:  org.apache.maven.plugins.dependency.fromDependencies.TestUnpackDependenciesMojo.testExcludeType

Error Message:
org/codehaus/plexus/components/io/attributes/AttributeUtils

Stack Trace:
java.lang.NoClassDefFoundError: org/codehaus/plexus/components/io/attributes/AttributeUtils
	at org.apache.maven.plugins.dependency.fromDependencies.TestUnpackDependenciesMojo.testExcludeType(TestUnpackDependenciesMojo.java:160)


FAILED:  org.apache.maven.plugins.dependency.fromDependencies.TestUnpackDependenciesMojo.testNoTransitive

Error Message:
org/codehaus/plexus/components/io/attributes/AttributeUtils

Stack Trace:
java.lang.NoClassDefFoundError: org/codehaus/plexus/components/io/attributes/AttributeUtils
	at org.apache.maven.plugins.dependency.fromDependencies.TestUnpackDependenciesMojo.testNoTransitive(TestUnpackDependenciesMojo.java:147)


FAILED:  org.apache.maven.plugins.dependency.fromDependencies.TestUnpackDependenciesMojo.testIncludeCompileScope

Error Message:
org/codehaus/plexus/components/io/attributes/AttributeUtils

Stack Trace:
java.lang.NoClassDefFoundError: org/codehaus/plexus/components/io/attributes/AttributeUtils
	at org.apache.maven.plugins.dependency.fromDependencies.TestUnpackDependenciesMojo.testIncludeCompileScope(TestUnpackDependenciesMojo.java:359)


FAILED:  org.apache.maven.plugins.dependency.fromDependencies.TestUnpackDependenciesMojo.testIncludeprovidedScope

Error Message:
org/codehaus/plexus/components/io/attributes/AttributeUtils

Stack Trace:
java.lang.NoClassDefFoundError: org/codehaus/plexus/components/io/attributes/AttributeUtils
	at org.apache.maven.plugins.dependency.fromDependencies.TestUnpackDependenciesMojo.testIncludeprovidedScope(TestUnpackDependenciesMojo.java:406)


FAILED:  org.apache.maven.plugins.dependency.fromDependencies.TestUnpackDependenciesMojo.testSubPerType

Error Message:
org/codehaus/plexus/components/io/attributes/AttributeUtils

Stack Trace:
java.lang.NoClassDefFoundError: org/codehaus/plexus/components/io/attributes/AttributeUtils
	at org.apache.maven.plugins.dependency.fromDependencies.TestUnpackDependenciesMojo.testSubPerType(TestUnpackDependenciesMojo.java:289)


FAILED:  org.apache.maven.plugins.dependency.fromDependencies.TestUnpackDependenciesMojo.testSubPerArtifactAndTypeRemoveVersion

Error Message:
org/codehaus/plexus/components/io/attributes/AttributeUtils

Stack Trace:
java.lang.NoClassDefFoundError: org/codehaus/plexus/components/io/attributes/AttributeUtils
	at org.apache.maven.plugins.dependency.fromDependencies.TestUnpackDependenciesMojo.testSubPerArtifactAndTypeRemoveVersion(TestUnpackDependenciesMojo.java:345)


FAILED:  org.apache.maven.plugins.dependency.fromDependencies.TestUnpackDependenciesMojo.testExcludeArtifactId

Error Message:
org/codehaus/plexus/components/io/attributes/AttributeUtils

Stack Trace:
java.lang.NoClassDefFoundError: org/codehaus/plexus/components/io/attributes/AttributeUtils
	at org.apache.maven.plugins.dependency.fromDependencies.TestUnpackDependenciesMojo.testExcludeArtifactId(TestUnpackDependenciesMojo.java:463)


FAILED:  org.apache.maven.plugins.dependency.fromDependencies.TestUnpackDependenciesMojo.testExcludeGroupId

Error Message:
org/codehaus/plexus/components/io/attributes/AttributeUtils

Stack Trace:
java.lang.NoClassDefFoundError: org/codehaus/plexus/components/io/attributes/AttributeUtils
	at org.apache.maven.plugins.dependency.fromDependencies.TestUnpackDependenciesMojo.testExcludeGroupId(TestUnpackDependenciesMojo.java:480)


FAILED:  org.apache.maven.plugins.dependency.fromDependencies.TestUnpackDependenciesMojo.testCDMClassifierType

Error Message:
org/codehaus/plexus/components/io/attributes/AttributeUtils

Stack Trace:
java.lang.NoClassDefFoundError: org/codehaus/plexus/components/io/attributes/AttributeUtils
	at org.apache.maven.plugins.dependency.fromDependencies.TestUnpackDependenciesMojo.dotestClassifierType(TestUnpackDependenciesMojo.java:552)
	at org.apache.maven.plugins.dependency.fromDependencies.TestUnpackDependenciesMojo.testCDMClassifierType(TestUnpackDependenciesMojo.java:535)


FAILED:  org.apache.maven.plugins.dependency.fromDependencies.TestUnpackDependenciesMojo.testExcludeSystemScope

Error Message:
org/codehaus/plexus/components/io/attributes/AttributeUtils

Stack Trace:
java.lang.NoClassDefFoundError: org/codehaus/plexus/components/io/attributes/AttributeUtils
	at org.apache.maven.plugins.dependency.fromDependencies.TestUnpackDependenciesMojo.testExcludeSystemScope(TestUnpackDependenciesMojo.java:193)


FAILED:  org.apache.maven.plugins.dependency.fromDependencies.TestUnpackDependenciesMojo.testIncludeGroupId

Error Message:
org/codehaus/plexus/components/io/attributes/AttributeUtils

Stack Trace:
java.lang.NoClassDefFoundError: org/codehaus/plexus/components/io/attributes/AttributeUtils
	at org.apache.maven.plugins.dependency.fromDependencies.TestUnpackDependenciesMojo.testIncludeGroupId(TestUnpackDependenciesMojo.java:508)


FAILED:  org.apache.maven.plugins.dependency.fromDependencies.TestUnpackDependenciesMojo.testIncludeRuntimeScope

Error Message:
org/codehaus/plexus/components/io/attributes/AttributeUtils

Stack Trace:
java.lang.NoClassDefFoundError: org/codehaus/plexus/components/io/attributes/AttributeUtils
	at org.apache.maven.plugins.dependency.fromDependencies.TestUnpackDependenciesMojo.testIncludeRuntimeScope(TestUnpackDependenciesMojo.java:390)


FAILED:  org.apache.maven.plugins.dependency.fromDependencies.TestUnpackDependenciesMojo.testExcludeCompileScope

Error Message:
org/codehaus/plexus/components/io/attributes/AttributeUtils

Stack Trace:
java.lang.NoClassDefFoundError: org/codehaus/plexus/components/io/attributes/AttributeUtils
	at org.apache.maven.plugins.dependency.fromDependencies.TestUnpackDependenciesMojo.testExcludeCompileScope(TestUnpackDependenciesMojo.java:208)


FAILED:  org.apache.maven.plugins.dependency.fromDependencies.TestUnpackDependenciesMojo.testMojo

Error Message:
org/codehaus/plexus/components/io/attributes/AttributeUtils

Stack Trace:
java.lang.NoClassDefFoundError: org/codehaus/plexus/components/io/attributes/AttributeUtils
	at org.apache.maven.plugins.dependency.fromDependencies.TestUnpackDependenciesMojo.testMojo(TestUnpackDependenciesMojo.java:136)


FAILED:  org.apache.maven.plugins.dependency.fromDependencies.TestUnpackDependenciesMojo.testSubPerArtifact

Error Message:
org/codehaus/plexus/components/io/attributes/AttributeUtils

Stack Trace:
java.lang.NoClassDefFoundError: org/codehaus/plexus/components/io/attributes/AttributeUtils
	at org.apache.maven.plugins.dependency.fromDependencies.TestUnpackDependenciesMojo.testSubPerArtifact(TestUnpackDependenciesMojo.java:301)


FAILED:  org.apache.maven.plugins.dependency.fromDependencies.TestUnpackDependenciesMojo.testSubPerArtifactRemoveVersion

Error Message:
org/codehaus/plexus/components/io/attributes/AttributeUtils

Stack Trace:
java.lang.NoClassDefFoundError: org/codehaus/plexus/components/io/attributes/AttributeUtils
	at org.apache.maven.plugins.dependency.fromDependencies.TestUnpackDependenciesMojo.testSubPerArtifactRemoveVersion(TestUnpackDependenciesMojo.java:329)


FAILED:  org.apache.maven.plugins.dependency.fromDependencies.TestUnpackDependenciesMojo.testIncludeArtifactId

Error Message:
org/codehaus/plexus/components/io/attributes/AttributeUtils

Stack Trace:
java.lang.NoClassDefFoundError: org/codehaus/plexus/components/io/attributes/AttributeUtils
	at org.apache.maven.plugins.dependency.fromDependencies.TestUnpackDependenciesMojo.testIncludeArtifactId(TestUnpackDependenciesMojo.java:446)


FAILED:  org.apache.maven.plugins.dependency.fromDependencies.TestUnpackDependenciesMojo.testCDMType

Error Message:
org/codehaus/plexus/components/io/attributes/AttributeUtils

Stack Trace:
java.lang.NoClassDefFoundError: org/codehaus/plexus/components/io/attributes/AttributeUtils
	at org.apache.maven.plugins.dependency.fromDependencies.TestUnpackDependenciesMojo.dotestClassifierType(TestUnpackDependenciesMojo.java:552)
	at org.apache.maven.plugins.dependency.fromDependencies.TestUnpackDependenciesMojo.testCDMType(TestUnpackDependenciesMojo.java:529)


FAILED:  org.apache.maven.plugins.dependency.fromDependencies.TestUnpackDependenciesMojo.testExcludeProvidedScope

Error Message:
org/codehaus/plexus/components/io/attributes/AttributeUtils

Stack Trace:
java.lang.NoClassDefFoundError: org/codehaus/plexus/components/io/attributes/AttributeUtils
	at org.apache.maven.plugins.dependency.fromDependencies.TestUnpackDependenciesMojo.testExcludeProvidedScope(TestUnpackDependenciesMojo.java:176)


FAILED:  org.apache.maven.plugins.dependency.fromDependencies.TestUnpackDependenciesMojo.testCDMClassifier

Error Message:
org/codehaus/plexus/components/io/attributes/AttributeUtils

Stack Trace:
java.lang.NoClassDefFoundError: org/codehaus/plexus/components/io/attributes/AttributeUtils
	at org.apache.maven.plugins.dependency.fromDependencies.TestUnpackDependenciesMojo.dotestClassifierType(TestUnpackDependenciesMojo.java:552)
	at org.apache.maven.plugins.dependency.fromDependencies.TestUnpackDependenciesMojo.testCDMClassifier(TestUnpackDependenciesMojo.java:523)


FAILED:  org.apache.maven.plugins.dependency.fromDependencies.TestUnpackDependenciesMojo.testIncludeType

Error Message:
org/codehaus/plexus/components/io/attributes/AttributeUtils

Stack Trace:
java.lang.NoClassDefFoundError: org/codehaus/plexus/components/io/attributes/AttributeUtils
	at org.apache.maven.plugins.dependency.fromDependencies.TestUnpackDependenciesMojo.testIncludeType(TestUnpackDependenciesMojo.java:272)


FAILED:  org.apache.maven.plugins.dependency.fromDependencies.TestUnpackDependenciesMojo.testSubPerArtifactAndType

Error Message:
org/codehaus/plexus/components/io/attributes/AttributeUtils

Stack Trace:
java.lang.NoClassDefFoundError: org/codehaus/plexus/components/io/attributes/AttributeUtils
	at org.apache.maven.plugins.dependency.fromDependencies.TestUnpackDependenciesMojo.testSubPerArtifactAndType(TestUnpackDependenciesMojo.java:316)


FAILED:  org.apache.maven.plugins.dependency.fromDependencies.TestUnpackDependenciesMojo.testIncludesystemScope

Error Message:
org/codehaus/plexus/components/io/attributes/AttributeUtils

Stack Trace:
java.lang.NoClassDefFoundError: org/codehaus/plexus/components/io/attributes/AttributeUtils
	at org.apache.maven.plugins.dependency.fromDependencies.TestUnpackDependenciesMojo.testIncludesystemScope(TestUnpackDependenciesMojo.java:420)


FAILED:  org.apache.maven.plugins.dependency.fromDependencies.TestUnpackDependenciesMojo.testIncludeTestScope

Error Message:
org/codehaus/plexus/components/io/attributes/AttributeUtils

Stack Trace:
java.lang.NoClassDefFoundError: org/codehaus/plexus/components/io/attributes/AttributeUtils
	at org.apache.maven.plugins.dependency.fromDependencies.TestUnpackDependenciesMojo.testIncludeTestScope(TestUnpackDependenciesMojo.java:375)


FAILED:  org.apache.maven.plugins.dependency.fromDependencies.TestUnpackDependenciesMojo.testExcludeRuntimeScope

Error Message:
org/codehaus/plexus/components/io/attributes/AttributeUtils

Stack Trace:
java.lang.NoClassDefFoundError: org/codehaus/plexus/components/io/attributes/AttributeUtils
	at org.apache.maven.plugins.dependency.fromDependencies.TestUnpackDependenciesMojo.testExcludeRuntimeScope(TestUnpackDependenciesMojo.java:242)


FAILED:  org.apache.maven.plugins.dependency.fromDependencies.TestUnpackDependenciesMojo.testExcludeType

Error Message:
org/codehaus/plexus/components/io/attributes/AttributeUtils

Stack Trace:
java.lang.NoClassDefFoundError: org/codehaus/plexus/components/io/attributes/AttributeUtils
	at org.apache.maven.plugins.dependency.fromDependencies.TestUnpackDependenciesMojo.testExcludeType(TestUnpackDependenciesMojo.java:160)


FAILED:  org.apache.maven.plugins.dependency.fromDependencies.TestUnpackDependenciesMojo.testNoTransitive

Error Message:
org/codehaus/plexus/components/io/attributes/AttributeUtils

Stack Trace:
java.lang.NoClassDefFoundError: org/codehaus/plexus/components/io/attributes/AttributeUtils
	at org.apache.maven.plugins.dependency.fromDependencies.TestUnpackDependenciesMojo.testNoTransitive(TestUnpackDependenciesMojo.java:147)


FAILED:  org.apache.maven.plugins.dependency.fromDependencies.TestUnpackDependenciesMojo.testIncludeCompileScope

Error Message:
org/codehaus/plexus/components/io/attributes/AttributeUtils

Stack Trace:
java.lang.NoClassDefFoundError: org/codehaus/plexus/components/io/attributes/AttributeUtils
	at org.apache.maven.plugins.dependency.fromDependencies.TestUnpackDependenciesMojo.testIncludeCompileScope(TestUnpackDependenciesMojo.java:359)


FAILED:  org.apache.maven.plugins.dependency.fromDependencies.TestUnpackDependenciesMojo.testIncludeprovidedScope

Error Message:
org/codehaus/plexus/components/io/attributes/AttributeUtils

Stack Trace:
java.lang.NoClassDefFoundError: org/codehaus/plexus/components/io/attributes/AttributeUtils
	at org.apache.maven.plugins.dependency.fromDependencies.TestUnpackDependenciesMojo.testIncludeprovidedScope(TestUnpackDependenciesMojo.java:406)


FAILED:  org.apache.maven.plugins.dependency.fromDependencies.TestUnpackDependenciesMojo.testSubPerType

Error Message:
org/codehaus/plexus/components/io/attributes/AttributeUtils

Stack Trace:
java.lang.NoClassDefFoundError: org/codehaus/plexus/components/io/attributes/AttributeUtils
	at org.apache.maven.plugins.dependency.fromDependencies.TestUnpackDependenciesMojo.testSubPerType(TestUnpackDependenciesMojo.java:289)


FAILED:  org.apache.maven.plugins.dependency.fromDependencies.TestUnpackDependenciesMojo.testSubPerArtifactAndTypeRemoveVersion

Error Message:
org/codehaus/plexus/components/io/attributes/AttributeUtils

Stack Trace:
java.lang.NoClassDefFoundError: org/codehaus/plexus/components/io/attributes/AttributeUtils
	at org.apache.maven.plugins.dependency.fromDependencies.TestUnpackDependenciesMojo.testSubPerArtifactAndTypeRemoveVersion(TestUnpackDependenciesMojo.java:345)


FAILED:  org.apache.maven.plugins.dependency.fromDependencies.TestUnpackDependenciesMojo.testExcludeArtifactId

Error Message:
org/codehaus/plexus/components/io/attributes/AttributeUtils

Stack Trace:
java.lang.NoClassDefFoundError: org/codehaus/plexus/components/io/attributes/AttributeUtils
	at org.apache.maven.plugins.dependency.fromDependencies.TestUnpackDependenciesMojo.testExcludeArtifactId(TestUnpackDependenciesMojo.java:463)


FAILED:  org.apache.maven.plugins.dependency.fromDependencies.TestUnpackDependenciesMojo.testExcludeGroupId

Error Message:
org/codehaus/plexus/components/io/attributes/AttributeUtils

Stack Trace:
java.lang.NoClassDefFoundError: org/codehaus/plexus/components/io/attributes/AttributeUtils
	at org.apache.maven.plugins.dependency.fromDependencies.TestUnpackDependenciesMojo.testExcludeGroupId(TestUnpackDependenciesMojo.java:480)


FAILED:  org.apache.maven.plugins.dependency.fromDependencies.TestUnpackDependenciesMojo.testCDMClassifierType

Error Message:
org/codehaus/plexus/components/io/attributes/AttributeUtils

Stack Trace:
java.lang.NoClassDefFoundError: org/codehaus/plexus/components/io/attributes/AttributeUtils
	at org.apache.maven.plugins.dependency.fromDependencies.TestUnpackDependenciesMojo.dotestClassifierType(TestUnpackDependenciesMojo.java:552)
	at org.apache.maven.plugins.dependency.fromDependencies.TestUnpackDependenciesMojo.testCDMClassifierType(TestUnpackDependenciesMojo.java:535)


FAILED:  org.apache.maven.plugins.dependency.fromDependencies.TestUnpackDependenciesMojo.testExcludeSystemScope

Error Message:
org/codehaus/plexus/components/io/attributes/AttributeUtils

Stack Trace:
java.lang.NoClassDefFoundError: org/codehaus/plexus/components/io/attributes/AttributeUtils
	at org.apache.maven.plugins.dependency.fromDependencies.TestUnpackDependenciesMojo.testExcludeSystemScope(TestUnpackDependenciesMojo.java:193)


FAILED:  org.apache.maven.plugins.dependency.fromDependencies.TestUnpackDependenciesMojo.testIncludeGroupId

Error Message:
org/codehaus/plexus/components/io/attributes/AttributeUtils

Stack Trace:
java.lang.NoClassDefFoundError: org/codehaus/plexus/components/io/attributes/AttributeUtils
	at org.apache.maven.plugins.dependency.fromDependencies.TestUnpackDependenciesMojo.testIncludeGroupId(TestUnpackDependenciesMojo.java:508)


FAILED:  org.apache.maven.plugins.dependency.fromDependencies.TestUnpackDependenciesMojo.testIncludeRuntimeScope

Error Message:
org/codehaus/plexus/components/io/attributes/AttributeUtils

Stack Trace:
java.lang.NoClassDefFoundError: org/codehaus/plexus/components/io/attributes/AttributeUtils
	at org.apache.maven.plugins.dependency.fromDependencies.TestUnpackDependenciesMojo.testIncludeRuntimeScope(TestUnpackDependenciesMojo.java:390)


FAILED:  org.apache.maven.plugins.dependency.fromDependencies.TestUnpackDependenciesMojo.testExcludeCompileScope

Error Message:
org/codehaus/plexus/components/io/attributes/AttributeUtils

Stack Trace:
java.lang.NoClassDefFoundError: org/codehaus/plexus/components/io/attributes/AttributeUtils
	at org.apache.maven.plugins.dependency.fromDependencies.TestUnpackDependenciesMojo.testExcludeCompileScope(TestUnpackDependenciesMojo.java:208)


FAILED:  org.apache.maven.plugins.dependency.fromDependencies.TestUnpackDependenciesMojo.testMojo

Error Message:
org/codehaus/plexus/components/io/attributes/AttributeUtils

Stack Trace:
java.lang.NoClassDefFoundError: org/codehaus/plexus/components/io/attributes/AttributeUtils
	at org.apache.maven.plugins.dependency.fromDependencies.TestUnpackDependenciesMojo.testMojo(TestUnpackDependenciesMojo.java:136)


FAILED:  org.apache.maven.plugins.dependency.fromDependencies.TestUnpackDependenciesMojo.testSubPerArtifact

Error Message:
org/codehaus/plexus/components/io/attributes/AttributeUtils

Stack Trace:
java.lang.NoClassDefFoundError: org/codehaus/plexus/components/io/attributes/AttributeUtils
	at org.apache.maven.plugins.dependency.fromDependencies.TestUnpackDependenciesMojo.testSubPerArtifact(TestUnpackDependenciesMojo.java:301)


FAILED:  org.apache.maven.plugins.dependency.fromDependencies.TestUnpackDependenciesMojo.testSubPerArtifactRemoveVersion

Error Message:
org/codehaus/plexus/components/io/attributes/AttributeUtils

Stack Trace:
java.lang.NoClassDefFoundError: org/codehaus/plexus/components/io/attributes/AttributeUtils
	at org.apache.maven.plugins.dependency.fromDependencies.TestUnpackDependenciesMojo.testSubPerArtifactRemoveVersion(TestUnpackDependenciesMojo.java:329)


FAILED:  org.apache.maven.plugins.dependency.fromDependencies.TestUnpackDependenciesMojo.testIncludeArtifactId

Error Message:
org/codehaus/plexus/components/io/attributes/AttributeUtils

Stack Trace:
java.lang.NoClassDefFoundError: org/codehaus/plexus/components/io/attributes/AttributeUtils
	at org.apache.maven.plugins.dependency.fromDependencies.TestUnpackDependenciesMojo.testIncludeArtifactId(TestUnpackDependenciesMojo.java:446)


FAILED:  org.apache.maven.plugins.dependency.fromDependencies.TestUnpackDependenciesMojo.testCDMType

Error Message:
org/codehaus/plexus/components/io/attributes/AttributeUtils

Stack Trace:
java.lang.NoClassDefFoundError: org/codehaus/plexus/components/io/attributes/AttributeUtils
	at org.apache.maven.plugins.dependency.fromDependencies.TestUnpackDependenciesMojo.dotestClassifierType(TestUnpackDependenciesMojo.java:552)
	at org.apache.maven.plugins.dependency.fromDependencies.TestUnpackDependenciesMojo.testCDMType(TestUnpackDependenciesMojo.java:529)


FAILED:  org.apache.maven.plugins.dependency.fromDependencies.TestUnpackDependenciesMojo.testExcludeProvidedScope

Error Message:
org/codehaus/plexus/components/io/attributes/AttributeUtils

Stack Trace:
java.lang.NoClassDefFoundError: org/codehaus/plexus/components/io/attributes/AttributeUtils
	at org.apache.maven.plugins.dependency.fromDependencies.TestUnpackDependenciesMojo.testExcludeProvidedScope(TestUnpackDependenciesMojo.java:176)


FAILED:  org.apache.maven.plugins.dependency.fromDependencies.TestUnpackDependenciesMojo.testCDMClassifier

Error Message:
org/codehaus/plexus/components/io/attributes/AttributeUtils

Stack Trace:
java.lang.NoClassDefFoundError: org/codehaus/plexus/components/io/attributes/AttributeUtils
	at org.apache.maven.plugins.dependency.fromDependencies.TestUnpackDependenciesMojo.dotestClassifierType(TestUnpackDependenciesMojo.java:552)
	at org.apache.maven.plugins.dependency.fromDependencies.TestUnpackDependenciesMojo.testCDMClassifier(TestUnpackDependenciesMojo.java:523)


FAILED:  org.apache.maven.plugins.dependency.fromDependencies.TestUnpackDependenciesMojo.testIncludeType

Error Message:
org/codehaus/plexus/components/io/attributes/AttributeUtils

Stack Trace:
java.lang.NoClassDefFoundError: org/codehaus/plexus/components/io/attributes/AttributeUtils
	at org.apache.maven.plugins.dependency.fromDependencies.TestUnpackDependenciesMojo.testIncludeType(TestUnpackDependenciesMojo.java:272)


FAILED:  org.apache.maven.plugins.dependency.fromDependencies.TestUnpackDependenciesMojo.testSubPerArtifactAndType

Error Message:
org/codehaus/plexus/components/io/attributes/AttributeUtils

Stack Trace:
java.lang.NoClassDefFoundError: org/codehaus/plexus/components/io/attributes/AttributeUtils
	at org.apache.maven.plugins.dependency.fromDependencies.TestUnpackDependenciesMojo.testSubPerArtifactAndType(TestUnpackDependenciesMojo.java:316)


FAILED:  org.apache.maven.plugins.dependency.fromDependencies.TestUnpackDependenciesMojo.testIncludesystemScope

Error Message:
org/codehaus/plexus/components/io/attributes/AttributeUtils

Stack Trace:
java.lang.NoClassDefFoundError: org/codehaus/plexus/components/io/attributes/AttributeUtils
	at org.apache.maven.plugins.dependency.fromDependencies.TestUnpackDependenciesMojo.testIncludesystemScope(TestUnpackDependenciesMojo.java:420)


FAILED:  org.apache.maven.plugins.dependency.fromDependencies.TestUnpackDependenciesMojo.testIncludeTestScope

Error Message:
org/codehaus/plexus/components/io/attributes/AttributeUtils

Stack Trace:
java.lang.NoClassDefFoundError: org/codehaus/plexus/components/io/attributes/AttributeUtils
	at org.apache.maven.plugins.dependency.fromDependencies.TestUnpackDependenciesMojo.testIncludeTestScope(TestUnpackDependenciesMojo.java:375)


FAILED:  org.apache.maven.plugins.dependency.fromDependencies.TestUnpackDependenciesMojo.testExcludeRuntimeScope

Error Message:
org/codehaus/plexus/components/io/attributes/AttributeUtils

Stack Trace:
java.lang.NoClassDefFoundError: org/codehaus/plexus/components/io/attributes/AttributeUtils
	at org.apache.maven.plugins.dependency.fromDependencies.TestUnpackDependenciesMojo.testExcludeRuntimeScope(TestUnpackDependenciesMojo.java:242)


FAILED:  org.apache.maven.plugins.dependency.fromDependencies.TestUnpackDependenciesMojo.testExcludeType

Error Message:
org/codehaus/plexus/components/io/attributes/AttributeUtils

Stack Trace:
java.lang.NoClassDefFoundError: org/codehaus/plexus/components/io/attributes/AttributeUtils
	at org.apache.maven.plugins.dependency.fromDependencies.TestUnpackDependenciesMojo.testExcludeType(TestUnpackDependenciesMojo.java:160)


FAILED:  org.apache.maven.plugins.dependency.fromDependencies.TestUnpackDependenciesMojo.testNoTransitive

Error Message:
org/codehaus/plexus/components/io/attributes/AttributeUtils

Stack Trace:
java.lang.NoClassDefFoundError: org/codehaus/plexus/components/io/attributes/AttributeUtils
	at org.apache.maven.plugins.dependency.fromDependencies.TestUnpackDependenciesMojo.testNoTransitive(TestUnpackDependenciesMojo.java:147)


FAILED:  org.apache.maven.plugins.dependency.fromDependencies.TestUnpackDependenciesMojo.testIncludeCompileScope

Error Message:
org/codehaus/plexus/components/io/attributes/AttributeUtils

Stack Trace:
java.lang.NoClassDefFoundError: org/codehaus/plexus/components/io/attributes/AttributeUtils
	at org.apache.maven.plugins.dependency.fromDependencies.TestUnpackDependenciesMojo.testIncludeCompileScope(TestUnpackDependenciesMojo.java:359)


FAILED:  org.apache.maven.plugins.dependency.fromDependencies.TestUnpackDependenciesMojo.testIncludeprovidedScope

Error Message:
org/codehaus/plexus/components/io/attributes/AttributeUtils

Stack Trace:
java.lang.NoClassDefFoundError: org/codehaus/plexus/components/io/attributes/AttributeUtils
	at org.apache.maven.plugins.dependency.fromDependencies.TestUnpackDependenciesMojo.testIncludeprovidedScope(TestUnpackDependenciesMojo.java:406)


FAILED:  org.apache.maven.plugins.dependency.fromDependencies.TestUnpackDependenciesMojo.testSubPerType

Error Message:
org/codehaus/plexus/components/io/attributes/AttributeUtils

Stack Trace:
java.lang.NoClassDefFoundError: org/codehaus/plexus/components/io/attributes/AttributeUtils
	at org.apache.maven.plugins.dependency.fromDependencies.TestUnpackDependenciesMojo.testSubPerType(TestUnpackDependenciesMojo.java:289)


FAILED:  org.apache.maven.plugins.dependency.fromDependencies.TestUnpackDependenciesMojo.testSubPerArtifactAndTypeRemoveVersion

Error Message:
org/codehaus/plexus/components/io/attributes/AttributeUtils

Stack Trace:
java.lang.NoClassDefFoundError: org/codehaus/plexus/components/io/attributes/AttributeUtils
	at org.apache.maven.plugins.dependency.fromDependencies.TestUnpackDependenciesMojo.testSubPerArtifactAndTypeRemoveVersion(TestUnpackDependenciesMojo.java:345)


FAILED:  org.apache.maven.plugins.dependency.fromDependencies.TestUnpackDependenciesMojo.testExcludeArtifactId

Error Message:
org/codehaus/plexus/components/io/attributes/AttributeUtils

Stack Trace:
java.lang.NoClassDefFoundError: org/codehaus/plexus/components/io/attributes/AttributeUtils
	at org.apache.maven.plugins.dependency.fromDependencies.TestUnpackDependenciesMojo.testExcludeArtifactId(TestUnpackDependenciesMojo.java:463)


FAILED:  org.apache.maven.plugins.dependency.fromDependencies.TestUnpackDependenciesMojo.testExcludeGroupId

Error Message:
org/codehaus/plexus/components/io/attributes/AttributeUtils

Stack Trace:
java.lang.NoClassDefFoundError: org/codehaus/plexus/components/io/attributes/AttributeUtils
	at org.apache.maven.plugins.dependency.fromDependencies.TestUnpackDependenciesMojo.testExcludeGroupId(TestUnpackDependenciesMojo.java:480)


FAILED:  org.apache.maven.plugins.dependency.fromDependencies.TestUnpackDependenciesMojo.testCDMClassifierType

Error Message:
org/codehaus/plexus/components/io/attributes/AttributeUtils

Stack Trace:
java.lang.NoClassDefFoundError: org/codehaus/plexus/components/io/attributes/AttributeUtils
	at org.apache.maven.plugins.dependency.fromDependencies.TestUnpackDependenciesMojo.dotestClassifierType(TestUnpackDependenciesMojo.java:552)
	at org.apache.maven.plugins.dependency.fromDependencies.TestUnpackDependenciesMojo.testCDMClassifierType(TestUnpackDependenciesMojo.java:535)


FAILED:  org.apache.maven.plugins.dependency.fromDependencies.TestUnpackDependenciesMojo.testExcludeSystemScope

Error Message:
org/codehaus/plexus/components/io/attributes/AttributeUtils

Stack Trace:
java.lang.NoClassDefFoundError: org/codehaus/plexus/components/io/attributes/AttributeUtils
	at org.apache.maven.plugins.dependency.fromDependencies.TestUnpackDependenciesMojo.testExcludeSystemScope(TestUnpackDependenciesMojo.java:193)


FAILED:  org.apache.maven.plugins.dependency.fromDependencies.TestUnpackDependenciesMojo.testIncludeGroupId

Error Message:
org/codehaus/plexus/components/io/attributes/AttributeUtils

Stack Trace:
java.lang.NoClassDefFoundError: org/codehaus/plexus/components/io/attributes/AttributeUtils
	at org.apache.maven.plugins.dependency.fromDependencies.TestUnpackDependenciesMojo.testIncludeGroupId(TestUnpackDependenciesMojo.java:508)


FAILED:  org.apache.maven.plugins.dependency.fromDependencies.TestUnpackDependenciesMojo.testIncludeRuntimeScope

Error Message:
org/codehaus/plexus/components/io/attributes/AttributeUtils

Stack Trace:
java.lang.NoClassDefFoundError: org/codehaus/plexus/components/io/attributes/AttributeUtils
	at org.apache.maven.plugins.dependency.fromDependencies.TestUnpackDependenciesMojo.testIncludeRuntimeScope(TestUnpackDependenciesMojo.java:390)


FAILED:  org.apache.maven.plugins.dependency.fromDependencies.TestUnpackDependenciesMojo.testExcludeCompileScope

Error Message:
org/codehaus/plexus/components/io/attributes/AttributeUtils

Stack Trace:
java.lang.NoClassDefFoundError: org/codehaus/plexus/components/io/attributes/AttributeUtils
	at org.apache.maven.plugins.dependency.fromDependencies.TestUnpackDependenciesMojo.testExcludeCompileScope(TestUnpackDependenciesMojo.java:208)


FAILED:  org.apache.maven.plugins.dependency.fromDependencies.TestUnpackDependenciesMojo.testMojo

Error Message:
org/codehaus/plexus/components/io/attributes/AttributeUtils

Stack Trace:
java.lang.NoClassDefFoundError: org/codehaus/plexus/components/io/attributes/AttributeUtils
	at org.apache.maven.plugins.dependency.fromDependencies.TestUnpackDependenciesMojo.testMojo(TestUnpackDependenciesMojo.java:136)


FAILED:  org.apache.maven.plugins.dependency.fromDependencies.TestUnpackDependenciesMojo.testSubPerArtifact

Error Message:
org/codehaus/plexus/components/io/attributes/AttributeUtils

Stack Trace:
java.lang.NoClassDefFoundError: org/codehaus/plexus/components/io/attributes/AttributeUtils
	at org.apache.maven.plugins.dependency.fromDependencies.TestUnpackDependenciesMojo.testSubPerArtifact(TestUnpackDependenciesMojo.java:301)


FAILED:  org.apache.maven.plugins.dependency.fromDependencies.TestUnpackDependenciesMojo.testSubPerArtifactRemoveVersion

Error Message:
org/codehaus/plexus/components/io/attributes/AttributeUtils

Stack Trace:
java.lang.NoClassDefFoundError: org/codehaus/plexus/components/io/attributes/AttributeUtils
	at org.apache.maven.plugins.dependency.fromDependencies.TestUnpackDependenciesMojo.testSubPerArtifactRemoveVersion(TestUnpackDependenciesMojo.java:329)


FAILED:  org.apache.maven.plugins.dependency.fromDependencies.TestUnpackDependenciesMojo.testIncludeArtifactId

Error Message:
org/codehaus/plexus/components/io/attributes/AttributeUtils

Stack Trace:
java.lang.NoClassDefFoundError: org/codehaus/plexus/components/io/attributes/AttributeUtils
	at org.apache.maven.plugins.dependency.fromDependencies.TestUnpackDependenciesMojo.testIncludeArtifactId(TestUnpackDependenciesMojo.java:446)


FAILED:  org.apache.maven.plugins.dependency.fromDependencies.TestUnpackDependenciesMojo.testCDMType

Error Message:
org/codehaus/plexus/components/io/attributes/AttributeUtils

Stack Trace:
java.lang.NoClassDefFoundError: org/codehaus/plexus/components/io/attributes/AttributeUtils
	at org.apache.maven.plugins.dependency.fromDependencies.TestUnpackDependenciesMojo.dotestClassifierType(TestUnpackDependenciesMojo.java:552)
	at org.apache.maven.plugins.dependency.fromDependencies.TestUnpackDependenciesMojo.testCDMType(TestUnpackDependenciesMojo.java:529)


FAILED:  org.apache.maven.plugins.dependency.fromDependencies.TestUnpackDependenciesMojo.testExcludeProvidedScope

Error Message:
org/codehaus/plexus/components/io/attributes/AttributeUtils

Stack Trace:
java.lang.NoClassDefFoundError: org/codehaus/plexus/components/io/attributes/AttributeUtils
	at org.apache.maven.plugins.dependency.fromDependencies.TestUnpackDependenciesMojo.testExcludeProvidedScope(TestUnpackDependenciesMojo.java:176)


FAILED:  org.apache.maven.plugins.dependency.fromDependencies.TestUnpackDependenciesMojo.testCDMClassifier

Error Message:
org/codehaus/plexus/components/io/attributes/AttributeUtils

Stack Trace:
java.lang.NoClassDefFoundError: org/codehaus/plexus/components/io/attributes/AttributeUtils
	at org.apache.maven.plugins.dependency.fromDependencies.TestUnpackDependenciesMojo.dotestClassifierType(TestUnpackDependenciesMojo.java:552)
	at org.apache.maven.plugins.dependency.fromDependencies.TestUnpackDependenciesMojo.testCDMClassifier(TestUnpackDependenciesMojo.java:523)


FAILED:  org.apache.maven.plugins.dependency.fromDependencies.TestUnpackDependenciesMojo.testIncludeType

Error Message:
org/codehaus/plexus/components/io/attributes/AttributeUtils

Stack Trace:
java.lang.NoClassDefFoundError: org/codehaus/plexus/components/io/attributes/AttributeUtils
	at org.apache.maven.plugins.dependency.fromDependencies.TestUnpackDependenciesMojo.testIncludeType(TestUnpackDependenciesMojo.java:272)


FAILED:  org.apache.maven.plugins.dependency.fromDependencies.TestUnpackDependenciesMojo.testSubPerArtifactAndType

Error Message:
org/codehaus/plexus/components/io/attributes/AttributeUtils

Stack Trace:
java.lang.NoClassDefFoundError: org/codehaus/plexus/components/io/attributes/AttributeUtils
	at org.apache.maven.plugins.dependency.fromDependencies.TestUnpackDependenciesMojo.testSubPerArtifactAndType(TestUnpackDependenciesMojo.java:316)


FAILED:  org.apache.maven.plugins.dependency.fromDependencies.TestUnpackDependenciesMojo.testIncludesystemScope

Error Message:
org/codehaus/plexus/components/io/attributes/AttributeUtils

Stack Trace:
java.lang.NoClassDefFoundError: org/codehaus/plexus/components/io/attributes/AttributeUtils
	at org.apache.maven.plugins.dependency.fromDependencies.TestUnpackDependenciesMojo.testIncludesystemScope(TestUnpackDependenciesMojo.java:420)


FAILED:  org.apache.maven.plugins.dependency.fromDependencies.TestUnpackDependenciesMojo.testIncludeTestScope

Error Message:
org/codehaus/plexus/components/io/attributes/AttributeUtils

Stack Trace:
java.lang.NoClassDefFoundError: org/codehaus/plexus/components/io/attributes/AttributeUtils
	at org.apache.maven.plugins.dependency.fromDependencies.TestUnpackDependenciesMojo.testIncludeTestScope(TestUnpackDependenciesMojo.java:375)


FAILED:  org.apache.maven.plugins.dependency.fromDependencies.TestUnpackDependenciesMojo.testExcludeRuntimeScope

Error Message:
org/codehaus/plexus/components/io/attributes/AttributeUtils

Stack Trace:
java.lang.NoClassDefFoundError: org/codehaus/plexus/components/io/attributes/AttributeUtils
	at org.apache.maven.plugins.dependency.fromDependencies.TestUnpackDependenciesMojo.testExcludeRuntimeScope(TestUnpackDependenciesMojo.java:242)


FAILED:  org.apache.maven.plugins.dependency.fromDependencies.TestUnpackDependenciesMojo.testExcludeType

Error Message:
org/codehaus/plexus/components/io/attributes/AttributeUtils

Stack Trace:
java.lang.NoClassDefFoundError: org/codehaus/plexus/components/io/attributes/AttributeUtils
	at org.apache.maven.plugins.dependency.fromDependencies.TestUnpackDependenciesMojo.testExcludeType(TestUnpackDependenciesMojo.java:160)


FAILED:  org.apache.maven.plugins.dependency.fromDependencies.TestUnpackDependenciesMojo.testNoTransitive

Error Message:
org/codehaus/plexus/components/io/attributes/AttributeUtils

Stack Trace:
java.lang.NoClassDefFoundError: org/codehaus/plexus/components/io/attributes/AttributeUtils
	at org.apache.maven.plugins.dependency.fromDependencies.TestUnpackDependenciesMojo.testNoTransitive(TestUnpackDependenciesMojo.java:147)


FAILED:  org.apache.maven.plugins.dependency.fromDependencies.TestUnpackDependenciesMojo.testIncludeCompileScope

Error Message:
org/codehaus/plexus/components/io/attributes/AttributeUtils

Stack Trace:
java.lang.NoClassDefFoundError: org/codehaus/plexus/components/io/attributes/AttributeUtils
	at org.apache.maven.plugins.dependency.fromDependencies.TestUnpackDependenciesMojo.testIncludeCompileScope(TestUnpackDependenciesMojo.java:359)


FAILED:  org.apache.maven.plugins.dependency.fromDependencies.TestUnpackDependenciesMojo.testIncludeprovidedScope

Error Message:
org/codehaus/plexus/components/io/attributes/AttributeUtils

Stack Trace:
java.lang.NoClassDefFoundError: org/codehaus/plexus/components/io/attributes/AttributeUtils
	at org.apache.maven.plugins.dependency.fromDependencies.TestUnpackDependenciesMojo.testIncludeprovidedScope(TestUnpackDependenciesMojo.java:406)


FAILED:  org.apache.maven.plugins.dependency.fromDependencies.TestUnpackDependenciesMojo.testSubPerType

Error Message:
org/codehaus/plexus/components/io/attributes/AttributeUtils

Stack Trace:
java.lang.NoClassDefFoundError: org/codehaus/plexus/components/io/attributes/AttributeUtils
	at org.apache.maven.plugins.dependency.fromDependencies.TestUnpackDependenciesMojo.testSubPerType(TestUnpackDependenciesMojo.java:289)


FAILED:  org.apache.maven.plugins.dependency.fromDependencies.TestUnpackDependenciesMojo.testSubPerArtifactAndTypeRemoveVersion

Error Message:
org/codehaus/plexus/components/io/attributes/AttributeUtils

Stack Trace:
java.lang.NoClassDefFoundError: org/codehaus/plexus/components/io/attributes/AttributeUtils
	at org.apache.maven.plugins.dependency.fromDependencies.TestUnpackDependenciesMojo.testSubPerArtifactAndTypeRemoveVersion(TestUnpackDependenciesMojo.java:345)


FAILED:  org.apache.maven.plugins.dependency.fromDependencies.TestUnpackDependenciesMojo.testExcludeArtifactId

Error Message:
org/codehaus/plexus/components/io/attributes/AttributeUtils

Stack Trace:
java.lang.NoClassDefFoundError: org/codehaus/plexus/components/io/attributes/AttributeUtils
	at org.apache.maven.plugins.dependency.fromDependencies.TestUnpackDependenciesMojo.testExcludeArtifactId(TestUnpackDependenciesMojo.java:463)


FAILED:  org.apache.maven.plugins.dependency.fromDependencies.TestUnpackDependenciesMojo.testExcludeGroupId

Error Message:
org/codehaus/plexus/components/io/attributes/AttributeUtils

Stack Trace:
java.lang.NoClassDefFoundError: org/codehaus/plexus/components/io/attributes/AttributeUtils
	at org.apache.maven.plugins.dependency.fromDependencies.TestUnpackDependenciesMojo.testExcludeGroupId(TestUnpackDependenciesMojo.java:480)


FAILED:  org.apache.maven.plugins.dependency.fromDependencies.TestUnpackDependenciesMojo.testCDMClassifierType

Error Message:
org/codehaus/plexus/components/io/attributes/AttributeUtils

Stack Trace:
java.lang.NoClassDefFoundError: org/codehaus/plexus/components/io/attributes/AttributeUtils
	at org.apache.maven.plugins.dependency.fromDependencies.TestUnpackDependenciesMojo.dotestClassifierType(TestUnpackDependenciesMojo.java:552)
	at org.apache.maven.plugins.dependency.fromDependencies.TestUnpackDependenciesMojo.testCDMClassifierType(TestUnpackDependenciesMojo.java:535)


FAILED:  org.apache.maven.plugins.dependency.fromDependencies.TestUnpackDependenciesMojo2.testDontOverWriteSnap

Error Message:
org/codehaus/plexus/components/io/attributes/AttributeUtils

Stack Trace:
java.lang.NoClassDefFoundError: org/codehaus/plexus/components/io/attributes/AttributeUtils
	at org.apache.maven.plugins.dependency.fromDependencies.TestUnpackDependenciesMojo2.testDontOverWriteSnap(TestUnpackDependenciesMojo2.java:157)


FAILED:  org.apache.maven.plugins.dependency.fromDependencies.TestUnpackDependenciesMojo2.testDontOverWriteRelease

Error Message:
org/codehaus/plexus/components/io/attributes/AttributeUtils

Stack Trace:
java.lang.NoClassDefFoundError: org/codehaus/plexus/components/io/attributes/AttributeUtils
	at org.apache.maven.plugins.dependency.fromDependencies.TestUnpackDependenciesMojo2.testDontOverWriteRelease(TestUnpackDependenciesMojo2.java:114)


FAILED:  org.apache.maven.plugins.dependency.fromDependencies.TestUnpackDependenciesMojo2.testOverWriteSnap

Error Message:
org/codehaus/plexus/components/io/attributes/AttributeUtils

Stack Trace:
java.lang.NoClassDefFoundError: org/codehaus/plexus/components/io/attributes/AttributeUtils
	at org.apache.maven.plugins.dependency.fromDependencies.TestUnpackDependenciesMojo2.testOverWriteSnap(TestUnpackDependenciesMojo2.java:179)


FAILED:  org.apache.maven.plugins.dependency.fromDependencies.TestUnpackDependenciesMojo2.testOverWriteRelease

Error Message:
org/codehaus/plexus/components/io/attributes/AttributeUtils

Stack Trace:
java.lang.NoClassDefFoundError: org/codehaus/plexus/components/io/attributes/AttributeUtils
	at org.apache.maven.plugins.dependency.fromDependencies.TestUnpackDependenciesMojo2.testOverWriteRelease(TestUnpackDependenciesMojo2.java:135)


FAILED:  org.apache.maven.plugins.dependency.fromDependencies.TestUnpackDependenciesMojo2.testOverWriteIfNewer

Error Message:
org/codehaus/plexus/components/io/attributes/AttributeUtils

Stack Trace:
java.lang.NoClassDefFoundError: org/codehaus/plexus/components/io/attributes/AttributeUtils
	at org.apache.maven.plugins.dependency.fromDependencies.TestUnpackDependenciesMojo2.testOverWriteIfNewer(TestUnpackDependenciesMojo2.java:202)


FAILED:  org.apache.maven.plugins.dependency.fromDependencies.TestUnpackDependenciesMojo2.testDontOverWriteSnap

Error Message:
org/codehaus/plexus/components/io/attributes/AttributeUtils

Stack Trace:
java.lang.NoClassDefFoundError: org/codehaus/plexus/components/io/attributes/AttributeUtils
	at org.apache.maven.plugins.dependency.fromDependencies.TestUnpackDependenciesMojo2.testDontOverWriteSnap(TestUnpackDependenciesMojo2.java:157)


FAILED:  org.apache.maven.plugins.dependency.fromDependencies.TestUnpackDependenciesMojo2.testDontOverWriteRelease

Error Message:
org/codehaus/plexus/components/io/attributes/AttributeUtils

Stack Trace:
java.lang.NoClassDefFoundError: org/codehaus/plexus/components/io/attributes/AttributeUtils
	at org.apache.maven.plugins.dependency.fromDependencies.TestUnpackDependenciesMojo2.testDontOverWriteRelease(TestUnpackDependenciesMojo2.java:114)


FAILED:  org.apache.maven.plugins.dependency.fromDependencies.TestUnpackDependenciesMojo2.testOverWriteSnap

Error Message:
org/codehaus/plexus/components/io/attributes/AttributeUtils

Stack Trace:
java.lang.NoClassDefFoundError: org/codehaus/plexus/components/io/attributes/AttributeUtils
	at org.apache.maven.plugins.dependency.fromDependencies.TestUnpackDependenciesMojo2.testOverWriteSnap(TestUnpackDependenciesMojo2.java:179)


FAILED:  org.apache.maven.plugins.dependency.fromDependencies.TestUnpackDependenciesMojo2.testOverWriteRelease

Error Message:
org/codehaus/plexus/components/io/attributes/AttributeUtils

Stack Trace:
java.lang.NoClassDefFoundError: org/codehaus/plexus/components/io/attributes/AttributeUtils
	at org.apache.maven.plugins.dependency.fromDependencies.TestUnpackDependenciesMojo2.testOverWriteRelease(TestUnpackDependenciesMojo2.java:135)


FAILED:  org.apache.maven.plugins.dependency.fromDependencies.TestUnpackDependenciesMojo2.testOverWriteIfNewer

Error Message:
org/codehaus/plexus/components/io/attributes/AttributeUtils

Stack Trace:
java.lang.NoClassDefFoundError: org/codehaus/plexus/components/io/attributes/AttributeUtils
	at org.apache.maven.plugins.dependency.fromDependencies.TestUnpackDependenciesMojo2.testOverWriteIfNewer(TestUnpackDependenciesMojo2.java:202)


FAILED:  org.apache.maven.plugins.dependency.fromDependencies.TestUnpackDependenciesMojo2.testDontOverWriteSnap

Error Message:
org/codehaus/plexus/components/io/attributes/AttributeUtils

Stack Trace:
java.lang.NoClassDefFoundError: org/codehaus/plexus/components/io/attributes/AttributeUtils
	at org.apache.maven.plugins.dependency.fromDependencies.TestUnpackDependenciesMojo2.testDontOverWriteSnap(TestUnpackDependenciesMojo2.java:157)


FAILED:  org.apache.maven.plugins.dependency.fromDependencies.TestUnpackDependenciesMojo2.testDontOverWriteRelease

Error Message:
org/codehaus/plexus/components/io/attributes/AttributeUtils

Stack Trace:
java.lang.NoClassDefFoundError: org/codehaus/plexus/components/io/attributes/AttributeUtils
	at org.apache.maven.plugins.dependency.fromDependencies.TestUnpackDependenciesMojo2.testDontOverWriteRelease(TestUnpackDependenciesMojo2.java:114)


FAILED:  org.apache.maven.plugins.dependency.fromDependencies.TestUnpackDependenciesMojo2.testOverWriteSnap

Error Message:
org/codehaus/plexus/components/io/attributes/AttributeUtils

Stack Trace:
java.lang.NoClassDefFoundError: org/codehaus/plexus/components/io/attributes/AttributeUtils
	at org.apache.maven.plugins.dependency.fromDependencies.TestUnpackDependenciesMojo2.testOverWriteSnap(TestUnpackDependenciesMojo2.java:179)


FAILED:  org.apache.maven.plugins.dependency.fromDependencies.TestUnpackDependenciesMojo2.testOverWriteRelease

Error Message:
org/codehaus/plexus/components/io/attributes/AttributeUtils

Stack Trace:
java.lang.NoClassDefFoundError: org/codehaus/plexus/components/io/attributes/AttributeUtils
	at org.apache.maven.plugins.dependency.fromDependencies.TestUnpackDependenciesMojo2.testOverWriteRelease(TestUnpackDependenciesMojo2.java:135)


FAILED:  org.apache.maven.plugins.dependency.fromDependencies.TestUnpackDependenciesMojo2.testOverWriteIfNewer

Error Message:
org/codehaus/plexus/components/io/attributes/AttributeUtils

Stack Trace:
java.lang.NoClassDefFoundError: org/codehaus/plexus/components/io/attributes/AttributeUtils
	at org.apache.maven.plugins.dependency.fromDependencies.TestUnpackDependenciesMojo2.testOverWriteIfNewer(TestUnpackDependenciesMojo2.java:202)


FAILED:  org.apache.maven.plugins.dependency.fromDependencies.TestUnpackDependenciesMojo2.testDontOverWriteSnap

Error Message:
org/codehaus/plexus/components/io/attributes/AttributeUtils

Stack Trace:
java.lang.NoClassDefFoundError: org/codehaus/plexus/components/io/attributes/AttributeUtils
	at org.apache.maven.plugins.dependency.fromDependencies.TestUnpackDependenciesMojo2.testDontOverWriteSnap(TestUnpackDependenciesMojo2.java:157)


FAILED:  org.apache.maven.plugins.dependency.fromDependencies.TestUnpackDependenciesMojo2.testDontOverWriteRelease

Error Message:
org/codehaus/plexus/components/io/attributes/AttributeUtils

Stack Trace:
java.lang.NoClassDefFoundError: org/codehaus/plexus/components/io/attributes/AttributeUtils
	at org.apache.maven.plugins.dependency.fromDependencies.TestUnpackDependenciesMojo2.testDontOverWriteRelease(TestUnpackDependenciesMojo2.java:114)


FAILED:  org.apache.maven.plugins.dependency.fromDependencies.TestUnpackDependenciesMojo2.testOverWriteSnap

Error Message:
org/codehaus/plexus/components/io/attributes/AttributeUtils

Stack Trace:
java.lang.NoClassDefFoundError: org/codehaus/plexus/components/io/attributes/AttributeUtils
	at org.apache.maven.plugins.dependency.fromDependencies.TestUnpackDependenciesMojo2.testOverWriteSnap(TestUnpackDependenciesMojo2.java:179)


FAILED:  org.apache.maven.plugins.dependency.fromDependencies.TestUnpackDependenciesMojo2.testOverWriteRelease

Error Message:
org/codehaus/plexus/components/io/attributes/AttributeUtils

Stack Trace:
java.lang.NoClassDefFoundError: org/codehaus/plexus/components/io/attributes/AttributeUtils
	at org.apache.maven.plugins.dependency.fromDependencies.TestUnpackDependenciesMojo2.testOverWriteRelease(TestUnpackDependenciesMojo2.java:135)


FAILED:  org.apache.maven.plugins.dependency.fromDependencies.TestUnpackDependenciesMojo2.testOverWriteIfNewer

Error Message:
org/codehaus/plexus/components/io/attributes/AttributeUtils

Stack Trace:
java.lang.NoClassDefFoundError: org/codehaus/plexus/components/io/attributes/AttributeUtils
	at org.apache.maven.plugins.dependency.fromDependencies.TestUnpackDependenciesMojo2.testOverWriteIfNewer(TestUnpackDependenciesMojo2.java:202)




Build log:
[...truncated 3.05 MB...]
[linux-jdk10] [INFO] -------------------------------------------------
[linux-jdk10] [WARNING] Ignoring that 5 builds failed.
[linux-jdk10] [INFO] ------------------------------------------------------------------------
[linux-jdk10] [INFO] BUILD SUCCESS
[linux-jdk10] [INFO] ------------------------------------------------------------------------
[linux-jdk10] [INFO] Total time: 21:15 min
[linux-jdk10] [INFO] Finished at: 2018-04-02T12:14:38Z
[linux-jdk10] [INFO] Final Memory: 55M/256M
[linux-jdk10] [INFO] ------------------------------------------------------------------------
[linux-jdk10] [INFO] [jenkins-event-spy] Generated /home/jenkins/jenkins-slave/workspace/-dependency-plugin_MDEP-585-ZYJ3WNTCVYS2XKKAECKVZ37BO2TSSUOSTBCDSOQFNFUAUPM4NLFQ@2@tmp/withMavenbb151088/maven-spy-20180402-115323-28416556949401673641128.log
[Pipeline] [linux-jdk10] }
[Pipeline] [linux-jdk10] // dir
[linux-jdk9] [INFO] run post-build script verify.bsh
[linux-jdk9] [INFO]           unpack-cli/pom.xml ............................... FAILED (5.0 s)
[linux-jdk9] [INFO]   The build exited with code 1. See /home/jenkins/jenkins-slave/workspace/-dependency-plugin_MDEP-585-ZYJ3WNTCVYS2XKKAECKVZ37BO2TSSUOSTBCDSOQFNFUAUPM4NLFQ/m/target/it/unpack-cli/build.log for details.
[linux-jdk9] [INFO] Building: mdep-578_display-reason-invalid-module/pom.xml
[Pipeline] [linux-jdk10] }
[linux-jdk10] [withMaven] junitPublisher - Archive test results for Maven artifact org.apache.maven.plugins:maven-dependency-plugin:3.1.0-SNAPSHOT generated by maven-surefire-plugin:test (default-test): m/target/surefire-reports/*.xml
[linux-jdk10] [withMaven] junitPublisher - Jenkins JUnit Attachments Plugin not found, can't publish test attachments.Recording test results
[Pipeline] [linux-jdk10] // withMaven
[Pipeline] [linux-jdk10] }
[Pipeline] [linux-jdk10] // stage
[Pipeline] [linux-jdk10] }
[Pipeline] [linux-jdk10] // node
[Pipeline] [linux-jdk10] }
[linux-jdk7] [INFO] artifact classworlds.classworlds:1.1-alpha-2: checking for updates from central
[linux-jdk7] [INFO] classworlds.classworlds.1.1-alpha-2: checking for updates from central
[linux-jdk7] [INFO]           sources/pom.xml .................................. SUCCESS (5.5 s)
[linux-jdk7] [INFO] Building: copy-and-unpack-with-alternate-local-repo/pom.xml
[linux-jdk9] [INFO] run post-build script verify.groovy
[linux-jdk9] [INFO]           mdep-578_display-reason-invalid-module/pom.xml ... SUCCESS (5.1 s)
[linux-jdk9] [INFO] Building: resolve-plugins-with-exclude/pom.xml
[linux-jdk7] [INFO] run post-build script verify.bsh
[linux-jdk7] [INFO]           copy-and-unpack-with-alternate-local-repo/pom.xml  SUCCESS (6.2 s)
[linux-jdk7] [INFO] Building: mdep-571-resolve-java9/pom.xml
[linux-jdk7] [INFO]           mdep-571-resolve-java9/pom.xml ................... SKIPPED due to JRE version
[linux-jdk7] [INFO] Building: analyze-ignore-dependency/pom.xml
[linux-jdk9] [INFO] run post-build script verify.groovy
[linux-jdk9] [INFO]           resolve-plugins-with-exclude/pom.xml ............. SUCCESS (5.4 s)
[linux-jdk9] [INFO] Building: mdep-506-dependency-without-version-in-depmgt/pom.xml
[linux-jdk7] [INFO]           analyze-ignore-dependency/pom.xml ................ SUCCESS (6.2 s)
[linux-jdk7] [INFO] Building: get-artifact-maven-plugin/pom.xml
[linux-jdk7] [INFO] run pre-build script setup.bsh
[linux-jdk9] [INFO]           mdep-506-dependency-without-version-in-depmgt/pom.xml SUCCESS (6.0 s)
[linux-jdk9] [INFO] Building: purge-local-repository-without-pom
[linux-jdk9] [INFO] run pre-build script setup.bsh
[linux-jdk7] [INFO] run post-build script verify.bsh
[linux-jdk7] [INFO]           get-artifact-maven-plugin/pom.xml ................ SUCCESS (5.0 s)
[linux-jdk7] [INFO] Building: purge-local-repository-without-pom
[linux-jdk7] [INFO] run pre-build script setup.bsh
[linux-jdk9] [INFO] run post-build script verify.bsh
[linux-jdk9] [INFO]           purge-local-repository-without-pom ............... SUCCESS (4.7 s)
[linux-jdk9] [INFO] 
[linux-jdk9] [INFO] --- mrm-maven-plugin:1.0.0:stop (default) @ maven-dependency-plugin ---
[linux-jdk9] [INFO] Stopping Mock Repository Manager on http://localhost:43721
[linux-jdk9] [INFO] Mock Repository Manager http://localhost:43721 is stopped.
[linux-jdk9] [INFO] 
[linux-jdk9] [INFO] --- maven-checkstyle-plugin:3.0.0:check (checkstyle-check) @ maven-dependency-plugin ---
[linux-jdk9] [INFO] Downloading from central: https://repo.maven.apache.org/maven2/org/apache/maven/shared/maven-shared-resources/2/maven-shared-resources-2.pom
[linux-jdk9] [INFO] Downloaded from central: https://repo.maven.apache.org/maven2/org/apache/maven/shared/maven-shared-resources/2/maven-shared-resources-2.pom (3.0 kB at 174 kB/s)
[linux-jdk9] [INFO] Downloading from central: https://repo.maven.apache.org/maven2/org/apache/maven/doxia/doxia-integration-tools/1.6/doxia-integration-tools-1.6.pom
[linux-jdk9] [INFO] Downloaded from central: https://repo.maven.apache.org/maven2/org/apache/maven/doxia/doxia-integration-tools/1.6/doxia-integration-tools-1.6.pom (7.0 kB at 632 kB/s)
[linux-jdk9] [INFO] Downloading from central: https://repo.maven.apache.org/maven2/org/apache/maven/doxia/doxia-tools/3/doxia-tools-3.pom
[linux-jdk9] [INFO] Downloaded from central: https://repo.maven.apache.org/maven2/org/apache/maven/doxia/doxia-tools/3/doxia-tools-3.pom (9.9 kB at 827 kB/s)
[linux-jdk9] [INFO] Downloading from central: https://repo.maven.apache.org/maven2/org/codehaus/plexus/plexus-resources/1.1.0/plexus-resources-1.1.0.pom
[linux-jdk9] [INFO] Downloaded from central: https://repo.maven.apache.org/maven2/org/codehaus/plexus/plexus-resources/1.1.0/plexus-resources-1.1.0.pom (3.2 kB at 187 kB/s)
[linux-jdk9] [INFO] Downloading from central: https://repo.maven.apache.org/maven2/com/puppycrawl/tools/checkstyle/6.18/checkstyle-6.18.pom
[linux-jdk9] [INFO] Downloaded from central: https://repo.maven.apache.org/maven2/com/puppycrawl/tools/checkstyle/6.18/checkstyle-6.18.pom (71 kB at 4.4 MB/s)
[linux-jdk9] [INFO] Downloading from central: https://repo.maven.apache.org/maven2/antlr/antlr/2.7.7/antlr-2.7.7.pom
[linux-jdk9] [INFO] Downloaded from central: https://repo.maven.apache.org/maven2/antlr/antlr/2.7.7/antlr-2.7.7.pom (632 B at 57 kB/s)
[linux-jdk9] [INFO] Downloading from central: https://repo.maven.apache.org/maven2/org/antlr/antlr4-runtime/4.5.3/antlr4-runtime-4.5.3.pom
[linux-jdk9] [INFO] Downloaded from central: https://repo.maven.apache.org/maven2/org/antlr/antlr4-runtime/4.5.3/antlr4-runtime-4.5.3.pom (2.3 kB at 231 kB/s)
[linux-jdk9] [INFO] Downloading from central: https://repo.maven.apache.org/maven2/org/antlr/antlr4-master/4.5.3/antlr4-master-4.5.3.pom
[linux-jdk9] [INFO] Downloaded from central: https://repo.maven.apache.org/maven2/org/antlr/antlr4-master/4.5.3/antlr4-master-4.5.3.pom (3.7 kB at 335 kB/s)
[linux-jdk9] [INFO] Downloading from central: https://repo.maven.apache.org/maven2/commons-beanutils/commons-beanutils/1.9.2/commons-beanutils-1.9.2.pom
[linux-jdk9] [INFO] Downloaded from central: https://repo.maven.apache.org/maven2/commons-beanutils/commons-beanutils/1.9.2/commons-beanutils-1.9.2.pom (14 kB at 1.2 MB/s)
[linux-jdk9] [INFO] Downloading from central: https://repo.maven.apache.org/maven2/commons-cli/commons-cli/1.3.1/commons-cli-1.3.1.pom
[linux-jdk9] [INFO] Downloaded from central: https://repo.maven.apache.org/maven2/commons-cli/commons-cli/1.3.1/commons-cli-1.3.1.pom (10 kB at 945 kB/s)
[linux-jdk9] [INFO] Downloading from central: https://repo.maven.apache.org/maven2/com/google/guava/guava/19.0/guava-19.0.pom
[linux-jdk9] [INFO] Downloaded from central: https://repo.maven.apache.org/maven2/com/google/guava/guava/19.0/guava-19.0.pom (6.8 kB at 617 kB/s)
[linux-jdk9] [INFO] Downloading from central: https://repo.maven.apache.org/maven2/com/google/guava/guava-parent/19.0/guava-parent-19.0.pom
[linux-jdk9] [INFO] Downloaded from central: https://repo.maven.apache.org/maven2/com/google/guava/guava-parent/19.0/guava-parent-19.0.pom (9.9 kB at 898 kB/s)
[linux-jdk9] [INFO] Downloading from central: https://repo.maven.apache.org/maven2/org/sonatype/oss/oss-parent/7/oss-parent-7.pom
[linux-jdk9] [INFO] Downloaded from central: https://repo.maven.apache.org/maven2/org/sonatype/oss/oss-parent/7/oss-parent-7.pom (4.8 kB at 402 kB/s)
[linux-jdk9] [INFO] Downloading from central: https://repo.maven.apache.org/maven2/javax/xml/bind/jaxb-api/2.3.0/jaxb-api-2.3.0.pom
[linux-jdk9] [INFO] Downloaded from central: https://repo.maven.apache.org/maven2/javax/xml/bind/jaxb-api/2.3.0/jaxb-api-2.3.0.pom (23 kB at 1.8 MB/s)
[linux-jdk9] [INFO] Downloading from central: https://repo.maven.apache.org/maven2/javax/xml/bind/jaxb-api-parent/2.3.0/jaxb-api-parent-2.3.0.pom
[linux-jdk9] [INFO] Downloaded from central: https://repo.maven.apache.org/maven2/javax/xml/bind/jaxb-api-parent/2.3.0/jaxb-api-parent-2.3.0.pom (5.6 kB at 470 kB/s)
[linux-jdk9] [INFO] Downloading from central: https://repo.maven.apache.org/maven2/net/java/jvnet-parent/5/jvnet-parent-5.pom
[linux-jdk9] [INFO] Downloaded from central: https://repo.maven.apache.org/maven2/net/java/jvnet-parent/5/jvnet-parent-5.pom (8.9 kB at 806 kB/s)
[linux-jdk9] [INFO] Downloading from central: https://repo.maven.apache.org/maven2/org/apache/maven/shared/maven-shared-resources/2/maven-shared-resources-2.jar
[linux-jdk9] [INFO] Downloading from central: https://repo.maven.apache.org/maven2/org/apache/maven/doxia/doxia-integration-tools/1.6/doxia-integration-tools-1.6.jar
[linux-jdk9] [INFO] Downloading from central: https://repo.maven.apache.org/maven2/org/codehaus/plexus/plexus-resources/1.1.0/plexus-resources-1.1.0.jar
[linux-jdk9] [INFO] Downloading from central: https://repo.maven.apache.org/maven2/com/puppycrawl/tools/checkstyle/6.18/checkstyle-6.18.jar
[linux-jdk9] [INFO] Downloading from central: https://repo.maven.apache.org/maven2/antlr/antlr/2.7.7/antlr-2.7.7.jar
[linux-jdk9] [INFO] Downloaded from central: https://repo.maven.apache.org/maven2/org/apache/maven/shared/maven-shared-resources/2/maven-shared-resources-2.jar (13 kB at 1.0 MB/s)
[linux-jdk9] [INFO] Downloading from central: https://repo.maven.apache.org/maven2/org/antlr/antlr4-runtime/4.5.3/antlr4-runtime-4.5.3.jar
[linux-jdk9] [INFO] Downloaded from central: https://repo.maven.apache.org/maven2/org/apache/maven/doxia/doxia-integration-tools/1.6/doxia-integration-tools-1.6.jar (45 kB at 2.8 MB/s)
[linux-jdk9] [INFO] Downloading from central: https://repo.maven.apache.org/maven2/commons-beanutils/commons-beanutils/1.9.2/commons-beanutils-1.9.2.jar
[linux-jdk9] [INFO] Downloaded from central: https://repo.maven.apache.org/maven2/org/codehaus/plexus/plexus-resources/1.1.0/plexus-resources-1.1.0.jar (23 kB at 1.4 MB/s)
[linux-jdk9] [INFO] Downloading from central: https://repo.maven.apache.org/maven2/commons-cli/commons-cli/1.3.1/commons-cli-1.3.1.jar
[linux-jdk9] [INFO] Downloaded from central: https://repo.maven.apache.org/maven2/commons-cli/commons-cli/1.3.1/commons-cli-1.3.1.jar (53 kB at 1.8 MB/s)
[linux-jdk9] [INFO] Downloading from central: https://repo.maven.apache.org/maven2/com/google/guava/guava/19.0/guava-19.0.jar
[linux-jdk9] [INFO] Downloaded from central: https://repo.maven.apache.org/maven2/commons-beanutils/commons-beanutils/1.9.2/commons-beanutils-1.9.2.jar (234 kB at 7.3 MB/s)
[linux-jdk9] [INFO] Downloading from central: https://repo.maven.apache.org/maven2/javax/xml/bind/jaxb-api/2.3.0/jaxb-api-2.3.0.jar
[linux-jdk9] [INFO] Downloaded from central: https://repo.maven.apache.org/maven2/antlr/antlr/2.7.7/antlr-2.7.7.jar (445 kB at 13 MB/s)
[linux-jdk9] [INFO] Downloaded from central: https://repo.maven.apache.org/maven2/org/antlr/antlr4-runtime/4.5.3/antlr4-runtime-4.5.3.jar (302 kB at 7.2 MB/s)
[linux-jdk9] [INFO] Downloaded from central: https://repo.maven.apache.org/maven2/javax/xml/bind/jaxb-api/2.3.0/jaxb-api-2.3.0.jar (126 kB at 2.6 MB/s)
[linux-jdk9] [INFO] Downloaded from central: https://repo.maven.apache.org/maven2/com/puppycrawl/tools/checkstyle/6.18/checkstyle-6.18.jar (1.2 MB at 15 MB/s)
[linux-jdk9] [INFO] Downloaded from central: https://repo.maven.apache.org/maven2/com/google/guava/guava/19.0/guava-19.0.jar (2.3 MB at 19 MB/s)
[linux-jdk9] [INFO] There is 1 error reported by Checkstyle 6.18 with config/maven_checks.xml ruleset.
[linux-jdk9] [INFO] Ignored 1 error, 0 violation remaining.
[linux-jdk9] [INFO] 
[linux-jdk9] [INFO] --- maven-invoker-plugin:3.0.1:verify (integration-test) @ maven-dependency-plugin ---
[linux-jdk9] [INFO] -------------------------------------------------
[linux-jdk9] [INFO] Build Summary:
[linux-jdk9] [INFO]   Passed: 52, Failed: 5, Errors: 0, Skipped: 1
[linux-jdk9] [INFO] -------------------------------------------------
[linux-jdk9] [WARNING] The following builds failed:
[linux-jdk9] [WARNING] *  filterunpack/pom.xml
[linux-jdk9] [WARNING] *  unpack-cli/pom.xml
[linux-jdk9] [WARNING] *  unpack/pom.xml
[linux-jdk9] [WARNING] *  mdep-572-unpack-tar-long-file/pom.xml
[linux-jdk9] [WARNING] *  unpack-dependencies/pom.xml
[linux-jdk9] [INFO] -------------------------------------------------
[linux-jdk9] [WARNING] Ignoring that 5 builds failed.
[linux-jdk9] [INFO] ------------------------------------------------------------------------
[linux-jdk9] [INFO] BUILD SUCCESS
[linux-jdk9] [INFO] ------------------------------------------------------------------------
[linux-jdk9] [INFO] Total time: 21:43 min
[linux-jdk9] [INFO] Finished at: 2018-04-02T12:15:05Z
[linux-jdk7] [INFO] run post-build script verify.bsh
[linux-jdk7] [INFO]           purge-local-repository-without-pom ............... SUCCESS (5.0 s)
[linux-jdk7] [INFO] 
[linux-jdk7] [INFO] --- mrm-maven-plugin:1.0.0:stop (default) @ maven-dependency-plugin ---
[linux-jdk7] [INFO] Stopping Mock Repository Manager on http://localhost:45303
[linux-jdk7] [INFO] Mock Repository Manager http://localhost:45303 is stopped.
[linux-jdk7] [INFO] 
[linux-jdk7] [INFO] --- maven-checkstyle-plugin:3.0.0:check (checkstyle-check) @ maven-dependency-plugin ---
[linux-jdk7] [INFO] Downloading from central: https://repo.maven.apache.org/maven2/org/apache/maven/shared/maven-shared-resources/2/maven-shared-resources-2.pom
[linux-jdk7] [INFO] Downloaded from central: https://repo.maven.apache.org/maven2/org/apache/maven/shared/maven-shared-resources/2/maven-shared-resources-2.pom (3.0 kB at 185 kB/s)
[linux-jdk9] [INFO] Final Memory: 57M/188M
[linux-jdk9] [INFO] ------------------------------------------------------------------------
[linux-jdk9] [INFO] [jenkins-event-spy] Generated /home/jenkins/jenkins-slave/workspace/-dependency-plugin_MDEP-585-ZYJ3WNTCVYS2XKKAECKVZ37BO2TSSUOSTBCDSOQFNFUAUPM4NLFQ@tmp/withMavenccfeb646/maven-spy-20180402-115321-7124701227392156212157.log
[Pipeline] [linux-jdk9] }
[Pipeline] [linux-jdk9] // dir
[linux-jdk7] [INFO] Downloading from central: https://repo.maven.apache.org/maven2/org/apache/maven/doxia/doxia-integration-tools/1.6/doxia-integration-tools-1.6.pom
[linux-jdk7] [INFO] Downloaded from central: https://repo.maven.apache.org/maven2/org/apache/maven/doxia/doxia-integration-tools/1.6/doxia-integration-tools-1.6.pom (7.0 kB at 348 kB/s)
[linux-jdk7] [INFO] Downloading from central: https://repo.maven.apache.org/maven2/org/apache/maven/doxia/doxia-tools/3/doxia-tools-3.pom
[linux-jdk7] [INFO] Downloaded from central: https://repo.maven.apache.org/maven2/org/apache/maven/doxia/doxia-tools/3/doxia-tools-3.pom (9.9 kB at 827 kB/s)
[linux-jdk7] [INFO] Downloading from central: https://repo.maven.apache.org/maven2/org/codehaus/plexus/plexus-resources/1.1.0/plexus-resources-1.1.0.pom
[linux-jdk7] [INFO] Downloaded from central: https://repo.maven.apache.org/maven2/org/codehaus/plexus/plexus-resources/1.1.0/plexus-resources-1.1.0.pom (3.2 kB at 265 kB/s)
[linux-jdk7] [INFO] Downloading from central: https://repo.maven.apache.org/maven2/com/puppycrawl/tools/checkstyle/6.18/checkstyle-6.18.pom
[linux-jdk7] [INFO] Downloaded from central: https://repo.maven.apache.org/maven2/com/puppycrawl/tools/checkstyle/6.18/checkstyle-6.18.pom (71 kB at 3.9 MB/s)
[linux-jdk7] [INFO] Downloading from central: https://repo.maven.apache.org/maven2/antlr/antlr/2.7.7/antlr-2.7.7.pom
[linux-jdk7] [INFO] Downloaded from central: https://repo.maven.apache.org/maven2/antlr/antlr/2.7.7/antlr-2.7.7.pom (632 B at 57 kB/s)
[linux-jdk7] [INFO] Downloading from central: https://repo.maven.apache.org/maven2/org/antlr/antlr4-runtime/4.5.3/antlr4-runtime-4.5.3.pom
[linux-jdk7] [INFO] Downloaded from central: https://repo.maven.apache.org/maven2/org/antlr/antlr4-runtime/4.5.3/antlr4-runtime-4.5.3.pom (2.3 kB at 192 kB/s)
[linux-jdk7] [INFO] Downloading from central: https://repo.maven.apache.org/maven2/org/antlr/antlr4-master/4.5.3/antlr4-master-4.5.3.pom
[linux-jdk7] [INFO] Downloaded from central: https://repo.maven.apache.org/maven2/org/antlr/antlr4-master/4.5.3/antlr4-master-4.5.3.pom (3.7 kB at 283 kB/s)
[linux-jdk7] [INFO] Downloading from central: https://repo.maven.apache.org/maven2/commons-beanutils/commons-beanutils/1.9.2/commons-beanutils-1.9.2.pom
[linux-jdk7] [INFO] Downloaded from central: https://repo.maven.apache.org/maven2/commons-beanutils/commons-beanutils/1.9.2/commons-beanutils-1.9.2.pom (14 kB at 1.2 MB/s)
[linux-jdk7] [INFO] Downloading from central: https://repo.maven.apache.org/maven2/commons-cli/commons-cli/1.3.1/commons-cli-1.3.1.pom
[linux-jdk7] [INFO] Downloaded from central: https://repo.maven.apache.org/maven2/commons-cli/commons-cli/1.3.1/commons-cli-1.3.1.pom (10 kB at 520 kB/s)
[linux-jdk7] [INFO] Downloading from central: https://repo.maven.apache.org/maven2/com/google/guava/guava/19.0/guava-19.0.pom
[linux-jdk7] [INFO] Downloaded from central: https://repo.maven.apache.org/maven2/com/google/guava/guava/19.0/guava-19.0.pom (6.8 kB at 522 kB/s)
[linux-jdk7] [INFO] Downloading from central: https://repo.maven.apache.org/maven2/com/google/guava/guava-parent/19.0/guava-parent-19.0.pom
[linux-jdk7] [INFO] Downloaded from central: https://repo.maven.apache.org/maven2/com/google/guava/guava-parent/19.0/guava-parent-19.0.pom (9.9 kB at 760 kB/s)
[linux-jdk7] [INFO] Downloading from central: https://repo.maven.apache.org/maven2/org/sonatype/oss/oss-parent/7/oss-parent-7.pom
[linux-jdk7] [INFO] Downloaded from central: https://repo.maven.apache.org/maven2/org/sonatype/oss/oss-parent/7/oss-parent-7.pom (4.8 kB at 439 kB/s)
[linux-jdk7] [INFO] Downloading from central: https://repo.maven.apache.org/maven2/org/apache/maven/shared/maven-shared-resources/2/maven-shared-resources-2.jar
[linux-jdk7] [INFO] Downloading from central: https://repo.maven.apache.org/maven2/org/apache/maven/doxia/doxia-integration-tools/1.6/doxia-integration-tools-1.6.jar
[linux-jdk7] [INFO] Downloading from central: https://repo.maven.apache.org/maven2/org/codehaus/plexus/plexus-resources/1.1.0/plexus-resources-1.1.0.jar
[linux-jdk7] [INFO] Downloading from central: https://repo.maven.apache.org/maven2/com/puppycrawl/tools/checkstyle/6.18/checkstyle-6.18.jar
[linux-jdk7] [INFO] Downloading from central: https://repo.maven.apache.org/maven2/antlr/antlr/2.7.7/antlr-2.7.7.jar
[linux-jdk7] [INFO] Downloaded from central: https://repo.maven.apache.org/maven2/org/apache/maven/shared/maven-shared-resources/2/maven-shared-resources-2.jar (13 kB at 816 kB/s)
[linux-jdk7] [INFO] Downloading from central: https://repo.maven.apache.org/maven2/org/antlr/antlr4-runtime/4.5.3/antlr4-runtime-4.5.3.jar
[linux-jdk7] [INFO] Downloaded from central: https://repo.maven.apache.org/maven2/org/apache/maven/doxia/doxia-integration-tools/1.6/doxia-integration-tools-1.6.jar (45 kB at 2.0 MB/s)
[linux-jdk7] [INFO] Downloading from central: https://repo.maven.apache.org/maven2/commons-beanutils/commons-beanutils/1.9.2/commons-beanutils-1.9.2.jar
[linux-jdk7] [INFO] Downloaded from central: https://repo.maven.apache.org/maven2/commons-beanutils/commons-beanutils/1.9.2/commons-beanutils-1.9.2.jar (234 kB at 5.2 MB/s)
[linux-jdk7] [INFO] Downloading from central: https://repo.maven.apache.org/maven2/commons-cli/commons-cli/1.3.1/commons-cli-1.3.1.jar
[linux-jdk7] [INFO] Downloaded from central: https://repo.maven.apache.org/maven2/org/antlr/antlr4-runtime/4.5.3/antlr4-runtime-4.5.3.jar (302 kB at 6.4 MB/s)
[linux-jdk7] [INFO] Downloading from central: https://repo.maven.apache.org/maven2/com/google/guava/guava/19.0/guava-19.0.jar
[linux-jdk7] [INFO] Downloaded from central: https://repo.maven.apache.org/maven2/commons-cli/commons-cli/1.3.1/commons-cli-1.3.1.jar (53 kB at 898 kB/s)
[linux-jdk7] [INFO] Downloaded from central: https://repo.maven.apache.org/maven2/org/codehaus/plexus/plexus-resources/1.1.0/plexus-resources-1.1.0.jar (23 kB at 305 kB/s)
[linux-jdk7] [INFO] Downloaded from central: https://repo.maven.apache.org/maven2/antlr/antlr/2.7.7/antlr-2.7.7.jar (445 kB at 3.8 MB/s)
[linux-jdk7] [INFO] Downloaded from central: https://repo.maven.apache.org/maven2/com/puppycrawl/tools/checkstyle/6.18/checkstyle-6.18.jar (1.2 MB at 7.6 MB/s)
[linux-jdk7] [INFO] Downloaded from central: https://repo.maven.apache.org/maven2/com/google/guava/guava/19.0/guava-19.0.jar (2.3 MB at 15 MB/s)
[Pipeline] [linux-jdk9] }
[linux-jdk9] [withMaven] junitPublisher - Archive test results for Maven artifact org.apache.maven.plugins:maven-dependency-plugin:3.1.0-SNAPSHOT generated by maven-surefire-plugin:test (default-test): m/target/surefire-reports/*.xml
[linux-jdk9] [withMaven] junitPublisher - Jenkins JUnit Attachments Plugin not found, can't publish test attachments.Recording test results
[Pipeline] [linux-jdk9] // withMaven
[linux-jdk7] [INFO] There is 1 error reported by Checkstyle 6.18 with config/maven_checks.xml ruleset.
[linux-jdk7] [INFO] Ignored 1 error, 0 violation remaining.
[linux-jdk7] [INFO] 
[linux-jdk7] [INFO] --- maven-invoker-plugin:3.0.1:verify (integration-test) @ maven-dependency-plugin ---
[linux-jdk7] [INFO] -------------------------------------------------
[linux-jdk7] [INFO] Build Summary:
[linux-jdk7] [INFO]   Passed: 47, Failed: 5, Errors: 0, Skipped: 6
[linux-jdk7] [INFO] -------------------------------------------------
[linux-jdk7] [WARNING] The following builds failed:
[linux-jdk7] [WARNING] *  mdep-572-unpack-tar-long-file/pom.xml
[linux-jdk7] [WARNING] *  unpack-dependencies/pom.xml
[linux-jdk7] [WARNING] *  unpack/pom.xml
[linux-jdk7] [WARNING] *  unpack-cli/pom.xml
[linux-jdk7] [WARNING] *  filterunpack/pom.xml
[linux-jdk7] [INFO] -------------------------------------------------
[linux-jdk7] [WARNING] Ignoring that 5 builds failed.
[linux-jdk7] [INFO] ------------------------------------------------------------------------
[linux-jdk7] [INFO] BUILD SUCCESS
[linux-jdk7] [INFO] ------------------------------------------------------------------------
[linux-jdk7] [INFO] Total time: 21:53 min
[linux-jdk7] [INFO] Finished at: 2018-04-02T12:15:09Z
[Pipeline] [linux-jdk9] }
[Pipeline] [linux-jdk9] // stage
[Pipeline] [linux-jdk9] }
[Pipeline] [linux-jdk9] // node
[Pipeline] [linux-jdk9] }
[linux-jdk7] [INFO] Final Memory: 56M/1740M
[linux-jdk7] [INFO] ------------------------------------------------------------------------
[linux-jdk7] [INFO] [jenkins-event-spy] Generated /home/jenkins/jenkins-slave/workspace/-dependency-plugin_MDEP-585-ZYJ3WNTCVYS2XKKAECKVZ37BO2TSSUOSTBCDSOQFNFUAUPM4NLFQ@tmp/withMaven44710a38/maven-spy-20180402-115315-5407124545136214103033.log
[Pipeline] [linux-jdk7] }
[Pipeline] [linux-jdk7] // dir
[Pipeline] [linux-jdk7] }
[linux-jdk7] [withMaven] artifactsPublisher - Archive artifact m/pom.xml under org/apache/maven/plugins/maven-dependency-plugin/3.1.0-SNAPSHOT/maven-dependency-plugin-3.1.0-SNAPSHOT.pom
[linux-jdk7] [withMaven] artifactsPublisher - Archive artifact m/target/maven-dependency-plugin-3.1.0-SNAPSHOT.jar under org/apache/maven/plugins/maven-dependency-plugin/3.1.0-SNAPSHOT/maven-dependency-plugin-3.1.0-SNAPSHOT.jar
[linux-jdk7] [withMaven] junitPublisher - Archive test results for Maven artifact org.apache.maven.plugins:maven-dependency-plugin:3.1.0-SNAPSHOT generated by maven-surefire-plugin:test (default-test): m/target/surefire-reports/*.xml
[linux-jdk7] [withMaven] junitPublisher - Jenkins JUnit Attachments Plugin not found, can't publish test attachments.Recording test results
[linux-jdk7] [withMaven] openTasksPublisher - Scan Tasks for Maven artifact org.apache.maven.plugins:maven-dependency-plugin:3.1.0-SNAPSHOT in source directory m/src/main/java
[linux-jdk7] [TASKS] Scanning folder '/home/jenkins/jenkins-slave/workspace/-dependency-plugin_MDEP-585-ZYJ3WNTCVYS2XKKAECKVZ37BO2TSSUOSTBCDSOQFNFUAUPM4NLFQ' for files matching the pattern 'm/src/main/java/**/*' - excludes: null
[linux-jdk7] [TASKS] Found 48 files to scan for tasks
[linux-jdk7] [TASKS] Found 4 open tasks.
[linux-jdk7] Skipping warnings blame since pipelines do not have an SCM link.%n
[linux-jdk7] [TASKS] Computing warning deltas based on reference build #4
[Pipeline] [linux-jdk7] // withMaven
[Pipeline] [linux-jdk7] }
[Pipeline] [linux-jdk7] // stage
[Pipeline] [linux-jdk7] }
[Pipeline] [linux-jdk7] // node
[Pipeline] [linux-jdk7] }
[Pipeline] // parallel
[Pipeline] stage
[Pipeline] { (Notifications)
[Pipeline] echo
Build result: UNSTABLE
[Pipeline] jiraIssueSelector
[Pipeline] jiraComment
[Pipeline] jiraComment
[Pipeline] emailext
Mime
  • Unnamed multipart/mixed (inline, None, 0 bytes)
View raw message