maven-notifications mailing list archives

Site index · List index
Message view « Date » · « Thread »
Top « Date » · « Thread »
From Apache Jenkins Server <jenk...@builds.apache.org>
Subject Build unstable in Jenkins: Maven TLP » maven-invoker » FIXBUILD_ISSUE #2
Date Fri, 11 May 2018 11:04:52 GMT
See https://builds.apache.org/job/maven-box/job/maven-invoker/job/FIXBUILD_ISSUE/2/

Changes:

* Recuded timeout value.
* Recuded timeout value.
* Recuded timeout value.
* Recuded timeout value.

8 tests failed.
FAILED:  org.apache.maven.shared.invoker.DefaultInvokerTest.testBuildShouldTimeout

Error Message:
expected:<1> but was:<-2147483648>

Stack Trace:
java.lang.AssertionError: expected:<1> but was:<-2147483648>
	at org.apache.maven.shared.invoker.DefaultInvokerTest.testBuildShouldTimeout(DefaultInvokerTest.java:118)


FAILED:  org.apache.maven.shared.invoker.DefaultInvokerTest.testBuildShouldTimeout

Error Message:
expected:<1> but was:<-2147483648>

Stack Trace:
java.lang.AssertionError: expected:<1> but was:<-2147483648>
	at org.apache.maven.shared.invoker.DefaultInvokerTest.testBuildShouldTimeout(DefaultInvokerTest.java:118)


FAILED:  org.apache.maven.shared.invoker.DefaultInvokerTest.testBuildShouldTimeout

Error Message:
expected:<1> but was:<-2147483648>

Stack Trace:
java.lang.AssertionError: expected:<1> but was:<-2147483648>
	at org.apache.maven.shared.invoker.DefaultInvokerTest.testBuildShouldTimeout(DefaultInvokerTest.java:118)


FAILED:  org.apache.maven.shared.invoker.DefaultInvokerTest.testBuildShouldTimeout

Error Message:
expected:<1> but was:<-2147483648>

Stack Trace:
java.lang.AssertionError: expected:<1> but was:<-2147483648>
	at org.apache.maven.shared.invoker.DefaultInvokerTest.testBuildShouldTimeout(DefaultInvokerTest.java:118)


FAILED:  org.apache.maven.shared.invoker.DefaultInvokerTest.testBuildShouldTimeout

Error Message:
expected:<1> but was:<-2147483648>

Stack Trace:
java.lang.AssertionError: expected:<1> but was:<-2147483648>
	at org.apache.maven.shared.invoker.DefaultInvokerTest.testBuildShouldTimeout(DefaultInvokerTest.java:118)


FAILED:  org.apache.maven.shared.invoker.DefaultInvokerTest.testBuildShouldTimeout

Error Message:
expected:<1> but was:<-2147483648>

Stack Trace:
java.lang.AssertionError: expected:<1> but was:<-2147483648>
	at org.apache.maven.shared.invoker.DefaultInvokerTest.testBuildShouldTimeout(DefaultInvokerTest.java:118)


FAILED:  org.apache.maven.shared.invoker.DefaultInvokerTest.testBuildShouldTimeout

Error Message:
expected:<1> but was:<-2147483648>

Stack Trace:
java.lang.AssertionError: expected:<1> but was:<-2147483648>
	at org.apache.maven.shared.invoker.DefaultInvokerTest.testBuildShouldTimeout(DefaultInvokerTest.java:118)


FAILED:  org.apache.maven.shared.invoker.DefaultInvokerTest.testBuildShouldTimeout

Error Message:
expected:<1> but was:<-2147483648>

Stack Trace:
java.lang.AssertionError: expected:<1> but was:<-2147483648>
	at org.apache.maven.shared.invoker.DefaultInvokerTest.testBuildShouldTimeout(DefaultInvokerTest.java:118)




Build log:
[...truncated 394.29 KB...]
[linux-jdk9] [INFO] Exclude: .maven/spy.log
[linux-jdk9] [INFO] Exclude: dependency-reduced-pom.xml
[linux-jdk9] [INFO] Exclude: .java-version
[linux-jdk9] [INFO] 43 resources included (use -debug for more details)
[linux-jdk9] [INFO] Rat check: Summary over all files. Unapproved: 0, unknown: 0, generated:
0, approved: 42 licenses.
[linux-jdk9] [INFO] 
[linux-jdk9] [INFO] --- maven-remote-resources-plugin:1.5:process (process-resource-bundles)
@ maven-invoker ---
[linux-jdk10]  > git rev-parse --verify HEAD # timeout=10
[linux-jdk10] Resetting working tree
[linux-jdk10]  > git reset --hard # timeout=10
[linux-jdk10]  > git clean -fdx # timeout=10
[linux-jdk9] [INFO] 
[linux-jdk9] [INFO] --- maven-resources-plugin:3.0.2:resources (default-resources) @ maven-invoker
---
[linux-jdk9] [INFO] Using 'UTF-8' encoding to copy filtered resources.
[linux-jdk9] [INFO] skip non existing resourceDirectory /home/jenkins/jenkins-slave/workspace/aven-invoker_FIXBUILD_ISSUE-Z4SIO7Z323RVJKLPHTBESQQLAYVNUHX7HVBRXAWQVMOXLPEJNY3Q/m/src/main/resources
[linux-jdk9] [INFO] Copying 3 resources
[linux-jdk9] [INFO] 
[linux-jdk9] [INFO] --- maven-compiler-plugin:3.7.0:compile (default-compile) @ maven-invoker
---
[linux-jdk9] [INFO] Changes detected - recompiling the module!
[linux-jdk9] [INFO] Compiling 15 source files to /home/jenkins/jenkins-slave/workspace/aven-invoker_FIXBUILD_ISSUE-Z4SIO7Z323RVJKLPHTBESQQLAYVNUHX7HVBRXAWQVMOXLPEJNY3Q/m/target/classes
[linux-jdk9] [INFO] 
[linux-jdk9] [INFO] --- plexus-component-metadata:1.7.1:generate-metadata (create-component-descriptor)
@ maven-invoker ---
[linux-jdk9] [INFO] Discovered 1 component descriptors(s)
[linux-jdk9] [INFO] 
[linux-jdk9] [INFO] --- maven-resources-plugin:3.0.2:testResources (default-testResources)
@ maven-invoker ---
[linux-jdk9] [INFO] Using 'UTF-8' encoding to copy filtered resources.
[linux-jdk9] [INFO] Copying 16 resources
[linux-jdk9] [INFO] Copying 3 resources
[linux-jdk9] [INFO] 
[linux-jdk9] [INFO] --- maven-compiler-plugin:3.7.0:testCompile (default-testCompile) @ maven-invoker
---
[linux-jdk9] [INFO] Changes detected - recompiling the module!
[linux-jdk9] [INFO] Compiling 4 source files to /home/jenkins/jenkins-slave/workspace/aven-invoker_FIXBUILD_ISSUE-Z4SIO7Z323RVJKLPHTBESQQLAYVNUHX7HVBRXAWQVMOXLPEJNY3Q/m/target/test-classes
[linux-jdk9] [INFO] 
[linux-jdk9] [INFO] --- maven-surefire-plugin:2.21.0:test (default-test) @ maven-invoker ---
[linux-jdk9] [INFO] 
[linux-jdk9] [INFO] -------------------------------------------------------
[linux-jdk9] [INFO]  T E S T S
[linux-jdk9] [INFO] -------------------------------------------------------
[linux-jdk9] [INFO] Running org.apache.maven.shared.invoker.SystemOutHandlerTest
[linux-jdk9] [INFO] Tests run: 3, Failures: 0, Errors: 0, Skipped: 0, Time elapsed: 0.047
s - in org.apache.maven.shared.invoker.SystemOutHandlerTest
[linux-jdk9] [INFO] Running org.apache.maven.shared.invoker.MavenCommandLineBuilderTest
[linux-jdk9] [INFO] Tests run: 49, Failures: 0, Errors: 0, Skipped: 0, Time elapsed: 0.117
s - in org.apache.maven.shared.invoker.MavenCommandLineBuilderTest
[linux-jdk9] [INFO] Running org.apache.maven.shared.invoker.DefaultInvokerTest
[Pipeline] [linux-jdk7] }
[linux-jdk7] [withMaven] artifactsPublisher - Archive artifact m/pom.xml under org/apache/maven/shared/maven-invoker/3.0.1-SNAPSHOT/maven-invoker-3.0.1-SNAPSHOT.pom
[linux-jdk7] [withMaven] artifactsPublisher - Archive artifact m/target/maven-invoker-3.0.1-SNAPSHOT.jar
under org/apache/maven/shared/maven-invoker/3.0.1-SNAPSHOT/maven-invoker-3.0.1-SNAPSHOT.jar
[linux-jdk7] [withMaven] junitPublisher - Archive test results for Maven artifact org.apache.maven.shared:maven-invoker:3.0.1-SNAPSHOT
generated by maven-surefire-plugin:test (default-test): m/target/surefire-reports/*.xml
[linux-jdk7] Recording test results
[linux-jdk7] [withMaven] openTasksPublisher - Scan Tasks for Maven artifact org.apache.maven.shared:maven-invoker:3.0.1-SNAPSHOT
in source directory m/src/main/java
[linux-jdk7] [TASKS] Scanning folder '/home/jenkins/jenkins-slave/workspace/aven-invoker_FIXBUILD_ISSUE-Z4SIO7Z323RVJKLPHTBESQQLAYVNUHX7HVBRXAWQVMOXLPEJNY3Q'
for files matching the pattern 'm/src/main/java/**/*' - excludes: null
[linux-jdk7] [TASKS] Found 15 files to scan for tasks
[linux-jdk7] [TASKS] Found 1 open tasks.
[linux-jdk7] Skipping warnings blame since pipelines do not have an SCM link.%n
[linux-jdk7] [TASKS] Computing warning deltas based on reference build #1
[Pipeline] [linux-jdk7] // withMaven
[Pipeline] [linux-jdk7] }
[Pipeline] [linux-jdk10] }
[Pipeline] [linux-jdk7] // stage
[Pipeline] [linux-jdk10] // dir
[Pipeline] [linux-jdk7] }
[Pipeline] [linux-jdk10] }
[Pipeline] [linux-jdk7] // node
[Pipeline] [linux-jdk10] // stage
[Pipeline] [linux-jdk7] }
[Pipeline] [linux-jdk10] stage
[Pipeline] [linux-jdk10] { (Build linux-jdk10)
[Pipeline] [linux-jdk10] withMaven
[linux-jdk10] [withMaven] Options: [org.jenkinsci.plugins.pipeline.maven.publishers.GeneratedArtifactsPublisher[disabled=true],
org.jenkinsci.plugins.pipeline.maven.publishers.JunitTestsPublisher[disabled=false], org.jenkinsci.plugins.pipeline.maven.publishers.FindbugsAnalysisPublisher[disabled=true],
org.jenkinsci.plugins.pipeline.maven.publishers.TasksScannerPublisher[disabled=true], org.jenkinsci.plugins.pipeline.maven.publishers.DependenciesFingerprintPublisher[disabled=false,
scopes=[compile, provided, runtime], versions={snapshot:true, release:false}], org.jenkinsci.plugins.pipeline.maven.publishers.InvokerRunsPublisher[disabled=false],
org.jenkinsci.plugins.pipeline.maven.publishers.PipelineGraphPublisher[disabled=false, scopes=[compile,
provided, runtime], versions={snapshot:true, release:false}, skipDownstreamTriggers=false,
lifecycleThreshold=deploy, ignoreUpstreamTriggers=false]]
[linux-jdk10] [withMaven] Available options: 
[linux-jdk10] [withMaven] using JDK installation JDK 10 (latest)
[linux-jdk10] [withMaven] using Maven installation 'Maven 3.5.2'
[Pipeline] [linux-jdk10] {
[Pipeline] [linux-jdk10] dir
[linux-jdk10] Running in /home/jenkins/jenkins-slave/workspace/aven-invoker_FIXBUILD_ISSUE-Z4SIO7Z323RVJKLPHTBESQQLAYVNUHX7HVBRXAWQVMOXLPEJNY3Q/m
[Pipeline] [linux-jdk10] {
[Pipeline] [linux-jdk10] isUnix
[Pipeline] [linux-jdk10] sh
[linux-jdk10] [m] Running shell script
[linux-jdk10] + mvn -P+run-its -Dmaven.test.failure.ignore=true -Dfindbugs.failOnError=false
-Dfindbugs.skip=true clean verify
[linux-jdk10] ----- withMaven Wrapper script -----
[linux-jdk10] Picked up JAVA_TOOL_OPTIONS: -Dmaven.ext.class.path="/home/jenkins/jenkins-slave/workspace/aven-invoker_FIXBUILD_ISSUE-Z4SIO7Z323RVJKLPHTBESQQLAYVNUHX7HVBRXAWQVMOXLPEJNY3Q@tmp/withMavened9d138e/pipeline-maven-spy.jar"
-Dorg.jenkinsci.plugins.pipeline.maven.reportsFolder="/home/jenkins/jenkins-slave/workspace/aven-invoker_FIXBUILD_ISSUE-Z4SIO7Z323RVJKLPHTBESQQLAYVNUHX7HVBRXAWQVMOXLPEJNY3Q@tmp/withMavened9d138e"

[linux-jdk10] Apache Maven 3.5.2 (138edd61fd100ec658bfa2d307c43b76940a5d7d; 2017-10-18T07:58:13Z)
[linux-jdk10] Maven home: /home/jenkins/tools/maven/apache-maven-3.5.2
[linux-jdk10] Java version: 10.0.1, vendor: Oracle Corporation
[linux-jdk10] Java home: /usr/local/asfpackages/java/jdk-10.0.1
[linux-jdk10] Default locale: en_US, platform encoding: ISO-8859-1
[linux-jdk10] OS name: "linux", version: "4.4.0-116-generic", arch: "amd64", family: "unix"
[linux-jdk10] [INFO] [jenkins-event-spy] Generate /home/jenkins/jenkins-slave/workspace/aven-invoker_FIXBUILD_ISSUE-Z4SIO7Z323RVJKLPHTBESQQLAYVNUHX7HVBRXAWQVMOXLPEJNY3Q@tmp/withMavened9d138e/maven-spy-20180511-110417-6267064688454871240707.log.tmp
...
[linux-jdk10] [INFO] Scanning for projects...
[linux-jdk10] [INFO] 
[linux-jdk10] [INFO] ------------------------------------------------------------------------
[linux-jdk10] [INFO] Building Apache Maven Invoker 3.0.1-SNAPSHOT
[linux-jdk10] [INFO] ------------------------------------------------------------------------
[linux-jdk10] [INFO] 
[linux-jdk10] [INFO] --- maven-clean-plugin:3.0.0:clean (default-clean) @ maven-invoker ---
[linux-jdk10] [INFO] 
[linux-jdk10] [INFO] --- maven-enforcer-plugin:1.4.1:enforce (enforce-maven-version) @ maven-invoker
---
[linux-jdk10] [INFO] 
[linux-jdk10] [INFO] --- maven-enforcer-plugin:1.4.1:enforce (enforce-bytecode-version) @
maven-invoker ---
[linux-jdk10] [INFO] 
[linux-jdk10] [INFO] --- maven-enforcer-plugin:1.4.1:enforce (ban-known-bad-maven-versions)
@ maven-invoker ---
[linux-jdk10] [INFO] 
[linux-jdk10] [INFO] --- apache-rat-plugin:0.12:check (rat-check) @ maven-invoker ---
[linux-jdk10] [INFO] Enabled default license matchers.
[linux-jdk10] [INFO] Will parse SCM ignores for exclusions...
[linux-jdk10] [INFO] Parsing exclusions from /home/jenkins/jenkins-slave/workspace/aven-invoker_FIXBUILD_ISSUE-Z4SIO7Z323RVJKLPHTBESQQLAYVNUHX7HVBRXAWQVMOXLPEJNY3Q/m/.gitignore
[linux-jdk10] [INFO] Finished adding exclusions from SCM ignore files.
[linux-jdk10] [INFO] 71 implicit excludes (use -debug for more details).
[linux-jdk10] [INFO] Exclude: .repository/**
[linux-jdk10] [INFO] Exclude: .maven/spy.log
[linux-jdk10] [INFO] Exclude: dependency-reduced-pom.xml
[linux-jdk10] [INFO] Exclude: .java-version
[linux-jdk10] [INFO] 43 resources included (use -debug for more details)
[linux-jdk10] [INFO] Rat check: Summary over all files. Unapproved: 0, unknown: 0, generated:
0, approved: 42 licenses.
[linux-jdk10] [INFO] 
[linux-jdk10] [INFO] --- maven-remote-resources-plugin:1.5:process (process-resource-bundles)
@ maven-invoker ---
[linux-jdk10] [INFO] 
[linux-jdk10] [INFO] --- maven-resources-plugin:3.0.2:resources (default-resources) @ maven-invoker
---
[linux-jdk10] [INFO] Using 'UTF-8' encoding to copy filtered resources.
[linux-jdk10] [INFO] skip non existing resourceDirectory /home/jenkins/jenkins-slave/workspace/aven-invoker_FIXBUILD_ISSUE-Z4SIO7Z323RVJKLPHTBESQQLAYVNUHX7HVBRXAWQVMOXLPEJNY3Q/m/src/main/resources
[linux-jdk10] [INFO] Copying 3 resources
[linux-jdk10] [INFO] 
[linux-jdk10] [INFO] --- maven-compiler-plugin:3.7.0:compile (default-compile) @ maven-invoker
---
[linux-jdk10] [INFO] Changes detected - recompiling the module!
[linux-jdk10] [INFO] Compiling 15 source files to /home/jenkins/jenkins-slave/workspace/aven-invoker_FIXBUILD_ISSUE-Z4SIO7Z323RVJKLPHTBESQQLAYVNUHX7HVBRXAWQVMOXLPEJNY3Q/m/target/classes
[linux-jdk10] [INFO] 
[linux-jdk10] [INFO] --- plexus-component-metadata:1.7.1:generate-metadata (create-component-descriptor)
@ maven-invoker ---
[linux-jdk10] [INFO] Discovered 1 component descriptors(s)
[linux-jdk10] [INFO] 
[linux-jdk10] [INFO] --- maven-resources-plugin:3.0.2:testResources (default-testResources)
@ maven-invoker ---
[linux-jdk10] [INFO] Using 'UTF-8' encoding to copy filtered resources.
[linux-jdk10] [INFO] Copying 16 resources
[linux-jdk10] [INFO] Copying 3 resources
[linux-jdk10] [INFO] 
[linux-jdk10] [INFO] --- maven-compiler-plugin:3.7.0:testCompile (default-testCompile) @ maven-invoker
---
[linux-jdk10] [INFO] Changes detected - recompiling the module!
[linux-jdk10] [INFO] Compiling 4 source files to /home/jenkins/jenkins-slave/workspace/aven-invoker_FIXBUILD_ISSUE-Z4SIO7Z323RVJKLPHTBESQQLAYVNUHX7HVBRXAWQVMOXLPEJNY3Q/m/target/test-classes
[linux-jdk10] [INFO] 
[linux-jdk10] [INFO] --- maven-surefire-plugin:2.21.0:test (default-test) @ maven-invoker
---
[linux-jdk10] [INFO] 
[linux-jdk10] [INFO] -------------------------------------------------------
[linux-jdk10] [INFO]  T E S T S
[linux-jdk10] [INFO] -------------------------------------------------------
[linux-jdk10] [INFO] Running org.apache.maven.shared.invoker.DefaultInvokerTest
[linux-jdk9] [ERROR] Tests run: 8, Failures: 1, Errors: 0, Skipped: 0, Time elapsed: 26.581
s <<< FAILURE! - in org.apache.maven.shared.invoker.DefaultInvokerTest
[linux-jdk9] [ERROR] testBuildShouldTimeout(org.apache.maven.shared.invoker.DefaultInvokerTest)
 Time elapsed: 2.016 s  <<< FAILURE!
[linux-jdk9] java.lang.AssertionError: expected:<1> but was:<-2147483648>
[linux-jdk9] 	at org.apache.maven.shared.invoker.DefaultInvokerTest.testBuildShouldTimeout(DefaultInvokerTest.java:118)
[linux-jdk9] 
[linux-jdk9] [INFO] Running org.apache.maven.shared.invoker.SystemOutLoggerTest
[linux-jdk9] [INFO] Tests run: 31, Failures: 0, Errors: 0, Skipped: 0, Time elapsed: 0.017
s - in org.apache.maven.shared.invoker.SystemOutLoggerTest
[linux-jdk9] [INFO] 
[linux-jdk9] [INFO] Results:
[linux-jdk9] [INFO] 
[linux-jdk9] [ERROR] Failures: 
[linux-jdk9] [ERROR]   DefaultInvokerTest.testBuildShouldTimeout:118 expected:<1> but
was:<-2147483648>
[linux-jdk9] [INFO] 
[linux-jdk9] [ERROR] Tests run: 91, Failures: 1, Errors: 0, Skipped: 0
[linux-jdk9] [INFO] 
[linux-jdk9] [ERROR] There are test failures.
[linux-jdk9] 
[linux-jdk9] Please refer to /home/jenkins/jenkins-slave/workspace/aven-invoker_FIXBUILD_ISSUE-Z4SIO7Z323RVJKLPHTBESQQLAYVNUHX7HVBRXAWQVMOXLPEJNY3Q/m/target/surefire-reports
for the individual test results.
[linux-jdk9] Please refer to dump files (if any exist) [date]-jvmRun[N].dump, [date].dumpstream
and [date]-jvmRun[N].dumpstream.
[linux-jdk9] [INFO] 
[linux-jdk9] [INFO] --- maven-jar-plugin:3.0.2:jar (default-jar) @ maven-invoker ---
[linux-jdk9] [INFO] Building jar: /home/jenkins/jenkins-slave/workspace/aven-invoker_FIXBUILD_ISSUE-Z4SIO7Z323RVJKLPHTBESQQLAYVNUHX7HVBRXAWQVMOXLPEJNY3Q/m/target/maven-invoker-3.0.1-SNAPSHOT.jar
[linux-jdk9] [INFO] 
[linux-jdk9] [INFO] --- maven-site-plugin:3.7:attach-descriptor (attach-descriptor) @ maven-invoker
---
[linux-jdk9] [INFO] Skipping because packaging 'jar' is not pom.
[linux-jdk9] [INFO] 
[linux-jdk9] [INFO] --- maven-checkstyle-plugin:3.0.0:check (checkstyle-check) @ maven-invoker
---
[linux-jdk9] [INFO] ------------------------------------------------------------------------
[linux-jdk9] [INFO] BUILD SUCCESS
[linux-jdk9] [INFO] ------------------------------------------------------------------------
[linux-jdk9] [INFO] Total time: 36.899 s
[linux-jdk9] [INFO] Finished at: 2018-05-11T11:04:38Z
[linux-jdk9] [INFO] Final Memory: 42M/140M
[linux-jdk9] [INFO] ------------------------------------------------------------------------
[linux-jdk9] [WARNING] The requested profile "run-its" could not be activated because it does
not exist.
[linux-jdk9] [INFO] [jenkins-event-spy] Generated /home/jenkins/jenkins-slave/workspace/aven-invoker_FIXBUILD_ISSUE-Z4SIO7Z323RVJKLPHTBESQQLAYVNUHX7HVBRXAWQVMOXLPEJNY3Q@tmp/withMaven1feb8faf/maven-spy-20180511-110401-2177784319955967290387.log
[Pipeline] [linux-jdk9] }
[Pipeline] [linux-jdk9] // dir
[linux-jdk10] [ERROR] Tests run: 8, Failures: 1, Errors: 0, Skipped: 0, Time elapsed: 18.191
s <<< FAILURE! - in org.apache.maven.shared.invoker.DefaultInvokerTest
[linux-jdk10] [ERROR] testBuildShouldTimeout(org.apache.maven.shared.invoker.DefaultInvokerTest)
 Time elapsed: 2.01 s  <<< FAILURE!
[linux-jdk10] java.lang.AssertionError: expected:<1> but was:<-2147483648>
[linux-jdk10] 	at org.apache.maven.shared.invoker.DefaultInvokerTest.testBuildShouldTimeout(DefaultInvokerTest.java:118)
[linux-jdk10] 
[linux-jdk10] [INFO] Running org.apache.maven.shared.invoker.SystemOutHandlerTest
[linux-jdk10] [INFO] Tests run: 3, Failures: 0, Errors: 0, Skipped: 0, Time elapsed: 0 s -
in org.apache.maven.shared.invoker.SystemOutHandlerTest
[linux-jdk10] [INFO] Running org.apache.maven.shared.invoker.MavenCommandLineBuilderTest
[linux-jdk10] [INFO] Tests run: 49, Failures: 0, Errors: 0, Skipped: 0, Time elapsed: 0.058
s - in org.apache.maven.shared.invoker.MavenCommandLineBuilderTest
[linux-jdk10] [INFO] Running org.apache.maven.shared.invoker.SystemOutLoggerTest
[linux-jdk10] [INFO] Tests run: 31, Failures: 0, Errors: 0, Skipped: 0, Time elapsed: 0.013
s - in org.apache.maven.shared.invoker.SystemOutLoggerTest
[linux-jdk10] [INFO] 
[linux-jdk10] [INFO] Results:
[linux-jdk10] [INFO] 
[linux-jdk10] [ERROR] Failures: 
[linux-jdk10] [ERROR]   DefaultInvokerTest.testBuildShouldTimeout:118 expected:<1> but
was:<-2147483648>
[linux-jdk10] [INFO] 
[linux-jdk10] [ERROR] Tests run: 91, Failures: 1, Errors: 0, Skipped: 0
[linux-jdk10] [INFO] 
[linux-jdk10] [ERROR] There are test failures.
[linux-jdk10] 
[linux-jdk10] Please refer to /home/jenkins/jenkins-slave/workspace/aven-invoker_FIXBUILD_ISSUE-Z4SIO7Z323RVJKLPHTBESQQLAYVNUHX7HVBRXAWQVMOXLPEJNY3Q/m/target/surefire-reports
for the individual test results.
[linux-jdk10] Please refer to dump files (if any exist) [date]-jvmRun[N].dump, [date].dumpstream
and [date]-jvmRun[N].dumpstream.
[linux-jdk10] [INFO] 
[linux-jdk10] [INFO] --- maven-jar-plugin:3.0.2:jar (default-jar) @ maven-invoker ---
[linux-jdk10] [INFO] Building jar: /home/jenkins/jenkins-slave/workspace/aven-invoker_FIXBUILD_ISSUE-Z4SIO7Z323RVJKLPHTBESQQLAYVNUHX7HVBRXAWQVMOXLPEJNY3Q/m/target/maven-invoker-3.0.1-SNAPSHOT.jar
[linux-jdk10] [INFO] 
[linux-jdk10] [INFO] --- maven-site-plugin:3.7:attach-descriptor (attach-descriptor) @ maven-invoker
---
[linux-jdk10] [INFO] Skipping because packaging 'jar' is not pom.
[linux-jdk10] [INFO] 
[linux-jdk10] [INFO] --- maven-checkstyle-plugin:3.0.0:check (checkstyle-check) @ maven-invoker
---
[linux-jdk10] [INFO] ------------------------------------------------------------------------
[linux-jdk10] [INFO] BUILD SUCCESS
[linux-jdk10] [INFO] ------------------------------------------------------------------------
[linux-jdk10] [INFO] Total time: 25.764 s
[linux-jdk10] [INFO] Finished at: 2018-05-11T11:04:43Z
[linux-jdk10] [INFO] Final Memory: 33M/240M
[linux-jdk10] [INFO] ------------------------------------------------------------------------
[linux-jdk10] [WARNING] The requested profile "run-its" could not be activated because it
does not exist.
[linux-jdk10] [INFO] [jenkins-event-spy] Generated /home/jenkins/jenkins-slave/workspace/aven-invoker_FIXBUILD_ISSUE-Z4SIO7Z323RVJKLPHTBESQQLAYVNUHX7HVBRXAWQVMOXLPEJNY3Q@tmp/withMavened9d138e/maven-spy-20180511-110417-6267064688454871240707.log
[Pipeline] [linux-jdk9] }
[linux-jdk9] [withMaven] junitPublisher - Archive test results for Maven artifact org.apache.maven.shared:maven-invoker:3.0.1-SNAPSHOT
generated by maven-surefire-plugin:test (default-test): m/target/surefire-reports/*.xml
[linux-jdk9] Recording test results
[Pipeline] [linux-jdk9] // withMaven
[Pipeline] [linux-jdk9] }
[Pipeline] [linux-jdk10] }
[Pipeline] [linux-jdk9] // stage
[Pipeline] [linux-jdk10] // dir
[Pipeline] [linux-jdk9] }
[Pipeline] [linux-jdk10] }
[linux-jdk10] [withMaven] junitPublisher - Archive test results for Maven artifact org.apache.maven.shared:maven-invoker:3.0.1-SNAPSHOT
generated by maven-surefire-plugin:test (default-test): m/target/surefire-reports/*.xml
[linux-jdk10] Recording test results
[Pipeline] [linux-jdk9] // node
[Pipeline] [linux-jdk10] // withMaven
[Pipeline] [linux-jdk9] }
[Pipeline] [linux-jdk10] }
[Pipeline] [linux-jdk10] // stage
[Pipeline] [linux-jdk10] }
[Pipeline] [linux-jdk10] // node
[Pipeline] [linux-jdk10] }
[Pipeline] // parallel
[Pipeline] stage
[Pipeline] { (Notifications)
[Pipeline] echo
Build result: UNSTABLE
[Pipeline] jiraIssueSelector
[Pipeline] emailext
Mime
  • Unnamed multipart/mixed (inline, None, 0 bytes)
View raw message