maven-notifications mailing list archives

Site index · List index
Message view « Date » · « Thread »
Top « Date » · « Thread »
From Apache Jenkins Server <jenk...@builds.apache.org>
Subject Build unstable in Jenkins: Maven TLP » maven-archiver » MSHARED-727-surefire #2
Date Sun, 06 May 2018 12:57:00 GMT
See https://builds.apache.org/job/maven-box/job/maven-archiver/job/MSHARED-727-surefire/2/

Changes:

* [MSHARED-727] - Upgrade mave-surefire/failsafe-plugin 2.21.0
* [MSHARED-727] - Upgrade mave-surefire/failsafe-plugin 2.21.0
* [MSHARED-727] - Upgrade mave-surefire/failsafe-plugin 2.21.0
* [MSHARED-727] - Upgrade mave-surefire/failsafe-plugin 2.21.0

1 tests failed.
FAILED:  org.apache.maven.archiver.MavenArchiverTest.testRecreation

Error Message:
expected:<1525611400000> but was:<1525611340000>

Stack Trace:
java.lang.AssertionError: expected:<1525611400000> but was:<1525611340000>
	at org.apache.maven.archiver.MavenArchiverTest.testRecreation(MavenArchiverTest.java:248)




Build log:
[...truncated 845.98 KB...]
[Pipeline] [linux-jdk10] }
[Pipeline] [linux-jdk10] // dir
[Pipeline] [linux-jdk10] }
[Pipeline] [linux-jdk10] // stage
[Pipeline] [linux-jdk10] stage
[Pipeline] [linux-jdk10] { (Build linux-jdk10)
[linux-jdk9] [INFO] 
[linux-jdk9] [INFO] -------------------------------------------------------
[linux-jdk9] [INFO]  T E S T S
[linux-jdk9] [INFO] -------------------------------------------------------
[linux-jdk9] [INFO] Running org.apache.maven.archiver.MavenArchiveConfigurationTest
[linux-jdk9] [INFO] Tests run: 3, Failures: 0, Errors: 0, Skipped: 0, Time elapsed: 0.107
s - in org.apache.maven.archiver.MavenArchiveConfigurationTest
[linux-jdk9] [INFO] Running org.apache.maven.archiver.ManifestConfigurationTest
[linux-jdk9] [INFO] Tests run: 4, Failures: 0, Errors: 0, Skipped: 0, Time elapsed: 0.001
s - in org.apache.maven.archiver.ManifestConfigurationTest
[linux-jdk9] [INFO] Running org.apache.maven.archiver.MavenArchiverTest
[linux-jdk9] [INFO] Building jar: /home/jenkins/jenkins-slave/workspace/chiver_MSHARED-727-surefire-H6VVLTIDO2U24PXWZJZHMLAV367I4IPYEQSJWMBDQ5ZFVGBUCWTQ/m/target/test/dummy.jar
[linux-jdk9] [INFO] Building jar: /home/jenkins/jenkins-slave/workspace/chiver_MSHARED-727-surefire-H6VVLTIDO2U24PXWZJZHMLAV367I4IPYEQSJWMBDQ5ZFVGBUCWTQ/m/target/test/dummy.jar
[linux-jdk9] [INFO] Building jar: /home/jenkins/jenkins-slave/workspace/chiver_MSHARED-727-surefire-H6VVLTIDO2U24PXWZJZHMLAV367I4IPYEQSJWMBDQ5ZFVGBUCWTQ/m/target/test/dummy-defaults.jar
[linux-jdk9] [INFO] Building jar: /home/jenkins/jenkins-slave/workspace/chiver_MSHARED-727-surefire-H6VVLTIDO2U24PXWZJZHMLAV367I4IPYEQSJWMBDQ5ZFVGBUCWTQ/m/target/test/dummy-explicit-simple.jar
[linux-jdk9] [INFO] Building jar: /home/jenkins/jenkins-slave/workspace/chiver_MSHARED-727-surefire-H6VVLTIDO2U24PXWZJZHMLAV367I4IPYEQSJWMBDQ5ZFVGBUCWTQ/m/target/test/dummy.jar
[linux-jdk9] [INFO] Building jar: /home/jenkins/jenkins-slave/workspace/chiver_MSHARED-727-surefire-H6VVLTIDO2U24PXWZJZHMLAV367I4IPYEQSJWMBDQ5ZFVGBUCWTQ/m/target/test/dummy.jar
[linux-jdk9] [INFO] Building jar: /home/jenkins/jenkins-slave/workspace/chiver_MSHARED-727-surefire-H6VVLTIDO2U24PXWZJZHMLAV367I4IPYEQSJWMBDQ5ZFVGBUCWTQ/m/target/test/dummy.jar
[linux-jdk9] [INFO] Building jar: /home/jenkins/jenkins-slave/workspace/chiver_MSHARED-727-surefire-H6VVLTIDO2U24PXWZJZHMLAV367I4IPYEQSJWMBDQ5ZFVGBUCWTQ/m/target/test/dummy.jar
[linux-jdk9] [INFO] Building jar: /home/jenkins/jenkins-slave/workspace/chiver_MSHARED-727-surefire-H6VVLTIDO2U24PXWZJZHMLAV367I4IPYEQSJWMBDQ5ZFVGBUCWTQ/m/target/test/dummy.jar
[linux-jdk9] [INFO] Building jar: /home/jenkins/jenkins-slave/workspace/chiver_MSHARED-727-surefire-H6VVLTIDO2U24PXWZJZHMLAV367I4IPYEQSJWMBDQ5ZFVGBUCWTQ/m/target/test/dummy.jar
[linux-jdk9] [INFO] Building jar: /home/jenkins/jenkins-slave/workspace/chiver_MSHARED-727-surefire-H6VVLTIDO2U24PXWZJZHMLAV367I4IPYEQSJWMBDQ5ZFVGBUCWTQ/m/target/test/dummy.jar
[linux-jdk9] [INFO] Building jar: /home/jenkins/jenkins-slave/workspace/chiver_MSHARED-727-surefire-H6VVLTIDO2U24PXWZJZHMLAV367I4IPYEQSJWMBDQ5ZFVGBUCWTQ/m/target/test/dummy.jar
[linux-jdk9] [INFO] Building jar: /home/jenkins/jenkins-slave/workspace/chiver_MSHARED-727-surefire-H6VVLTIDO2U24PXWZJZHMLAV367I4IPYEQSJWMBDQ5ZFVGBUCWTQ/m/target/test/dummy.jar
[linux-jdk9] [INFO] Building jar: /home/jenkins/jenkins-slave/workspace/chiver_MSHARED-727-surefire-H6VVLTIDO2U24PXWZJZHMLAV367I4IPYEQSJWMBDQ5ZFVGBUCWTQ/m/target/test/dummy-custom-layout-repo-non-unique.jar
[linux-jdk9] [INFO] Building jar: /home/jenkins/jenkins-slave/workspace/chiver_MSHARED-727-surefire-H6VVLTIDO2U24PXWZJZHMLAV367I4IPYEQSJWMBDQ5ZFVGBUCWTQ/m/target/test/dummy.jar
[Pipeline] [linux-jdk10] withMaven
[linux-jdk10] [withMaven] Options: [org.jenkinsci.plugins.pipeline.maven.publishers.GeneratedArtifactsPublisher[disabled=true],
org.jenkinsci.plugins.pipeline.maven.publishers.JunitTestsPublisher[disabled=false], org.jenkinsci.plugins.pipeline.maven.publishers.FindbugsAnalysisPublisher[disabled=true],
org.jenkinsci.plugins.pipeline.maven.publishers.TasksScannerPublisher[disabled=true], org.jenkinsci.plugins.pipeline.maven.publishers.DependenciesFingerprintPublisher[disabled=false,
scopes=[compile, provided, runtime], versions={snapshot:true, release:false}], org.jenkinsci.plugins.pipeline.maven.publishers.InvokerRunsPublisher[disabled=false],
org.jenkinsci.plugins.pipeline.maven.publishers.PipelineGraphPublisher[disabled=false, scopes=[compile,
provided, runtime], versions={snapshot:true, release:false}, skipDownstreamTriggers=false,
lifecycleThreshold=deploy, ignoreUpstreamTriggers=false]]
[linux-jdk10] [withMaven] Available options: 
[linux-jdk10] [withMaven] using JDK installation JDK 10 (latest)
[linux-jdk10] [withMaven] using Maven installation 'Maven 3.5.2'
[Pipeline] [linux-jdk10] {
[Pipeline] [linux-jdk10] dir
[linux-jdk10] Running in /home/jenkins/jenkins-slave/workspace/chiver_MSHARED-727-surefire-H6VVLTIDO2U24PXWZJZHMLAV367I4IPYEQSJWMBDQ5ZFVGBUCWTQ/m
[Pipeline] [linux-jdk10] {
[linux-jdk9] [INFO] Building jar: /home/jenkins/jenkins-slave/workspace/chiver_MSHARED-727-surefire-H6VVLTIDO2U24PXWZJZHMLAV367I4IPYEQSJWMBDQ5ZFVGBUCWTQ/m/target/test/dummyWithDashes.jar
[linux-jdk9] [INFO] Building jar: /home/jenkins/jenkins-slave/workspace/chiver_MSHARED-727-surefire-H6VVLTIDO2U24PXWZJZHMLAV367I4IPYEQSJWMBDQ5ZFVGBUCWTQ/m/target/test/dummy.jar
[linux-jdk9] [INFO] Building jar: /home/jenkins/jenkins-slave/workspace/chiver_MSHARED-727-surefire-H6VVLTIDO2U24PXWZJZHMLAV367I4IPYEQSJWMBDQ5ZFVGBUCWTQ/m/target/test/dummy.jar
[linux-jdk9] [INFO] Building jar: /home/jenkins/jenkins-slave/workspace/chiver_MSHARED-727-surefire-H6VVLTIDO2U24PXWZJZHMLAV367I4IPYEQSJWMBDQ5ZFVGBUCWTQ/m/target/test/dummy-custom-layout-simple.jar
[linux-jdk9] [INFO] Building jar: /home/jenkins/jenkins-slave/workspace/chiver_MSHARED-727-surefire-H6VVLTIDO2U24PXWZJZHMLAV367I4IPYEQSJWMBDQ5ZFVGBUCWTQ/m/target/test/dummy-custom-layout-repo.jar
[linux-jdk9] [INFO] Building jar: /home/jenkins/jenkins-slave/workspace/chiver_MSHARED-727-surefire-H6VVLTIDO2U24PXWZJZHMLAV367I4IPYEQSJWMBDQ5ZFVGBUCWTQ/m/target/test/dummy.jar
[linux-jdk9] [INFO] Building jar: /home/jenkins/jenkins-slave/workspace/chiver_MSHARED-727-surefire-H6VVLTIDO2U24PXWZJZHMLAV367I4IPYEQSJWMBDQ5ZFVGBUCWTQ/m/target/test/dummy-custom-layout-simple-non-unique.jar
[linux-jdk9] [INFO] Building jar: /home/jenkins/jenkins-slave/workspace/chiver_MSHARED-727-surefire-H6VVLTIDO2U24PXWZJZHMLAV367I4IPYEQSJWMBDQ5ZFVGBUCWTQ/m/target/test/dummy.jar
[linux-jdk9] [INFO] Building jar: /home/jenkins/jenkins-slave/workspace/chiver_MSHARED-727-surefire-H6VVLTIDO2U24PXWZJZHMLAV367I4IPYEQSJWMBDQ5ZFVGBUCWTQ/m/target/test/dummy.jar
[linux-jdk9] [INFO] Building jar: /home/jenkins/jenkins-slave/workspace/chiver_MSHARED-727-surefire-H6VVLTIDO2U24PXWZJZHMLAV367I4IPYEQSJWMBDQ5ZFVGBUCWTQ/m/target/test/dummy.jar
[linux-jdk9] [ERROR] Tests run: 27, Failures: 1, Errors: 0, Skipped: 0, Time elapsed: 0.656
s <<< FAILURE! - in org.apache.maven.archiver.MavenArchiverTest
[linux-jdk9] [ERROR] testRecreation(org.apache.maven.archiver.MavenArchiverTest)  Time elapsed:
0.236 s  <<< FAILURE!
[linux-jdk9] java.lang.AssertionError: expected:<1525611400000> but was:<1525611340000>
[linux-jdk9] 	at org.apache.maven.archiver.MavenArchiverTest.testRecreation(MavenArchiverTest.java:248)
[linux-jdk9] 
[linux-jdk9] [INFO] 
[linux-jdk9] [INFO] Results:
[linux-jdk9] [INFO] 
[linux-jdk9] [ERROR] Failures: 
[linux-jdk9] [ERROR]   MavenArchiverTest.testRecreation:248 expected:<1525611400000>
but was:<1525611340000>
[linux-jdk9] [INFO] 
[linux-jdk9] [ERROR] Tests run: 34, Failures: 1, Errors: 0, Skipped: 0
[linux-jdk9] [INFO] 
[linux-jdk9] [ERROR] There are test failures.
[linux-jdk9] 
[linux-jdk9] Please refer to /home/jenkins/jenkins-slave/workspace/chiver_MSHARED-727-surefire-H6VVLTIDO2U24PXWZJZHMLAV367I4IPYEQSJWMBDQ5ZFVGBUCWTQ/m/target/surefire-reports
for the individual test results.
[linux-jdk9] Please refer to dump files (if any exist) [date]-jvmRun[N].dump, [date].dumpstream
and [date]-jvmRun[N].dumpstream.
[linux-jdk9] [INFO] 
[linux-jdk9] [INFO] --- maven-jar-plugin:3.0.2:jar (default-jar) @ maven-archiver ---
[Pipeline] [linux-jdk10] isUnix
[Pipeline] [linux-jdk10] sh
[linux-jdk9] [INFO] Building jar: /home/jenkins/jenkins-slave/workspace/chiver_MSHARED-727-surefire-H6VVLTIDO2U24PXWZJZHMLAV367I4IPYEQSJWMBDQ5ZFVGBUCWTQ/m/target/maven-archiver-3.2.1-SNAPSHOT.jar
[linux-jdk9] [INFO] 
[linux-jdk9] [INFO] --- maven-site-plugin:3.7:attach-descriptor (attach-descriptor) @ maven-archiver
---
[linux-jdk10] [m] Running shell script
[linux-jdk10] + mvn -P+run-its -Dmaven.test.failure.ignore=true -Dfindbugs.failOnError=false
-Dfindbugs.skip=true clean verify
[linux-jdk10] ----- withMaven Wrapper script -----
[linux-jdk10] Picked up JAVA_TOOL_OPTIONS: -Dmaven.ext.class.path="/home/jenkins/jenkins-slave/workspace/chiver_MSHARED-727-surefire-H6VVLTIDO2U24PXWZJZHMLAV367I4IPYEQSJWMBDQ5ZFVGBUCWTQ@tmp/withMaven5e29af2b/pipeline-maven-spy.jar"
-Dorg.jenkinsci.plugins.pipeline.maven.reportsFolder="/home/jenkins/jenkins-slave/workspace/chiver_MSHARED-727-surefire-H6VVLTIDO2U24PXWZJZHMLAV367I4IPYEQSJWMBDQ5ZFVGBUCWTQ@tmp/withMaven5e29af2b"

[linux-jdk10] Apache Maven 3.5.2 (138edd61fd100ec658bfa2d307c43b76940a5d7d; 2017-10-18T07:58:13Z)
[linux-jdk10] Maven home: /home/jenkins/tools/maven/apache-maven-3.5.2
[linux-jdk10] Java version: 10, vendor: Oracle Corporation
[linux-jdk10] Java home: /usr/local/asfpackages/java/jdk-10_46
[linux-jdk10] Default locale: en_US, platform encoding: ISO-8859-1
[linux-jdk10] OS name: "linux", version: "4.4.0-43-generic", arch: "amd64", family: "unix"
[linux-jdk9] [INFO] Skipping because packaging 'jar' is not pom.
[linux-jdk9] [INFO] 
[linux-jdk9] [INFO] --- maven-checkstyle-plugin:3.0.0:check (checkstyle-check) @ maven-archiver
---
[linux-jdk9] [INFO] Downloading from central: https://repo.maven.apache.org/maven2/javax/xml/bind/jaxb-api/2.3.0/jaxb-api-2.3.0.pom
[linux-jdk9] [INFO] Downloaded from central: https://repo.maven.apache.org/maven2/javax/xml/bind/jaxb-api/2.3.0/jaxb-api-2.3.0.pom
(23 kB at 58 kB/s)
[linux-jdk9] [INFO] Downloading from central: https://repo.maven.apache.org/maven2/javax/xml/bind/jaxb-api-parent/2.3.0/jaxb-api-parent-2.3.0.pom
[linux-jdk9] [INFO] Downloaded from central: https://repo.maven.apache.org/maven2/javax/xml/bind/jaxb-api-parent/2.3.0/jaxb-api-parent-2.3.0.pom
(5.6 kB at 313 kB/s)
[linux-jdk9] [INFO] Downloading from central: https://repo.maven.apache.org/maven2/net/java/jvnet-parent/5/jvnet-parent-5.pom
[linux-jdk9] [INFO] Downloaded from central: https://repo.maven.apache.org/maven2/net/java/jvnet-parent/5/jvnet-parent-5.pom
(8.9 kB at 422 kB/s)
[linux-jdk9] [INFO] Downloading from central: https://repo.maven.apache.org/maven2/javax/xml/bind/jaxb-api/2.3.0/jaxb-api-2.3.0.jar
[linux-jdk9] [INFO] Downloaded from central: https://repo.maven.apache.org/maven2/javax/xml/bind/jaxb-api/2.3.0/jaxb-api-2.3.0.jar
(126 kB at 2.6 MB/s)
[linux-jdk10] [INFO] [jenkins-event-spy] Generate /home/jenkins/jenkins-slave/workspace/chiver_MSHARED-727-surefire-H6VVLTIDO2U24PXWZJZHMLAV367I4IPYEQSJWMBDQ5ZFVGBUCWTQ@tmp/withMaven5e29af2b/maven-spy-20180506-125643-7944021516222350029519.log.tmp
...
[linux-jdk10] [INFO] Scanning for projects...
[linux-jdk10] [INFO] 
[linux-jdk10] [INFO] ------------------------------------------------------------------------
[linux-jdk10] [INFO] Building Apache Maven Archiver 3.2.1-SNAPSHOT
[linux-jdk10] [INFO] ------------------------------------------------------------------------
[linux-jdk9] [INFO] ------------------------------------------------------------------------
[linux-jdk9] [INFO] BUILD SUCCESS
[linux-jdk9] [INFO] ------------------------------------------------------------------------
[linux-jdk9] [INFO] Total time: 12.595 s
[linux-jdk9] [INFO] Finished at: 2018-05-06T12:56:45Z
[linux-jdk9] [INFO] Final Memory: 35M/116M
[linux-jdk9] [INFO] ------------------------------------------------------------------------
[linux-jdk9] [WARNING] The requested profile "run-its" could not be activated because it does
not exist.
[linux-jdk9] [INFO] [jenkins-event-spy] Generated /home/jenkins/jenkins-slave/workspace/chiver_MSHARED-727-surefire-H6VVLTIDO2U24PXWZJZHMLAV367I4IPYEQSJWMBDQ5ZFVGBUCWTQ@tmp/withMavend6baa945/maven-spy-20180506-125632-2906892849075345067095.log
[linux-jdk10] [INFO] 
[linux-jdk10] [INFO] --- maven-clean-plugin:3.0.0:clean (default-clean) @ maven-archiver ---
[linux-jdk10] [INFO] 
[linux-jdk10] [INFO] --- maven-enforcer-plugin:1.4.1:enforce (enforce-maven-version) @ maven-archiver
---
[linux-jdk10] [INFO] 
[linux-jdk10] [INFO] --- maven-enforcer-plugin:1.4.1:enforce (enforce-bytecode-version) @
maven-archiver ---
[Pipeline] [linux-jdk9] }
[Pipeline] [linux-jdk9] // dir
[linux-jdk10] [INFO] 
[linux-jdk10] [INFO] --- maven-enforcer-plugin:1.4.1:enforce (ban-known-bad-maven-versions)
@ maven-archiver ---
[linux-jdk10] [INFO] 
[linux-jdk10] [INFO] --- apache-rat-plugin:0.12:check (rat-check) @ maven-archiver ---
[linux-jdk10] [INFO] Enabled default license matchers.
[linux-jdk10] [INFO] Will parse SCM ignores for exclusions...
[linux-jdk10] [INFO] Parsing exclusions from /home/jenkins/jenkins-slave/workspace/chiver_MSHARED-727-surefire-H6VVLTIDO2U24PXWZJZHMLAV367I4IPYEQSJWMBDQ5ZFVGBUCWTQ/m/.gitignore
[linux-jdk10] [INFO] Finished adding exclusions from SCM ignore files.
[linux-jdk10] [INFO] 71 implicit excludes (use -debug for more details).
[linux-jdk10] [INFO] Exclude: .repository/**
[linux-jdk10] [INFO] Exclude: .maven/spy.log
[linux-jdk10] [INFO] Exclude: dependency-reduced-pom.xml
[linux-jdk10] [INFO] Exclude: .java-version
[linux-jdk10] [INFO] 27 resources included (use -debug for more details)
[linux-jdk10] [INFO] Rat check: Summary over all files. Unapproved: 0, unknown: 0, generated:
0, approved: 22 licenses.
[linux-jdk10] [INFO] 
[linux-jdk10] [INFO] --- maven-remote-resources-plugin:1.5:process (process-resource-bundles)
@ maven-archiver ---
[linux-jdk10] [INFO] 
[linux-jdk10] [INFO] --- maven-resources-plugin:3.0.2:resources (default-resources) @ maven-archiver
---
[linux-jdk10] [INFO] Using 'UTF-8' encoding to copy filtered resources.
[linux-jdk10] [INFO] skip non existing resourceDirectory /home/jenkins/jenkins-slave/workspace/chiver_MSHARED-727-surefire-H6VVLTIDO2U24PXWZJZHMLAV367I4IPYEQSJWMBDQ5ZFVGBUCWTQ/m/src/main/resources
[linux-jdk10] [INFO] Copying 3 resources
[linux-jdk10] [INFO] 
[linux-jdk10] [INFO] --- maven-compiler-plugin:3.7.0:compile (default-compile) @ maven-archiver
---
[linux-jdk10] [INFO] Changes detected - recompiling the module!
[linux-jdk10] [INFO] Compiling 5 source files to /home/jenkins/jenkins-slave/workspace/chiver_MSHARED-727-surefire-H6VVLTIDO2U24PXWZJZHMLAV367I4IPYEQSJWMBDQ5ZFVGBUCWTQ/m/target/classes
[linux-jdk10] [INFO] 
[linux-jdk10] [INFO] --- maven-resources-plugin:3.0.2:testResources (default-testResources)
@ maven-archiver ---
[linux-jdk10] [INFO] Using 'UTF-8' encoding to copy filtered resources.
[linux-jdk10] [INFO] Copying 7 resources
[linux-jdk10] [INFO] Copying 3 resources
[linux-jdk10] [INFO] 
[linux-jdk10] [INFO] --- maven-compiler-plugin:3.7.0:testCompile (default-testCompile) @ maven-archiver
---
[linux-jdk10] [INFO] Changes detected - recompiling the module!
[linux-jdk10] [INFO] Compiling 4 source files to /home/jenkins/jenkins-slave/workspace/chiver_MSHARED-727-surefire-H6VVLTIDO2U24PXWZJZHMLAV367I4IPYEQSJWMBDQ5ZFVGBUCWTQ/m/target/test-classes
[linux-jdk10] [INFO] /home/jenkins/jenkins-slave/workspace/chiver_MSHARED-727-surefire-H6VVLTIDO2U24PXWZJZHMLAV367I4IPYEQSJWMBDQ5ZFVGBUCWTQ/m/src/test/java/org/apache/maven/archiver/MockArtifact.java:
Some input files use or override a deprecated API.
[linux-jdk10] [INFO] /home/jenkins/jenkins-slave/workspace/chiver_MSHARED-727-surefire-H6VVLTIDO2U24PXWZJZHMLAV367I4IPYEQSJWMBDQ5ZFVGBUCWTQ/m/src/test/java/org/apache/maven/archiver/MockArtifact.java:
Recompile with -Xlint:deprecation for details.
[linux-jdk10] [INFO] 
[linux-jdk10] [INFO] --- maven-surefire-plugin:2.21.0:test (default-test) @ maven-archiver
---
[Pipeline] [linux-jdk9] }
[linux-jdk10] [INFO] 
[linux-jdk10] [INFO] -------------------------------------------------------
[linux-jdk10] [INFO]  T E S T S
[linux-jdk10] [INFO] -------------------------------------------------------
[linux-jdk10] [INFO] Running org.apache.maven.archiver.MavenArchiverTest
[linux-jdk10] [INFO] Building jar: /home/jenkins/jenkins-slave/workspace/chiver_MSHARED-727-surefire-H6VVLTIDO2U24PXWZJZHMLAV367I4IPYEQSJWMBDQ5ZFVGBUCWTQ/m/target/test/dummy.jar
[linux-jdk10] [INFO] Building jar: /home/jenkins/jenkins-slave/workspace/chiver_MSHARED-727-surefire-H6VVLTIDO2U24PXWZJZHMLAV367I4IPYEQSJWMBDQ5ZFVGBUCWTQ/m/target/test/dummy.jar
[linux-jdk9] [withMaven] junitPublisher - Archive test results for Maven artifact org.apache.maven:maven-archiver:3.2.1-SNAPSHOT
generated by maven-surefire-plugin:test (default-test): m/target/surefire-reports/*.xml
[linux-jdk9] Recording test results
[Pipeline] [linux-jdk9] // withMaven
[Pipeline] [linux-jdk9] }
[Pipeline] [linux-jdk9] // stage
[Pipeline] [linux-jdk9] }
[Pipeline] [linux-jdk9] // node
[Pipeline] [linux-jdk9] }
[linux-jdk10] [INFO] Building jar: /home/jenkins/jenkins-slave/workspace/chiver_MSHARED-727-surefire-H6VVLTIDO2U24PXWZJZHMLAV367I4IPYEQSJWMBDQ5ZFVGBUCWTQ/m/target/test/dummy-defaults.jar
[linux-jdk10] [INFO] Building jar: /home/jenkins/jenkins-slave/workspace/chiver_MSHARED-727-surefire-H6VVLTIDO2U24PXWZJZHMLAV367I4IPYEQSJWMBDQ5ZFVGBUCWTQ/m/target/test/dummy-explicit-simple.jar
[linux-jdk10] [INFO] Building jar: /home/jenkins/jenkins-slave/workspace/chiver_MSHARED-727-surefire-H6VVLTIDO2U24PXWZJZHMLAV367I4IPYEQSJWMBDQ5ZFVGBUCWTQ/m/target/test/dummy.jar
[linux-jdk10] [INFO] Building jar: /home/jenkins/jenkins-slave/workspace/chiver_MSHARED-727-surefire-H6VVLTIDO2U24PXWZJZHMLAV367I4IPYEQSJWMBDQ5ZFVGBUCWTQ/m/target/test/dummy.jar
[linux-jdk10] [INFO] Building jar: /home/jenkins/jenkins-slave/workspace/chiver_MSHARED-727-surefire-H6VVLTIDO2U24PXWZJZHMLAV367I4IPYEQSJWMBDQ5ZFVGBUCWTQ/m/target/test/dummy.jar
[linux-jdk10] [INFO] Building jar: /home/jenkins/jenkins-slave/workspace/chiver_MSHARED-727-surefire-H6VVLTIDO2U24PXWZJZHMLAV367I4IPYEQSJWMBDQ5ZFVGBUCWTQ/m/target/test/dummy.jar
[linux-jdk10] [INFO] Building jar: /home/jenkins/jenkins-slave/workspace/chiver_MSHARED-727-surefire-H6VVLTIDO2U24PXWZJZHMLAV367I4IPYEQSJWMBDQ5ZFVGBUCWTQ/m/target/test/dummy.jar
[linux-jdk10] [INFO] Building jar: /home/jenkins/jenkins-slave/workspace/chiver_MSHARED-727-surefire-H6VVLTIDO2U24PXWZJZHMLAV367I4IPYEQSJWMBDQ5ZFVGBUCWTQ/m/target/test/dummy.jar
[linux-jdk10] [INFO] Building jar: /home/jenkins/jenkins-slave/workspace/chiver_MSHARED-727-surefire-H6VVLTIDO2U24PXWZJZHMLAV367I4IPYEQSJWMBDQ5ZFVGBUCWTQ/m/target/test/dummy.jar
[linux-jdk10] [INFO] Building jar: /home/jenkins/jenkins-slave/workspace/chiver_MSHARED-727-surefire-H6VVLTIDO2U24PXWZJZHMLAV367I4IPYEQSJWMBDQ5ZFVGBUCWTQ/m/target/test/dummy.jar
[linux-jdk10] [INFO] Building jar: /home/jenkins/jenkins-slave/workspace/chiver_MSHARED-727-surefire-H6VVLTIDO2U24PXWZJZHMLAV367I4IPYEQSJWMBDQ5ZFVGBUCWTQ/m/target/test/dummy.jar
[linux-jdk10] [INFO] Building jar: /home/jenkins/jenkins-slave/workspace/chiver_MSHARED-727-surefire-H6VVLTIDO2U24PXWZJZHMLAV367I4IPYEQSJWMBDQ5ZFVGBUCWTQ/m/target/test/dummy-custom-layout-repo-non-unique.jar
[linux-jdk10] [INFO] Building jar: /home/jenkins/jenkins-slave/workspace/chiver_MSHARED-727-surefire-H6VVLTIDO2U24PXWZJZHMLAV367I4IPYEQSJWMBDQ5ZFVGBUCWTQ/m/target/test/dummy.jar
[linux-jdk10] [INFO] Building jar: /home/jenkins/jenkins-slave/workspace/chiver_MSHARED-727-surefire-H6VVLTIDO2U24PXWZJZHMLAV367I4IPYEQSJWMBDQ5ZFVGBUCWTQ/m/target/test/dummyWithDashes.jar
[linux-jdk10] [INFO] Building jar: /home/jenkins/jenkins-slave/workspace/chiver_MSHARED-727-surefire-H6VVLTIDO2U24PXWZJZHMLAV367I4IPYEQSJWMBDQ5ZFVGBUCWTQ/m/target/test/dummy.jar
[linux-jdk10] [INFO] Building jar: /home/jenkins/jenkins-slave/workspace/chiver_MSHARED-727-surefire-H6VVLTIDO2U24PXWZJZHMLAV367I4IPYEQSJWMBDQ5ZFVGBUCWTQ/m/target/test/dummy.jar
[linux-jdk10] [INFO] Building jar: /home/jenkins/jenkins-slave/workspace/chiver_MSHARED-727-surefire-H6VVLTIDO2U24PXWZJZHMLAV367I4IPYEQSJWMBDQ5ZFVGBUCWTQ/m/target/test/dummy-custom-layout-simple.jar
[linux-jdk10] [INFO] Building jar: /home/jenkins/jenkins-slave/workspace/chiver_MSHARED-727-surefire-H6VVLTIDO2U24PXWZJZHMLAV367I4IPYEQSJWMBDQ5ZFVGBUCWTQ/m/target/test/dummy-custom-layout-repo.jar
[linux-jdk10] [INFO] Building jar: /home/jenkins/jenkins-slave/workspace/chiver_MSHARED-727-surefire-H6VVLTIDO2U24PXWZJZHMLAV367I4IPYEQSJWMBDQ5ZFVGBUCWTQ/m/target/test/dummy.jar
[linux-jdk10] [INFO] Building jar: /home/jenkins/jenkins-slave/workspace/chiver_MSHARED-727-surefire-H6VVLTIDO2U24PXWZJZHMLAV367I4IPYEQSJWMBDQ5ZFVGBUCWTQ/m/target/test/dummy-custom-layout-simple-non-unique.jar
[linux-jdk10] [INFO] Building jar: /home/jenkins/jenkins-slave/workspace/chiver_MSHARED-727-surefire-H6VVLTIDO2U24PXWZJZHMLAV367I4IPYEQSJWMBDQ5ZFVGBUCWTQ/m/target/test/dummy.jar
[linux-jdk10] [INFO] Building jar: /home/jenkins/jenkins-slave/workspace/chiver_MSHARED-727-surefire-H6VVLTIDO2U24PXWZJZHMLAV367I4IPYEQSJWMBDQ5ZFVGBUCWTQ/m/target/test/dummy.jar
[linux-jdk10] [INFO] Building jar: /home/jenkins/jenkins-slave/workspace/chiver_MSHARED-727-surefire-H6VVLTIDO2U24PXWZJZHMLAV367I4IPYEQSJWMBDQ5ZFVGBUCWTQ/m/target/test/dummy.jar
[linux-jdk10] [INFO] Tests run: 27, Failures: 0, Errors: 0, Skipped: 0, Time elapsed: 0.491
s - in org.apache.maven.archiver.MavenArchiverTest
[linux-jdk10] [INFO] Running org.apache.maven.archiver.MavenArchiveConfigurationTest
[linux-jdk10] [INFO] Tests run: 3, Failures: 0, Errors: 0, Skipped: 0, Time elapsed: 0.02
s - in org.apache.maven.archiver.MavenArchiveConfigurationTest
[linux-jdk10] [INFO] Running org.apache.maven.archiver.ManifestConfigurationTest
[linux-jdk10] [INFO] Tests run: 4, Failures: 0, Errors: 0, Skipped: 0, Time elapsed: 0.001
s - in org.apache.maven.archiver.ManifestConfigurationTest
[linux-jdk10] [INFO] 
[linux-jdk10] [INFO] Results:
[linux-jdk10] [INFO] 
[linux-jdk10] [INFO] Tests run: 34, Failures: 0, Errors: 0, Skipped: 0
[linux-jdk10] [INFO] 
[linux-jdk10] [INFO] 
[linux-jdk10] [INFO] --- maven-jar-plugin:3.0.2:jar (default-jar) @ maven-archiver ---
[linux-jdk10] [INFO] Building jar: /home/jenkins/jenkins-slave/workspace/chiver_MSHARED-727-surefire-H6VVLTIDO2U24PXWZJZHMLAV367I4IPYEQSJWMBDQ5ZFVGBUCWTQ/m/target/maven-archiver-3.2.1-SNAPSHOT.jar
[linux-jdk10] [INFO] 
[linux-jdk10] [INFO] --- maven-site-plugin:3.7:attach-descriptor (attach-descriptor) @ maven-archiver
---
[linux-jdk10] [INFO] Skipping because packaging 'jar' is not pom.
[linux-jdk10] [INFO] 
[linux-jdk10] [INFO] --- maven-checkstyle-plugin:3.0.0:check (checkstyle-check) @ maven-archiver
---
[linux-jdk10] [INFO] Downloading from central: https://repo.maven.apache.org/maven2/javax/xml/bind/jaxb-api/2.3.0/jaxb-api-2.3.0.pom
[linux-jdk10] [INFO] Downloaded from central: https://repo.maven.apache.org/maven2/javax/xml/bind/jaxb-api/2.3.0/jaxb-api-2.3.0.pom
(23 kB at 74 kB/s)
[linux-jdk10] [INFO] Downloading from central: https://repo.maven.apache.org/maven2/javax/xml/bind/jaxb-api-parent/2.3.0/jaxb-api-parent-2.3.0.pom
[linux-jdk10] [INFO] Downloaded from central: https://repo.maven.apache.org/maven2/javax/xml/bind/jaxb-api-parent/2.3.0/jaxb-api-parent-2.3.0.pom
(5.6 kB at 297 kB/s)
[linux-jdk10] [INFO] Downloading from central: https://repo.maven.apache.org/maven2/net/java/jvnet-parent/5/jvnet-parent-5.pom
[linux-jdk10] [INFO] Downloaded from central: https://repo.maven.apache.org/maven2/net/java/jvnet-parent/5/jvnet-parent-5.pom
(8.9 kB at 492 kB/s)
[linux-jdk10] [INFO] Downloading from central: https://repo.maven.apache.org/maven2/javax/xml/bind/jaxb-api/2.3.0/jaxb-api-2.3.0.jar
[linux-jdk10] [INFO] Downloaded from central: https://repo.maven.apache.org/maven2/javax/xml/bind/jaxb-api/2.3.0/jaxb-api-2.3.0.jar
(126 kB at 3.6 MB/s)
[linux-jdk10] [INFO] ------------------------------------------------------------------------
[linux-jdk10] [INFO] BUILD SUCCESS
[linux-jdk10] [INFO] ------------------------------------------------------------------------
[linux-jdk10] [INFO] Total time: 9.136 s
[linux-jdk10] [INFO] Finished at: 2018-05-06T12:56:53Z
[linux-jdk10] [INFO] Final Memory: 35M/228M
[linux-jdk10] [INFO] ------------------------------------------------------------------------
[linux-jdk10] [WARNING] The requested profile "run-its" could not be activated because it
does not exist.
[linux-jdk10] [INFO] [jenkins-event-spy] Generated /home/jenkins/jenkins-slave/workspace/chiver_MSHARED-727-surefire-H6VVLTIDO2U24PXWZJZHMLAV367I4IPYEQSJWMBDQ5ZFVGBUCWTQ@tmp/withMaven5e29af2b/maven-spy-20180506-125643-7944021516222350029519.log
[Pipeline] [linux-jdk10] }
[Pipeline] [linux-jdk10] // dir
[Pipeline] [linux-jdk10] }
[linux-jdk10] [withMaven] junitPublisher - Archive test results for Maven artifact org.apache.maven:maven-archiver:3.2.1-SNAPSHOT
generated by maven-surefire-plugin:test (default-test): m/target/surefire-reports/*.xml
[linux-jdk10] Recording test results
[Pipeline] [linux-jdk10] // withMaven
[Pipeline] [linux-jdk10] }
[Pipeline] [linux-jdk10] // stage
[Pipeline] [linux-jdk10] }
[Pipeline] [linux-jdk10] // node
[Pipeline] [linux-jdk10] }
[Pipeline] // parallel
[Pipeline] stage
[Pipeline] { (Notifications)
[Pipeline] echo
Build result: UNSTABLE
[Pipeline] jiraIssueSelector
[Pipeline] jiraComment
[Pipeline] emailext
Mime
  • Unnamed multipart/mixed (inline, None, 0 bytes)
View raw message