maven-notifications mailing list archives

Site index · List index
Message view « Date » · « Thread »
Top « Date » · « Thread »
From Apache Jenkins Server <jenk...@builds.apache.org>
Subject Build unstable in Jenkins: Maven TLP » maven » MNG-6386 #2
Date Wed, 02 May 2018 00:10:18 GMT
See https://builds.apache.org/job/maven-box/job/maven/job/MNG-6386/2/

Changes:

* Add Java 11-ea
* auto deploy if we are currently on master branch
* revert as it seems to fail on jenkins asf
* revert this one as well
* Added a test for Windows
* [MNG-6386] project.baseUri is not a valid URL on Windows

2 tests failed.
FAILED:  org.apache.maven.project.PomConstructionTest.testInterpolationOfValidBaseUri

Error Message:
expected:<file:/[]home/jenkins/jenkins...> but was:<file:/[//]home/jenkins/jenkins...>

Stack Trace:
junit.framework.ComparisonFailure: expected:<file:/[]home/jenkins/jenkins...> but was:<file:/[//]home/jenkins/jenkins...>
	at org.apache.maven.project.PomConstructionTest.testInterpolationOfValidBaseUri(PomConstructionTest.java:1099)


FAILED:  org.apache.maven.project.PomConstructionTest.testInterpolationOfBaseUri

Error Message:
expected:<file:/[]home/jenkins/jenkins...> but was:<file:/[//]home/jenkins/jenkins...>

Stack Trace:
junit.framework.ComparisonFailure: expected:<file:/[]home/jenkins/jenkins...> but was:<file:/[//]home/jenkins/jenkins...>
	at org.apache.maven.project.PomConstructionTest.testInterpolationOfBaseUri(PomConstructionTest.java:1089)




Build log:
[...truncated 6.26 MB...]
[linuxJava7] Recording test results
[linuxJava7] None of the test reports contained any result
[linuxJava7] [withMaven] junitPublisher - Archive test results for Maven artifact org.apache.maven.its.plugins:maven-it-plugin-context-passing:2.1-SNAPSHOT
generated by maven-surefire-plugin:test (default-test): core-it-support/core-it-plugins/maven-it-plugin-context-passing/target/surefire-reports/*.xml
[linuxJava7] Recording test results
[linuxJava7] None of the test reports contained any result
[linuxJava7] [withMaven] junitPublisher - Archive test results for Maven artifact org.apache.maven.plugins:maven-clean-plugin:0.1-stub-SNAPSHOT
generated by maven-surefire-plugin:test (default-test): core-it-support/core-it-plugins/maven-it-plugin-core-stubs/maven-clean-plugin/target/surefire-reports/*.xml
[linuxJava7] Recording test results
[linuxJava7] None of the test reports contained any result
[linuxJava7] [withMaven] junitPublisher - Archive test results for Maven artifact org.apache.maven.plugins:maven-compiler-plugin:0.1-stub-SNAPSHOT
generated by maven-surefire-plugin:test (default-test): core-it-support/core-it-plugins/maven-it-plugin-core-stubs/maven-compiler-plugin/target/surefire-reports/*.xml
[linuxJava7] Recording test results
[linuxJava7] None of the test reports contained any result
[linuxJava7] [withMaven] junitPublisher - Archive test results for Maven artifact org.apache.maven.plugins:maven-deploy-plugin:0.1-stub-SNAPSHOT
generated by maven-surefire-plugin:test (default-test): core-it-support/core-it-plugins/maven-it-plugin-core-stubs/maven-deploy-plugin/target/surefire-reports/*.xml
[linuxJava7] Recording test results
[linuxJava7] None of the test reports contained any result
[linuxJava7] [withMaven] junitPublisher - Archive test results for Maven artifact org.apache.maven.plugins:maven-ear-plugin:0.1-stub-SNAPSHOT
generated by maven-surefire-plugin:test (default-test): core-it-support/core-it-plugins/maven-it-plugin-core-stubs/maven-ear-plugin/target/surefire-reports/*.xml
[linuxJava7] Recording test results
[linuxJava7] None of the test reports contained any result
[linuxJava7] [withMaven] junitPublisher - Archive test results for Maven artifact org.apache.maven.plugins:maven-ejb-plugin:0.1-stub-SNAPSHOT
generated by maven-surefire-plugin:test (default-test): core-it-support/core-it-plugins/maven-it-plugin-core-stubs/maven-ejb-plugin/target/surefire-reports/*.xml
[linuxJava7] Recording test results
[linuxJava7] None of the test reports contained any result
[linuxJava7] [withMaven] junitPublisher - Archive test results for Maven artifact org.apache.maven.plugins:maven-install-plugin:0.1-stub-SNAPSHOT
generated by maven-surefire-plugin:test (default-test): core-it-support/core-it-plugins/maven-it-plugin-core-stubs/maven-install-plugin/target/surefire-reports/*.xml
[linuxJava7] Recording test results
[linuxJava7] None of the test reports contained any result
[linuxJava7] [withMaven] junitPublisher - Archive test results for Maven artifact org.apache.maven.plugins:maven-jar-plugin:0.1-stub-SNAPSHOT
generated by maven-surefire-plugin:test (default-test): core-it-support/core-it-plugins/maven-it-plugin-core-stubs/maven-jar-plugin/target/surefire-reports/*.xml
[linuxJava7] Recording test results
[linuxJava7] None of the test reports contained any result
[linuxJava7] [withMaven] junitPublisher - Archive test results for Maven artifact org.apache.maven.plugins:maven-javadoc-plugin:0.1-stub-SNAPSHOT
generated by maven-surefire-plugin:test (default-test): core-it-support/core-it-plugins/maven-it-plugin-core-stubs/maven-javadoc-plugin/target/surefire-reports/*.xml
[linuxJava7] Recording test results
[linuxJava7] None of the test reports contained any result
[linuxJava7] [withMaven] junitPublisher - Archive test results for Maven artifact org.apache.maven.plugins:maven-plugin-plugin:0.1-stub-SNAPSHOT
generated by maven-surefire-plugin:test (default-test): core-it-support/core-it-plugins/maven-it-plugin-core-stubs/maven-plugin-plugin/target/surefire-reports/*.xml
[linuxJava7] Recording test results
[linuxJava7] None of the test reports contained any result
[linuxJava7] [withMaven] junitPublisher - Archive test results for Maven artifact org.apache.maven.plugins:maven-rar-plugin:0.1-stub-SNAPSHOT
generated by maven-surefire-plugin:test (default-test): core-it-support/core-it-plugins/maven-it-plugin-core-stubs/maven-rar-plugin/target/surefire-reports/*.xml
[linuxJava7] Recording test results
[linuxJava7] ERROR: [withMaven] junitPublisher - Silently ignore exception archiving JUnit
results for Maven artifact MavenArtifact{org.apache.maven.plugins:maven-rar-plugin::0.1-stub-SNAPSHOT(version:
0.1-stub-SNAPSHOT, snapshot:false) } generated by PluginInvocation{org.apache.maven.plugins:maven-surefire-plugin:2.20.1@test
 default-test}: java.lang.RuntimeException: Failed to serialize hudson.tasks.junit.TestResult#suites
for class hudson.tasks.junit.TestResult
[linuxJava7] [withMaven] junitPublisher - Archive test results for Maven artifact org.apache.maven.plugins:maven-resources-plugin:0.1-stub-SNAPSHOT
generated by maven-surefire-plugin:test (default-test): core-it-support/core-it-plugins/maven-it-plugin-core-stubs/maven-resources-plugin/target/surefire-reports/*.xml
[linuxJava7] Recording test results
[linuxJava7] ERROR: [withMaven] junitPublisher - Silently ignore exception archiving JUnit
results for Maven artifact MavenArtifact{org.apache.maven.plugins:maven-resources-plugin::0.1-stub-SNAPSHOT(version:
0.1-stub-SNAPSHOT, snapshot:false) } generated by PluginInvocation{org.apache.maven.plugins:maven-surefire-plugin:2.20.1@test
 default-test}: java.lang.RuntimeException: Failed to serialize hudson.tasks.junit.TestResult#suites
for class hudson.tasks.junit.TestResult
[linuxJava7] [withMaven] junitPublisher - Archive test results for Maven artifact org.apache.maven.plugins:maven-site-plugin:0.1-stub-SNAPSHOT
generated by maven-surefire-plugin:test (default-test): core-it-support/core-it-plugins/maven-it-plugin-core-stubs/maven-site-plugin/target/surefire-reports/*.xml
[linuxJava7] Recording test results
[linuxJava7] ERROR: [withMaven] junitPublisher - Silently ignore exception archiving JUnit
results for Maven artifact MavenArtifact{org.apache.maven.plugins:maven-site-plugin::0.1-stub-SNAPSHOT(version:
0.1-stub-SNAPSHOT, snapshot:false) } generated by PluginInvocation{org.apache.maven.plugins:maven-surefire-plugin:2.20.1@test
 default-test}: java.lang.RuntimeException: Failed to serialize hudson.tasks.junit.TestResult#suites
for class hudson.tasks.junit.TestResult
[linuxJava7] [withMaven] junitPublisher - Archive test results for Maven artifact org.apache.maven.plugins:maven-source-plugin:0.1-stub-SNAPSHOT
generated by maven-surefire-plugin:test (default-test): core-it-support/core-it-plugins/maven-it-plugin-core-stubs/maven-source-plugin/target/surefire-reports/*.xml
[linuxJava7] Recording test results
[linuxJava7] None of the test reports contained any result
[linuxJava7] [withMaven] junitPublisher - Archive test results for Maven artifact org.apache.maven.plugins:maven-surefire-plugin:0.1-stub-SNAPSHOT
generated by maven-surefire-plugin:test (default-test): core-it-support/core-it-plugins/maven-it-plugin-core-stubs/maven-surefire-plugin/target/surefire-reports/*.xml
[linuxJava7] Recording test results
[linuxJava7] None of the test reports contained any result
[linuxJava7] [withMaven] junitPublisher - Archive test results for Maven artifact org.apache.maven.plugins:maven-war-plugin:0.1-stub-SNAPSHOT
generated by maven-surefire-plugin:test (default-test): core-it-support/core-it-plugins/maven-it-plugin-core-stubs/maven-war-plugin/target/surefire-reports/*.xml
[linuxJava7] Recording test results
[linuxJava7] ERROR: [withMaven] junitPublisher - Silently ignore exception archiving JUnit
results for Maven artifact MavenArtifact{org.apache.maven.plugins:maven-war-plugin::0.1-stub-SNAPSHOT(version:
0.1-stub-SNAPSHOT, snapshot:false) } generated by PluginInvocation{org.apache.maven.plugins:maven-surefire-plugin:2.20.1@test
 default-test}: java.lang.RuntimeException: Failed to serialize hudson.tasks.junit.TestResult#suites
for class hudson.tasks.junit.TestResult
[linuxJava7] [withMaven] junitPublisher - Archive test results for Maven artifact org.apache.maven.its.plugins:maven-it-plugin-dependency-collection:2.1-SNAPSHOT
generated by maven-surefire-plugin:test (default-test): core-it-support/core-it-plugins/maven-it-plugin-dependency-collection/target/surefire-reports/*.xml
[linuxJava7] Recording test results
[linuxJava7] ERROR: [withMaven] junitPublisher - Silently ignore exception archiving JUnit
results for Maven artifact MavenArtifact{org.apache.maven.its.plugins:maven-it-plugin-dependency-collection::2.1-SNAPSHOT(version:
2.1-SNAPSHOT, snapshot:false) } generated by PluginInvocation{org.apache.maven.plugins:maven-surefire-plugin:2.20.1@test
 default-test}: java.lang.RuntimeException: Failed to serialize hudson.tasks.junit.TestResult#suites
for class hudson.tasks.junit.TestResult
[linuxJava7] [withMaven] junitPublisher - Archive test results for Maven artifact org.apache.maven.its.plugins:maven-it-plugin-dependency-resolution:2.1-SNAPSHOT
generated by maven-surefire-plugin:test (default-test): core-it-support/core-it-plugins/maven-it-plugin-dependency-resolution/target/surefire-reports/*.xml
[linuxJava7] Recording test results
[linuxJava7] None of the test reports contained any result
[linuxJava7] [withMaven] junitPublisher - Archive test results for Maven artifact org.apache.maven.its.plugins:maven-it-plugin-expression:2.1-SNAPSHOT
generated by maven-surefire-plugin:test (default-test): core-it-support/core-it-plugins/maven-it-plugin-expression/target/surefire-reports/*.xml
[linuxJava7] Recording test results
[linuxJava7] ERROR: [withMaven] junitPublisher - Silently ignore exception archiving JUnit
results for Maven artifact MavenArtifact{org.apache.maven.its.plugins:maven-it-plugin-expression::2.1-SNAPSHOT(version:
2.1-SNAPSHOT, snapshot:false) } generated by PluginInvocation{org.apache.maven.plugins:maven-surefire-plugin:2.20.1@test
 default-test}: java.lang.RuntimeException: Failed to serialize hudson.tasks.junit.TestResult#suites
for class hudson.tasks.junit.TestResult
[linuxJava7] [withMaven] junitPublisher - Archive test results for Maven artifact org.apache.maven.its.plugins:maven-it-plugin-error:2.1-SNAPSHOT
generated by maven-surefire-plugin:test (default-test): core-it-support/core-it-plugins/maven-it-plugin-error/target/surefire-reports/*.xml
[linuxJava7] Recording test results
[linuxJava7] None of the test reports contained any result
[linuxJava7] [withMaven] junitPublisher - Archive test results for Maven artifact org.apache.maven.its:core-it-component:2.1-SNAPSHOT
generated by maven-surefire-plugin:test (default-test): core-it-support/core-it-component/target/surefire-reports/*.xml
[linuxJava7] Recording test results
[linuxJava7] ERROR: [withMaven] junitPublisher - Silently ignore exception archiving JUnit
results for Maven artifact MavenArtifact{org.apache.maven.its:core-it-component::2.1-SNAPSHOT(version:
2.1-SNAPSHOT, snapshot:false) } generated by PluginInvocation{org.apache.maven.plugins:maven-surefire-plugin:2.20.1@test
 default-test}: java.lang.RuntimeException: Failed to serialize hudson.tasks.junit.TestResult#suites
for class hudson.tasks.junit.TestResult
[linuxJava7] [withMaven] junitPublisher - Archive test results for Maven artifact org.apache.maven.its.plugins:maven-it-plugin-extension-consumer:2.1-SNAPSHOT
generated by maven-surefire-plugin:test (default-test): core-it-support/core-it-plugins/maven-it-plugin-extension-consumer/target/surefire-reports/*.xml
[linuxJava7] Recording test results
[linuxJava7] None of the test reports contained any result
[linuxJava7] [withMaven] junitPublisher - Archive test results for Maven artifact org.apache.maven.its.plugins:maven-it-plugin-extension-provider:2.1-SNAPSHOT
generated by maven-surefire-plugin:test (default-test): core-it-support/core-it-plugins/maven-it-plugin-extension-provider/target/surefire-reports/*.xml
[linuxJava7] Recording test results
[linuxJava7] ERROR: [withMaven] junitPublisher - Silently ignore exception archiving JUnit
results for Maven artifact MavenArtifact{org.apache.maven.its.plugins:maven-it-plugin-extension-provider::2.1-SNAPSHOT(version:
2.1-SNAPSHOT, snapshot:false) } generated by PluginInvocation{org.apache.maven.plugins:maven-surefire-plugin:2.20.1@test
 default-test}: java.lang.RuntimeException: Failed to serialize hudson.tasks.junit.TestResult#suites
for class hudson.tasks.junit.TestResult
[linuxJava7] [withMaven] junitPublisher - Archive test results for Maven artifact org.apache.maven.its.plugins:maven-it-plugin-fork:2.1-SNAPSHOT
generated by maven-surefire-plugin:test (default-test): core-it-support/core-it-plugins/maven-it-plugin-fork/target/surefire-reports/*.xml
[linuxJava7] Recording test results
[linuxJava7] ERROR: [withMaven] junitPublisher - Silently ignore exception archiving JUnit
results for Maven artifact MavenArtifact{org.apache.maven.its.plugins:maven-it-plugin-fork::2.1-SNAPSHOT(version:
2.1-SNAPSHOT, snapshot:false) } generated by PluginInvocation{org.apache.maven.plugins:maven-surefire-plugin:2.20.1@test
 default-test}: java.lang.RuntimeException: Failed to serialize hudson.tasks.junit.TestResult#suites
for class hudson.tasks.junit.TestResult
[linuxJava7] [withMaven] junitPublisher - Archive test results for Maven artifact org.apache.maven.its.plugins:maven-it-plugin-invalid-descriptor:2.1-SNAPSHOT
generated by maven-surefire-plugin:test (default-test): core-it-support/core-it-plugins/maven-it-plugin-invalid-descriptor/target/surefire-reports/*.xml
[linuxJava7] Recording test results
[linuxJava7] None of the test reports contained any result
[linuxJava7] [withMaven] junitPublisher - Archive test results for Maven artifact org.apache.maven.its.plugins:maven-it-plugin-log-file:2.1-SNAPSHOT
generated by maven-surefire-plugin:test (default-test): core-it-support/core-it-plugins/maven-it-plugin-log-file/target/surefire-reports/*.xml
[linuxJava7] Recording test results
[linuxJava7] None of the test reports contained any result
[linuxJava7] [withMaven] junitPublisher - Archive test results for Maven artifact org.apache.maven.its:maven-it-helper:2.1-SNAPSHOT
generated by maven-surefire-plugin:test (default-test): core-it-support/maven-it-helper/target/surefire-reports/*.xml
[linuxJava7] Recording test results
[linuxJava7] ERROR: [withMaven] junitPublisher - Silently ignore exception archiving JUnit
results for Maven artifact MavenArtifact{org.apache.maven.its:maven-it-helper::2.1-SNAPSHOT(version:
2.1-SNAPSHOT, snapshot:false) } generated by PluginInvocation{org.apache.maven.plugins:maven-surefire-plugin:2.20.1@test
 default-test}: java.lang.RuntimeException: Failed to serialize hudson.tasks.junit.TestResult#suites
for class hudson.tasks.junit.TestResult
[linuxJava7] [withMaven] junitPublisher - Archive test results for Maven artifact org.apache.maven.its.plugins:maven-it-plugin-model-interpolation:2.1-SNAPSHOT
generated by maven-surefire-plugin:test (default-test): core-it-support/core-it-plugins/maven-it-plugin-model-interpolation/target/surefire-reports/*.xml
[linuxJava7] Recording test results
[linuxJava7] None of the test reports contained any result
[linuxJava7] [withMaven] junitPublisher - Archive test results for Maven artifact org.apache.maven.its.plugins:maven-it-plugin-no-default-comp:2.1-SNAPSHOT
generated by maven-surefire-plugin:test (default-test): core-it-support/core-it-plugins/maven-it-plugin-no-default-comp/target/surefire-reports/*.xml
[linuxJava7] Recording test results
[linuxJava7] None of the test reports contained any result
[linuxJava7] [withMaven] junitPublisher - Archive test results for Maven artifact org.apache.maven.its.plugins:maven-it-plugin-no-project:2.1-SNAPSHOT
generated by maven-surefire-plugin:test (default-test): core-it-support/core-it-plugins/maven-it-plugin-no-project/target/surefire-reports/*.xml
[linuxJava7] Recording test results
[linuxJava7] ERROR: [withMaven] junitPublisher - Silently ignore exception archiving JUnit
results for Maven artifact MavenArtifact{org.apache.maven.its.plugins:maven-it-plugin-no-project::2.1-SNAPSHOT(version:
2.1-SNAPSHOT, snapshot:false) } generated by PluginInvocation{org.apache.maven.plugins:maven-surefire-plugin:2.20.1@test
 default-test}: java.lang.RuntimeException: Failed to serialize hudson.tasks.junit.TestResult#suites
for class hudson.tasks.junit.TestResult
[linuxJava7] [withMaven] junitPublisher - Archive test results for Maven artifact org.apache.maven.its.plugins:maven-it-plugin-online:2.1-SNAPSHOT
generated by maven-surefire-plugin:test (default-test): core-it-support/core-it-plugins/maven-it-plugin-online/target/surefire-reports/*.xml
[linuxJava7] Recording test results
[linuxJava7] None of the test reports contained any result
[linuxJava7] [withMaven] junitPublisher - Archive test results for Maven artifact org.apache.maven.its.plugins:maven-it-plugin-optional-mojos:2.1-SNAPSHOT
generated by maven-surefire-plugin:test (default-test): core-it-support/core-it-plugins/maven-it-plugin-optional-mojos/target/surefire-reports/*.xml
[linuxJava7] Recording test results
[linuxJava7] None of the test reports contained any result
[linuxJava7] [withMaven] junitPublisher - Archive test results for Maven artifact org.apache.maven.its.plugins:maven-it-plugin-packaging:2.1-SNAPSHOT
generated by maven-surefire-plugin:test (default-test): core-it-support/core-it-plugins/maven-it-plugin-packaging/target/surefire-reports/*.xml
[linuxJava7] Recording test results
[linuxJava7] None of the test reports contained any result
[linuxJava7] [withMaven] junitPublisher - Archive test results for Maven artifact org.apache.maven.its.plugins:maven-it-plugin-parameter-implementation:2.1-SNAPSHOT
generated by maven-surefire-plugin:test (default-test): core-it-support/core-it-plugins/maven-it-plugin-parameter-implementation/target/surefire-reports/*.xml
[linuxJava7] Recording test results
[linuxJava7] None of the test reports contained any result
[linuxJava7] [withMaven] junitPublisher - Archive test results for Maven artifact org.apache.maven.its.plugins:maven-it-plugin-plugin-dependency:2.1-SNAPSHOT
generated by maven-surefire-plugin:test (default-test): core-it-support/core-it-plugins/maven-it-plugin-plugin-dependency/target/surefire-reports/*.xml
[linuxJava7] Recording test results
[linuxJava7] None of the test reports contained any result
[linuxJava7] [withMaven] junitPublisher - Archive test results for Maven artifact org.apache.maven.its.plugins:maven-it-plugin-project:2.1-SNAPSHOT
generated by maven-surefire-plugin:test (default-test): core-it-support/core-it-plugins/maven-it-plugin-project/target/surefire-reports/*.xml
[linuxJava7] Recording test results
[linuxJava7] ERROR: [withMaven] junitPublisher - Silently ignore exception archiving JUnit
results for Maven artifact MavenArtifact{org.apache.maven.its.plugins:maven-it-plugin-project::2.1-SNAPSHOT(version:
2.1-SNAPSHOT, snapshot:false) } generated by PluginInvocation{org.apache.maven.plugins:maven-surefire-plugin:2.20.1@test
 default-test}: java.lang.RuntimeException: Failed to serialize hudson.tasks.junit.TestResult#suites
for class hudson.tasks.junit.TestResult
[linuxJava7] [withMaven] junitPublisher - Archive test results for Maven artifact org.apache.maven.its.plugins:maven-it-plugin-project-interpolation:2.1-SNAPSHOT
generated by maven-surefire-plugin:test (default-test): core-it-support/core-it-plugins/maven-it-plugin-project-interpolation/target/surefire-reports/*.xml
[linuxJava7] Recording test results
[linuxJava7] None of the test reports contained any result
[linuxJava7] [withMaven] junitPublisher - Archive test results for Maven artifact org.apache.maven.its.plugins:maven-it-plugin-setter:2.1-SNAPSHOT
generated by maven-surefire-plugin:test (default-test): core-it-support/core-it-plugins/maven-it-plugin-setter/target/surefire-reports/*.xml
[linuxJava7] Recording test results
[linuxJava7] None of the test reports contained any result
[linuxJava7] [withMaven] junitPublisher - Archive test results for Maven artifact org.apache.maven.its.plugins:maven-it-plugin-singleton-component:2.1-SNAPSHOT
generated by maven-surefire-plugin:test (default-test): core-it-support/core-it-plugins/maven-it-plugin-singleton-component/target/surefire-reports/*.xml
[linuxJava7] Recording test results
[linuxJava7] ERROR: [withMaven] junitPublisher - Silently ignore exception archiving JUnit
results for Maven artifact MavenArtifact{org.apache.maven.its.plugins:maven-it-plugin-singleton-component::2.1-SNAPSHOT(version:
2.1-SNAPSHOT, snapshot:false) } generated by PluginInvocation{org.apache.maven.plugins:maven-surefire-plugin:2.20.1@test
 default-test}: java.lang.RuntimeException: Failed to serialize hudson.tasks.junit.TestResult#suites
for class hudson.tasks.junit.TestResult
[linuxJava7] [withMaven] junitPublisher - Archive test results for Maven artifact org.apache.maven.its.plugins:maven-it-plugin-site:2.1-SNAPSHOT
generated by maven-surefire-plugin:test (default-test): core-it-support/core-it-plugins/maven-it-plugin-site/target/surefire-reports/*.xml
[linuxJava7] Recording test results
[linuxJava7] None of the test reports contained any result
[linuxJava7] [withMaven] junitPublisher - Archive test results for Maven artifact org.apache.maven.its.plugins:maven-it-plugin-toolchain:2.1-SNAPSHOT
generated by maven-surefire-plugin:test (default-test): core-it-support/core-it-plugins/maven-it-plugin-toolchain/target/surefire-reports/*.xml
[linuxJava7] Recording test results
[linuxJava7] ERROR: [withMaven] junitPublisher - Silently ignore exception archiving JUnit
results for Maven artifact MavenArtifact{org.apache.maven.its.plugins:maven-it-plugin-toolchain::2.1-SNAPSHOT(version:
2.1-SNAPSHOT, snapshot:false) } generated by PluginInvocation{org.apache.maven.plugins:maven-surefire-plugin:2.20.1@test
 default-test}: java.lang.RuntimeException: Failed to serialize hudson.tasks.junit.TestResult#suites
for class hudson.tasks.junit.TestResult
[linuxJava7] [withMaven] junitPublisher - Archive test results for Maven artifact org.apache.maven.its.plugins:maven-it-plugin-touch:2.1-SNAPSHOT
generated by maven-surefire-plugin:test (default-test): core-it-support/core-it-plugins/maven-it-plugin-touch/target/surefire-reports/*.xml
[linuxJava7] Recording test results
[linuxJava7] None of the test reports contained any result
[linuxJava7] [withMaven] junitPublisher - Archive test results for Maven artifact org.apache.maven.its.plugins:maven-it-plugin-uses-properties:2.1-SNAPSHOT
generated by maven-surefire-plugin:test (default-test): core-it-support/core-it-plugins/maven-it-plugin-uses-properties/target/surefire-reports/*.xml
[linuxJava7] Recording test results
[linuxJava7] None of the test reports contained any result
[linuxJava7] [withMaven] junitPublisher - Archive test results for Maven artifact org.apache.maven.its.plugins:maven-it-plugin-uses-wagon:2.1-SNAPSHOT
generated by maven-surefire-plugin:test (default-test): core-it-support/core-it-plugins/maven-it-plugin-uses-wagon/target/surefire-reports/*.xml
[linuxJava7] Recording test results
[linuxJava7] None of the test reports contained any result
[linuxJava7] [withMaven] junitPublisher - Archive test results for Maven artifact org.apache.maven.its.plugins:maven-it-plugin-all:2.1-SNAPSHOT
generated by maven-surefire-plugin:test (default-test): core-it-support/core-it-plugins/maven-it-plugin-all/target/surefire-reports/*.xml
[linuxJava7] Recording test results
[linuxJava7] ERROR: [withMaven] junitPublisher - Silently ignore exception archiving JUnit
results for Maven artifact MavenArtifact{org.apache.maven.its.plugins:maven-it-plugin-all::2.1-SNAPSHOT(version:
2.1-SNAPSHOT, snapshot:false) } generated by PluginInvocation{org.apache.maven.plugins:maven-surefire-plugin:2.20.1@test
 default-test}: java.lang.RuntimeException: Failed to serialize hudson.tasks.junit.TestResult#suites
for class hudson.tasks.junit.TestResult
[linuxJava7] [withMaven] junitPublisher - Archive test results for Maven artifact org.apache.maven.its.plugins:maven-it-plugin-plexus-utils-11:2.1-SNAPSHOT
generated by maven-surefire-plugin:test (default-test): core-it-support/core-it-plugins/maven-it-plugin-plexus-utils-11/target/surefire-reports/*.xml
[linuxJava7] Recording test results
[linuxJava7] ERROR: [withMaven] junitPublisher - Silently ignore exception archiving JUnit
results for Maven artifact MavenArtifact{org.apache.maven.its.plugins:maven-it-plugin-plexus-utils-11::2.1-SNAPSHOT(version:
2.1-SNAPSHOT, snapshot:false) } generated by PluginInvocation{org.apache.maven.plugins:maven-surefire-plugin:2.20.1@test
 default-test}: java.lang.RuntimeException: Failed to serialize hudson.tasks.junit.TestResult#suites
for class hudson.tasks.junit.TestResult
[linuxJava7] [withMaven] junitPublisher - Archive test results for Maven artifact org.apache.maven.its.plugins:maven-it-plugin-plexus-utils-new:2.1-SNAPSHOT
generated by maven-surefire-plugin:test (default-test): core-it-support/core-it-plugins/maven-it-plugin-plexus-utils-new/target/surefire-reports/*.xml
[linuxJava7] Recording test results
[linuxJava7] ERROR: [withMaven] junitPublisher - Silently ignore exception archiving JUnit
results for Maven artifact MavenArtifact{org.apache.maven.its.plugins:maven-it-plugin-plexus-utils-new::2.1-SNAPSHOT(version:
2.1-SNAPSHOT, snapshot:false) } generated by PluginInvocation{org.apache.maven.plugins:maven-surefire-plugin:2.20.1@test
 default-test}: java.lang.RuntimeException: Failed to serialize hudson.tasks.junit.TestResult#suites
for class hudson.tasks.junit.TestResult
[linuxJava7] [withMaven] junitPublisher - Archive test results for Maven artifact org.apache.maven.its.plugins:maven-it-plugin-plexus-component-api:2.1-SNAPSHOT
generated by maven-surefire-plugin:test (default-test): core-it-support/core-it-plugins/maven-it-plugin-plexus-component-api/target/surefire-reports/*.xml
[linuxJava7] Recording test results
[linuxJava7] None of the test reports contained any result
[linuxJava7] [withMaven] junitPublisher - Archive test results for Maven artifact org.apache.maven.its.plugins:maven-it-plugin-log4j:2.1-SNAPSHOT
generated by maven-surefire-plugin:test (default-test): core-it-support/core-it-plugins/maven-it-plugin-log4j/target/surefire-reports/*.xml
[linuxJava7] Recording test results
[linuxJava7] ERROR: [withMaven] junitPublisher - Silently ignore exception archiving JUnit
results for Maven artifact MavenArtifact{org.apache.maven.its.plugins:maven-it-plugin-log4j::2.1-SNAPSHOT(version:
2.1-SNAPSHOT, snapshot:false) } generated by PluginInvocation{org.apache.maven.plugins:maven-surefire-plugin:2.20.1@test
 default-test}: java.lang.RuntimeException: Failed to serialize hudson.tasks.junit.TestResult#suites
for class hudson.tasks.junit.TestResult
[linuxJava7] [withMaven] junitPublisher - Archive test results for Maven artifact org.apache.maven.its.plugins:maven-it-plugin-extension1:2.1-SNAPSHOT
generated by maven-surefire-plugin:test (default-test): core-it-support/core-it-plugins/maven-it-plugin-extension1/target/surefire-reports/*.xml
[linuxJava7] Recording test results
[linuxJava7] None of the test reports contained any result
[linuxJava7] [withMaven] junitPublisher - Archive test results for Maven artifact org.apache.maven.its.plugins:maven-it-plugin-extension2:2.1-SNAPSHOT
generated by maven-surefire-plugin:test (default-test): core-it-support/core-it-plugins/maven-it-plugin-extension2/target/surefire-reports/*.xml
[linuxJava7] Recording test results
[linuxJava7] ERROR: [withMaven] junitPublisher - Silently ignore exception archiving JUnit
results for Maven artifact MavenArtifact{org.apache.maven.its.plugins:maven-it-plugin-extension2::2.1-SNAPSHOT(version:
2.1-SNAPSHOT, snapshot:false) } generated by PluginInvocation{org.apache.maven.plugins:maven-surefire-plugin:2.20.1@test
 default-test}: java.lang.InterruptedException
[linuxJava7] [withMaven] junitPublisher - Archive test results for Maven artifact org.apache.maven.its.plugins:maven-it-plugin-plexus-lifecycle:2.1-SNAPSHOT
generated by maven-surefire-plugin:test (default-test): core-it-support/core-it-plugins/maven-it-plugin-plexus-lifecycle/target/surefire-reports/*.xml
[linuxJava7] Recording test results
[linuxJava7] None of the test reports contained any result
[linuxJava7] [withMaven] junitPublisher - Archive test results for Maven artifact org.apache.maven.its.plugins:maven-it-plugin-settings:2.1-SNAPSHOT
generated by maven-surefire-plugin:test (default-test): core-it-support/core-it-plugins/maven-it-plugin-settings/target/surefire-reports/*.xml
[linuxJava7] Recording test results
[linuxJava7] ERROR: [withMaven] junitPublisher - Silently ignore exception archiving JUnit
results for Maven artifact MavenArtifact{org.apache.maven.its.plugins:maven-it-plugin-settings::2.1-SNAPSHOT(version:
2.1-SNAPSHOT, snapshot:false) } generated by PluginInvocation{org.apache.maven.plugins:maven-surefire-plugin:2.20.1@test
 default-test}: java.lang.RuntimeException: Failed to serialize hudson.tasks.junit.TestResult#suites
for class hudson.tasks.junit.TestResult
[linuxJava7] [withMaven] junitPublisher - Archive test results for Maven artifact org.apache.maven.its.plugins:mng-5805-pkg-type-mojo-configuration-extension:2.1-SNAPSHOT
generated by maven-surefire-plugin:test (default-test): core-it-support/core-it-plugins/mng5805-extension/target/surefire-reports/*.xml
[linuxJava7] Recording test results
[linuxJava7] ERROR: [withMaven] junitPublisher - Silently ignore exception archiving JUnit
results for Maven artifact MavenArtifact{org.apache.maven.its.plugins:mng-5805-pkg-type-mojo-configuration-extension::2.1-SNAPSHOT(version:
2.1-SNAPSHOT, snapshot:false) } generated by PluginInvocation{org.apache.maven.plugins:maven-surefire-plugin:2.20.1@test
 default-test}: java.lang.RuntimeException: Failed to serialize hudson.tasks.junit.TestResult#suites
for class hudson.tasks.junit.TestResult
[linuxJava7] [withMaven] junitPublisher - Archive test results for Maven artifact org.apache.maven.its.plugins:mng-5805-pkg-type-mojo-configuration-extension2:2.1-SNAPSHOT
generated by maven-surefire-plugin:test (default-test): core-it-support/core-it-plugins/mng5805-extension2/target/surefire-reports/*.xml
[linuxJava7] Recording test results
[linuxJava7] None of the test reports contained any result
[linuxJava7] [withMaven] junitPublisher - Archive test results for Maven artifact org.apache.maven.its.plugins:mng-5805-pkg-type-mojo-configuration-plugin:2.1-SNAPSHOT
generated by maven-surefire-plugin:test (default-test): core-it-support/core-it-plugins/mng5805-plugin/target/surefire-reports/*.xml
[linuxJava7] Recording test results
[linuxJava7] ERROR: [withMaven] junitPublisher - Silently ignore exception archiving JUnit
results for Maven artifact MavenArtifact{org.apache.maven.its.plugins:mng-5805-pkg-type-mojo-configuration-plugin::2.1-SNAPSHOT(version:
2.1-SNAPSHOT, snapshot:false) } generated by PluginInvocation{org.apache.maven.plugins:maven-surefire-plugin:2.20.1@test
 default-test}: java.lang.RuntimeException: Failed to serialize hudson.tasks.junit.TestResult#suites
for class hudson.tasks.junit.TestResult
[linuxJava7] [withMaven] junitPublisher - Archive test results for Maven artifact org.apache.maven.its.plugins:mng-5805-pkg-type-mojo-configuration-plugin-dep:2.1-SNAPSHOT
generated by maven-surefire-plugin:test (default-test): core-it-support/core-it-plugins/mng5805-plugin-dep/target/surefire-reports/*.xml
[linuxJava7] Recording test results
[linuxJava7] None of the test reports contained any result
[linuxJava7] [withMaven] junitPublisher - Archive test results for Maven artifact org.apache.maven.its.plugins:mng-5958-pkg-type-extension:2.1-SNAPSHOT
generated by maven-surefire-plugin:test (default-test): core-it-support/core-it-plugins/mng5958-extension/target/surefire-reports/*.xml
[linuxJava7] Recording test results
[linuxJava7] ERROR: [withMaven] junitPublisher - Silently ignore exception archiving JUnit
results for Maven artifact MavenArtifact{org.apache.maven.its.plugins:mng-5958-pkg-type-extension::2.1-SNAPSHOT(version:
2.1-SNAPSHOT, snapshot:false) } generated by PluginInvocation{org.apache.maven.plugins:maven-surefire-plugin:2.20.1@test
 default-test}: java.lang.RuntimeException: Failed to serialize hudson.tasks.junit.TestResult#suites
for class hudson.tasks.junit.TestResult
[linuxJava7] [withMaven] junitPublisher - Archive test results for Maven artifact org.apache.maven.its:core-it-toolchain:2.1-SNAPSHOT
generated by maven-surefire-plugin:test (default-test): core-it-support/core-it-toolchain/target/surefire-reports/*.xml
[linuxJava7] Recording test results
[linuxJava7] None of the test reports contained any result
[linuxJava7] [withMaven] junitPublisher - Archive test results for Maven artifact org.apache.maven.its:core-it-wagon:2.1-SNAPSHOT
generated by maven-surefire-plugin:test (default-test): core-it-support/core-it-wagon/target/surefire-reports/*.xml
[linuxJava7] Recording test results
[linuxJava7] ERROR: [withMaven] junitPublisher - Silently ignore exception archiving JUnit
results for Maven artifact MavenArtifact{org.apache.maven.its:core-it-wagon::2.1-SNAPSHOT(version:
2.1-SNAPSHOT, snapshot:false) } generated by PluginInvocation{org.apache.maven.plugins:maven-surefire-plugin:2.20.1@test
 default-test}: java.lang.RuntimeException: Failed to serialize hudson.tasks.junit.TestResult#suites
for class hudson.tasks.junit.TestResult
[linuxJava7] [withMaven] junitPublisher - Archive test results for Maven artifact org.apache.maven.its:core-it-extension:2.1-SNAPSHOT
generated by maven-surefire-plugin:test (default-test): core-it-support/core-it-extension/target/surefire-reports/*.xml
[linuxJava7] Recording test results
[linuxJava7] None of the test reports contained any result
[linuxJava7] [withMaven] junitPublisher - Archive test results for Maven artifact org.apache.maven.its:core-it-suite:2.1-SNAPSHOT
generated by maven-surefire-plugin:test (default-test): core-it-suite/target/surefire-reports/*.xml
[linuxJava7] Recording test results
[linuxJava7] ERROR: [withMaven] junitPublisher - Silently ignore exception archiving JUnit
results for Maven artifact MavenArtifact{org.apache.maven.its:core-it-suite::2.1-SNAPSHOT(version:
2.1-SNAPSHOT, snapshot:false) } generated by PluginInvocation{org.apache.maven.plugins:maven-surefire-plugin:2.20.1@test
 default-test}: java.lang.RuntimeException: Failed to serialize hudson.tasks.junit.TestResult#suites
for class hudson.tasks.junit.TestResult
[linuxJava7] ERROR: [withMaven] WARNING Exception processing the logs generated by the Jenkins
Maven Event Spy /home/jenkins/jenkins-slave/workspace/maven-box_maven_MNG-6386-LLX2LHIUAZ6VGRI3GUJ4WEAJPQUEJ2QQDYWXUIGOMQPZI7AFSMBA/test@tmp/withMavenae0b75e3/maven-spy-20180501-234753-519172247341424153165.log,
ignore file.  Please report a bug associated for the component 'pipeline-maven-plugin' at
https://issues.jenkins-ci.org 
[linuxJava7] java.lang.InterruptedException
[linuxJava7] 	at java.lang.Object.wait(Native Method)
[linuxJava7] 	at hudson.remoting.Request.call(Request.java:167)
[linuxJava7] 	at hudson.remoting.Channel.call(Channel.java:907)
[linuxJava7] 	at hudson.FilePath.act(FilePath.java:986)
[linuxJava7] 	at hudson.FilePath.act(FilePath.java:975)
[linuxJava7] 	at hudson.FilePath.exists(FilePath.java:1440)
[linuxJava7] 	at org.jenkinsci.plugins.pipeline.maven.MavenSpyLogProcessor.processMavenSpyLogs(MavenSpyLogProcessor.java:105)
[linuxJava7] 	at org.jenkinsci.plugins.pipeline.maven.WithMavenStepExecution$WorkspaceCleanupCallback.finished(WithMavenStepExecution.java:1015)
[linuxJava7] 	at org.jenkinsci.plugins.workflow.steps.BodyExecutionCallback$TailCall.onSuccess(BodyExecutionCallback.java:114)
[linuxJava7] 	at org.jenkinsci.plugins.workflow.cps.CpsBodyExecution$SuccessAdapter.receive(CpsBodyExecution.java:368)
[linuxJava7] 	at com.cloudbees.groovy.cps.Outcome.resumeFrom(Outcome.java:73)
[linuxJava7] 	at com.cloudbees.groovy.cps.Continuable$1.call(Continuable.java:166)
[linuxJava7] 	at com.cloudbees.groovy.cps.Continuable$1.call(Continuable.java:163)
[linuxJava7] 	at org.codehaus.groovy.runtime.GroovyCategorySupport$ThreadCategoryInfo.use(GroovyCategorySupport.java:122)
[linuxJava7] 	at org.codehaus.groovy.runtime.GroovyCategorySupport.use(GroovyCategorySupport.java:261)
[linuxJava7] 	at com.cloudbees.groovy.cps.Continuable.run0(Continuable.java:163)
[linuxJava7] 	at org.jenkinsci.plugins.workflow.cps.SandboxContinuable.access$001(SandboxContinuable.java:19)
[linuxJava7] 	at org.jenkinsci.plugins.workflow.cps.SandboxContinuable$1.call(SandboxContinuable.java:35)
[linuxJava7] 	at org.jenkinsci.plugins.workflow.cps.SandboxContinuable$1.call(SandboxContinuable.java:32)
[linuxJava7] 	at org.jenkinsci.plugins.scriptsecurity.sandbox.groovy.GroovySandbox.runInSandbox(GroovySandbox.java:108)
[linuxJava7] 	at org.jenkinsci.plugins.workflow.cps.SandboxContinuable.run0(SandboxContinuable.java:32)
[linuxJava7] 	at org.jenkinsci.plugins.workflow.cps.CpsThread.runNextChunk(CpsThread.java:174)
[linuxJava7] 	at org.jenkinsci.plugins.workflow.cps.CpsThreadGroup.run(CpsThreadGroup.java:331)
[linuxJava7] 	at org.jenkinsci.plugins.workflow.cps.CpsThreadGroup.access$200(CpsThreadGroup.java:82)
[linuxJava7] 	at org.jenkinsci.plugins.workflow.cps.CpsThreadGroup$2.call(CpsThreadGroup.java:243)
[linuxJava7] 	at org.jenkinsci.plugins.workflow.cps.CpsThreadGroup$2.call(CpsThreadGroup.java:231)
[linuxJava7] 	at org.jenkinsci.plugins.workflow.cps.CpsVmExecutorService$2.call(CpsVmExecutorService.java:64)
[linuxJava7] 	at java.util.concurrent.FutureTask.run(FutureTask.java:266)
[linuxJava7] 	at hudson.remoting.SingleLaneExecutorService$1.run(SingleLaneExecutorService.java:112)
[linuxJava7] 	at jenkins.util.ContextResettingExecutorService$1.run(ContextResettingExecutorService.java:28)
[linuxJava7] 	at java.util.concurrent.Executors$RunnableAdapter.call(Executors.java:511)
[linuxJava7] 	at java.util.concurrent.FutureTask.run(FutureTask.java:266)
[linuxJava7] 	at java.util.concurrent.ThreadPoolExecutor.runWorker(ThreadPoolExecutor.java:1149)
[linuxJava7] 	at java.util.concurrent.ThreadPoolExecutor$Worker.run(ThreadPoolExecutor.java:624)
[linuxJava7] 	at java.lang.Thread.run(Thread.java:748)
[Pipeline] [linuxJava8] deleteDir
[Pipeline] [linuxJava7] // withMaven
[Pipeline] [linuxJava7] deleteDir
[Pipeline] [linuxJava8] }
[Pipeline] [linuxJava8] // dir
[Pipeline] [linuxJava7] }
[Pipeline] [linuxJava8] }
[Pipeline] [linuxJava7] // dir
[Pipeline] [linuxJava8] // stage
[Pipeline] [linuxJava7] }
[Pipeline] [linuxJava8] }
[Pipeline] [linuxJava7] // stage
[Pipeline] [linuxJava8] // node
[Pipeline] [linuxJava8] }
[Pipeline] [linuxJava7] }
[Pipeline] [linuxJava7] // node
[Pipeline] [linuxJava7] }
[Pipeline] // parallel
[Pipeline] stage
[Pipeline] { (Notifications)
[Pipeline] echo
Build result: UNSTABLE
[Pipeline] jiraIssueSelector
[Pipeline] jiraComment
Mime
  • Unnamed multipart/mixed (inline, None, 0 bytes)
View raw message