maven-notifications mailing list archives

Site index · List index
Message view « Date » · « Thread »
Top « Date » · « Thread »
From Apache Jenkins Server <jenk...@builds.apache.org>
Subject Build failed in Jenkins: Maven TLP » maven-pdf-plugin » master #15
Date Fri, 11 May 2018 14:35:11 GMT
See https://builds.apache.org/job/maven-box/job/maven-pdf-plugin/job/master/15/

Changes:

* Add Java 11-ea
* [MNGSITE-328] use sha1 checksum instead of md5

All tests passed

Build log:
[...truncated 378.04 KB...]
[windows-jdk9] [INFO] Tests run: 3, Failures: 0, Errors: 0, Skipped: 0, Time elapsed: 0.172
s - in org.apache.maven.plugins.pdf.DocumentModelBuilderTest
[windows-jdk9] [INFO] Running org.apache.maven.plugins.pdf.PdfMojoTest
[windows-jdk9] [INFO] Tests run: 3, Failures: 0, Errors: 0, Skipped: 0, Time elapsed: 0.164
s - in org.apache.maven.plugins.pdf.PdfMojoTest
[windows-jdk9] [INFO] 
[windows-jdk9] [INFO] Results:
[windows-jdk9] [INFO] 
[windows-jdk9] [INFO] Tests run: 9, Failures: 0, Errors: 0, Skipped: 0
[windows-jdk9] [INFO] 
[windows-jdk9] [INFO] 
[windows-jdk9] [INFO] --- maven-jar-plugin:3.0.2:jar (default-jar) @ maven-pdf-plugin ---
[windows-jdk9] [INFO] Building jar: f:\jenkins\jenkins-slave\workspace\box_maven-pdf-plugin_master-FPCFJFGXNRRHGLAILVNFYWPL2XYTEX5DLUMGNQ6QU547MZNTAW3Q\m\target\maven-pdf-plugin-1.5-SNAPSHOT.jar
[windows-jdk9] [INFO] 
[windows-jdk9] [INFO] --- maven-plugin-plugin:3.5.1:addPluginArtifactMetadata (default-addPluginArtifactMetadata)
@ maven-pdf-plugin ---
[windows-jdk9] [INFO] 
[windows-jdk9] [INFO] --- maven-site-plugin:3.7:attach-descriptor (attach-descriptor) @ maven-pdf-plugin
---
[windows-jdk9] [INFO] Skipping because packaging 'maven-plugin' is not pom.
[windows-jdk9] [INFO] 
[windows-jdk9] [INFO] --- maven-invoker-plugin:3.0.1:install (integration-test) @ maven-pdf-plugin
---
[windows-jdk9] [INFO] Installing f:\jenkins\jenkins-slave\workspace\box_maven-pdf-plugin_master-FPCFJFGXNRRHGLAILVNFYWPL2XYTEX5DLUMGNQ6QU547MZNTAW3Q\m\pom.xml
to f:\jenkins\jenkins-slave\workspace\box_maven-pdf-plugin_master-FPCFJFGXNRRHGLAILVNFYWPL2XYTEX5DLUMGNQ6QU547MZNTAW3Q\m\target\local-repo\org\apache\maven\plugins\maven-pdf-plugin\1.5-SNAPSHOT\maven-pdf-plugin-1.5-SNAPSHOT.pom
[windows-jdk9] [INFO] Installing f:\jenkins\jenkins-slave\workspace\box_maven-pdf-plugin_master-FPCFJFGXNRRHGLAILVNFYWPL2XYTEX5DLUMGNQ6QU547MZNTAW3Q\m\target\maven-pdf-plugin-1.5-SNAPSHOT.jar
to f:\jenkins\jenkins-slave\workspace\box_maven-pdf-plugin_master-FPCFJFGXNRRHGLAILVNFYWPL2XYTEX5DLUMGNQ6QU547MZNTAW3Q\m\target\local-repo\org\apache\maven\plugins\maven-pdf-plugin\1.5-SNAPSHOT\maven-pdf-plugin-1.5-SNAPSHOT.jar
[windows-jdk9] [INFO] 
[windows-jdk9] [INFO] --- maven-invoker-plugin:3.0.1:integration-test (integration-test) @
maven-pdf-plugin ---
[windows-jdk9] [INFO] Running Setup Jobs
[windows-jdk9] [INFO] Building: descriptor\pom.xml
[windows-jdk9] [INFO] run post-build script verify.groovy
[windows-jdk9] WARNING: An illegal reflective access operation has occurred
[windows-jdk9] WARNING: Illegal reflective access by org.codehaus.groovy.reflection.CachedClass
(file:/f:/jenkins/jenkins-slave/workspace/box_maven-pdf-plugin_master-FPCFJFGXNRRHGLAILVNFYWPL2XYTEX5DLUMGNQ6QU547MZNTAW3Q/.repository/org/codehaus/groovy/groovy-all/2.4.8/groovy-all-2.4.8.jar)
to method java.lang.Object.finalize()
[windows-jdk9] WARNING: Please consider reporting this to the maintainers of org.codehaus.groovy.reflection.CachedClass
[windows-jdk9] WARNING: Use --illegal-access=warn to enable warnings of further illegal reflective
access operations
[windows-jdk9] WARNING: All illegal access operations will be denied in a future release
[windows-jdk9] [INFO]           descriptor\pom.xml ............................... SUCCESS
(15.2 s)
[windows-jdk9] [INFO] Building: fop-basic\pom.xml
[windows-jdk9] [INFO] run post-build script verify.bsh
[windows-jdk9] [INFO]           fop-basic\pom.xml ................................ SUCCESS
(15.5 s)
[windows-jdk9] [INFO] Building: no-site\pom.xml
[windows-jdk9] [INFO] run post-build script verify.bsh
[windows-jdk9] [INFO]           no-site\pom.xml .................................. SUCCESS
(10.6 s)
[windows-jdk9] [INFO] Building: pdf-with-reporting-section\pom.xml
[windows-jdk9] [INFO] run post-build script verify.bsh
[windows-jdk9] [INFO]           pdf-with-reporting-section\pom.xml ............... SUCCESS
(16.0 s)
[windows-jdk9] [INFO] 
[windows-jdk9] [INFO] --- maven-checkstyle-plugin:3.0.0:check (checkstyle-check) @ maven-pdf-plugin
---
[windows-jdk9] [INFO] Downloading: https://repo.maven.apache.org/maven2/javax/xml/bind/jaxb-api/2.3.0/jaxb-api-2.3.0.pom
[windows-jdk9] [INFO] Downloaded: https://repo.maven.apache.org/maven2/javax/xml/bind/jaxb-api/2.3.0/jaxb-api-2.3.0.pom
(23 kB at 821 kB/s)
[windows-jdk9] [INFO] Downloading: https://repo.maven.apache.org/maven2/javax/xml/bind/jaxb-api-parent/2.3.0/jaxb-api-parent-2.3.0.pom
[windows-jdk9] [INFO] Downloaded: https://repo.maven.apache.org/maven2/javax/xml/bind/jaxb-api-parent/2.3.0/jaxb-api-parent-2.3.0.pom
(5.6 kB at 627 kB/s)
[windows-jdk9] [INFO] Downloading: https://repo.maven.apache.org/maven2/net/java/jvnet-parent/5/jvnet-parent-5.pom
[windows-jdk9] [INFO] Downloaded: https://repo.maven.apache.org/maven2/net/java/jvnet-parent/5/jvnet-parent-5.pom
(8.9 kB at 886 kB/s)
[windows-jdk9] [INFO] Downloading: https://repo.maven.apache.org/maven2/javax/xml/bind/jaxb-api/2.3.0/jaxb-api-2.3.0.jar
[windows-jdk9] [INFO] Downloaded: https://repo.maven.apache.org/maven2/javax/xml/bind/jaxb-api/2.3.0/jaxb-api-2.3.0.jar
(126 kB at 4.3 MB/s)
[windows-jdk9] [INFO] 
[windows-jdk9] [INFO] --- maven-invoker-plugin:3.0.1:verify (integration-test) @ maven-pdf-plugin
---
[windows-jdk9] [INFO] -------------------------------------------------
[windows-jdk9] [INFO] Build Summary:
[windows-jdk9] [INFO]   Passed: 4, Failed: 0, Errors: 0, Skipped: 0
[windows-jdk9] [INFO] -------------------------------------------------
[windows-jdk9] [INFO] ------------------------------------------------------------------------
[windows-jdk9] [INFO] BUILD SUCCESS
[windows-jdk9] [INFO] ------------------------------------------------------------------------
[windows-jdk9] [INFO] Total time: 01:23 min
[windows-jdk9] [INFO] Finished at: 2018-05-11T14:34:40Z
[windows-jdk9] [INFO] Final Memory: 52M/175M
[windows-jdk9] [INFO] ------------------------------------------------------------------------
[windows-jdk9] [INFO] [jenkins-event-spy] Generated F:\jenkins\jenkins-slave\workspace\box_maven-pdf-plugin_master-FPCFJFGXNRRHGLAILVNFYWPL2XYTEX5DLUMGNQ6QU547MZNTAW3Q@tmp\withMaven72556fe7\maven-spy-20180511-143316-51314122418472901432522.log
[Pipeline] [windows-jdk9] }
[Pipeline] [windows-jdk9] // dir
[Pipeline] [windows-jdk9] }
[windows-jdk9] [withMaven] junitPublisher - Archive test results for Maven artifact org.apache.maven.plugins:maven-pdf-plugin:1.5-SNAPSHOT
generated by maven-surefire-plugin:test (default-test): m\target\surefire-reports\*.xml
[windows-jdk9] Recording test results
[Pipeline] [windows-jdk9] // withMaven
[Pipeline] [windows-jdk9] }
[Pipeline] [windows-jdk9] // stage
[Pipeline] [windows-jdk9] }
[Pipeline] [windows-jdk9] // node
[Pipeline] [windows-jdk9] }
[windows-jdk10] Running on windows-2012-3 in f:\jenkins\jenkins-slave\workspace\box_maven-pdf-plugin_master-FPCFJFGXNRRHGLAILVNFYWPL2XYTEX5DLUMGNQ6QU547MZNTAW3Q
[Pipeline] [windows-jdk10] {
[Pipeline] [windows-jdk10] stage
[Pipeline] [windows-jdk10] { (Checkout windows-jdk10)
[Pipeline] [windows-jdk10] dir
[windows-jdk10] Running in f:\jenkins\jenkins-slave\workspace\box_maven-pdf-plugin_master-FPCFJFGXNRRHGLAILVNFYWPL2XYTEX5DLUMGNQ6QU547MZNTAW3Q\m
[Pipeline] [windows-jdk10] {
[Pipeline] [windows-jdk10] checkout
[windows-jdk10]  > git rev-parse --is-inside-work-tree # timeout=10
[windows-jdk10] Fetching changes from the remote Git repository
[windows-jdk10]  > git config remote.origin.url https://gitbox.apache.org/repos/asf/maven-pdf-plugin.git
# timeout=10
[windows-jdk10] Fetching without tags
[windows-jdk10] Fetching upstream changes from https://gitbox.apache.org/repos/asf/maven-pdf-plugin.git
[windows-jdk10]  > git --version # timeout=10
[windows-jdk10]  > git fetch --no-tags --progress https://gitbox.apache.org/repos/asf/maven-pdf-plugin.git
+refs/heads/*:refs/remotes/origin/*
[windows-jdk10] Checking out Revision 5cc747495407a3735347eb6b69fe375275c16785 (master)
[windows-jdk10]  > git config core.sparsecheckout # timeout=10
[windows-jdk10]  > git checkout -f 5cc747495407a3735347eb6b69fe375275c16785
[windows-jdk10] Commit message: "[MNGSITE-328] use sha1 checksum instead of md5"
[windows-jdk10] Cleaning workspace
[windows-jdk10]  > git rev-parse --verify HEAD # timeout=10
[windows-jdk10] Resetting working tree
[windows-jdk10]  > git reset --hard # timeout=10
[windows-jdk10]  > git clean -fdx # timeout=10
[Pipeline] [windows-jdk10] }
[Pipeline] [windows-jdk10] // dir
[Pipeline] [windows-jdk10] }
[Pipeline] [windows-jdk10] // stage
[Pipeline] [windows-jdk10] stage
[Pipeline] [windows-jdk10] { (Build windows-jdk10)
[Pipeline] [windows-jdk10] withMaven
[windows-jdk10] [withMaven] Options: [org.jenkinsci.plugins.pipeline.maven.publishers.GeneratedArtifactsPublisher[disabled=true],
org.jenkinsci.plugins.pipeline.maven.publishers.JunitTestsPublisher[disabled=false], org.jenkinsci.plugins.pipeline.maven.publishers.FindbugsAnalysisPublisher[disabled=true],
org.jenkinsci.plugins.pipeline.maven.publishers.TasksScannerPublisher[disabled=true], org.jenkinsci.plugins.pipeline.maven.publishers.DependenciesFingerprintPublisher[disabled=false,
scopes=[compile, provided, runtime], versions={snapshot:true, release:false}], org.jenkinsci.plugins.pipeline.maven.publishers.InvokerRunsPublisher[disabled=false],
org.jenkinsci.plugins.pipeline.maven.publishers.PipelineGraphPublisher[disabled=false, scopes=[compile,
provided, runtime], versions={snapshot:true, release:false}, skipDownstreamTriggers=false,
lifecycleThreshold=deploy, ignoreUpstreamTriggers=false]]
[windows-jdk10] [withMaven] Available options: 
[windows-jdk10] [withMaven] using JDK installation JDK 10 b46 (Windows Only)
[windows-jdk10] [withMaven] using Maven installation 'Maven 3.5.0 (Windows)'
[Pipeline] [windows-jdk10] {
[Pipeline] [windows-jdk10] dir
[windows-jdk10] Running in f:\jenkins\jenkins-slave\workspace\box_maven-pdf-plugin_master-FPCFJFGXNRRHGLAILVNFYWPL2XYTEX5DLUMGNQ6QU547MZNTAW3Q\m
[Pipeline] [windows-jdk10] {
[Pipeline] [windows-jdk10] isUnix
[Pipeline] [windows-jdk10] bat
[windows-jdk10] [m] Running batch script
[windows-jdk10] 
[windows-jdk10] f:\jenkins\jenkins-slave\workspace\box_maven-pdf-plugin_master-FPCFJFGXNRRHGLAILVNFYWPL2XYTEX5DLUMGNQ6QU547MZNTAW3Q\m>mvn
-P+run-its -Dmaven.test.failure.ignore=true -Dfindbugs.failOnError=false -Dfindbugs.skip=true
clean verify 
[windows-jdk10] ----- withMaven Wrapper script -----
[windows-jdk10] Picked up JAVA_TOOL_OPTIONS: -Dmaven.ext.class.path="f:\jenkins\jenkins-slave\workspace\box_maven-pdf-plugin_master-FPCFJFGXNRRHGLAILVNFYWPL2XYTEX5DLUMGNQ6QU547MZNTAW3Q@tmp\withMaven295ffeba\pipeline-maven-spy.jar"
-Dorg.jenkinsci.plugins.pipeline.maven.reportsFolder="f:\jenkins\jenkins-slave\workspace\box_maven-pdf-plugin_master-FPCFJFGXNRRHGLAILVNFYWPL2XYTEX5DLUMGNQ6QU547MZNTAW3Q@tmp\withMaven295ffeba"

[windows-jdk10] Apache Maven 3.5.0 (ff8f5e7444045639af65f6095c62210b5713f426; 2017-04-03T19:39:06Z)
[windows-jdk10] Maven home: F:\jenkins\tools\maven\apache-maven-3.5.0\bin\..
[windows-jdk10] Java version: 10, vendor: Oracle Corporation
[windows-jdk10] Java home: F:\jenkins\tools\java\jdk10_46
[windows-jdk10] Default locale: en_US, platform encoding: Cp1252
[windows-jdk10] OS name: "windows server 2012 r2", version: "6.3", arch: "amd64", family:
"windows"
[windows-jdk10] [INFO] [jenkins-event-spy] Generate F:\jenkins\jenkins-slave\workspace\box_maven-pdf-plugin_master-FPCFJFGXNRRHGLAILVNFYWPL2XYTEX5DLUMGNQ6QU547MZNTAW3Q@tmp\withMaven295ffeba\maven-spy-20180511-143446-7945304548449435697591.log.tmp
...
[windows-jdk10] [INFO] Scanning for projects...
[windows-jdk10] [INFO] 
[windows-jdk10] [INFO] ------------------------------------------------------------------------
[windows-jdk10] [INFO] Building Apache Maven PDF Plugin 1.5-SNAPSHOT
[windows-jdk10] [INFO] ------------------------------------------------------------------------
[windows-jdk10] [INFO] 
[windows-jdk10] [INFO] --- maven-clean-plugin:3.0.0:clean (default-clean) @ maven-pdf-plugin
---
[windows-jdk10] [INFO] 
[windows-jdk10] [INFO] --- maven-enforcer-plugin:1.4.1:enforce (enforce-maven-version) @ maven-pdf-plugin
---
[windows-jdk10] [INFO] 
[windows-jdk10] [INFO] --- maven-enforcer-plugin:1.4.1:enforce (enforce-bytecode-version)
@ maven-pdf-plugin ---
[windows-jdk10] [INFO] 
[windows-jdk10] [INFO] --- maven-enforcer-plugin:1.4.1:enforce (ban-known-bad-maven-versions)
@ maven-pdf-plugin ---
[windows-jdk10] [INFO] 
[windows-jdk10] [INFO] --- maven-enforcer-plugin:1.4.1:enforce (ensure-no-container-api) @
maven-pdf-plugin ---
[windows-jdk10] [INFO] 
[windows-jdk10] [INFO] --- apache-rat-plugin:0.12:check (rat-check) @ maven-pdf-plugin ---
[windows-jdk10] [INFO] Enabled default license matchers.
[windows-jdk10] [INFO] Will parse SCM ignores for exclusions...
[windows-jdk10] [INFO] Parsing exclusions from f:\jenkins\jenkins-slave\workspace\box_maven-pdf-plugin_master-FPCFJFGXNRRHGLAILVNFYWPL2XYTEX5DLUMGNQ6QU547MZNTAW3Q\m\.gitignore
[windows-jdk10] [INFO] Finished adding exclusions from SCM ignore files.
[windows-jdk10] [INFO] 71 implicit excludes (use -debug for more details).
[windows-jdk10] [INFO] Exclude: .repository/**
[windows-jdk10] [INFO] Exclude: .maven/spy.log
[windows-jdk10] [INFO] Exclude: dependency-reduced-pom.xml
[windows-jdk10] [INFO] Exclude: .java-version
[windows-jdk10] [INFO] 73 resources included (use -debug for more details)
[windows-jdk10] [INFO] Rat check: Summary over all files. Unapproved: 0, unknown: 0, generated:
0, approved: 73 licenses.
[windows-jdk10] [INFO] 
[windows-jdk10] [INFO] --- maven-plugin-plugin:3.5.1:helpmojo (generate-helpmojo) @ maven-pdf-plugin
---
[windows-jdk10] [INFO] Using 'UTF-8' encoding to read mojo source files.
[windows-jdk10] [INFO] java-javadoc mojo extractor found 0 mojo descriptor.
[windows-jdk10] [INFO] java-annotations mojo extractor found 0 mojo descriptor.
[windows-jdk10] [INFO] 
[windows-jdk10] [INFO] --- maven-remote-resources-plugin:1.5:process (process-resource-bundles)
@ maven-pdf-plugin ---
[windows-jdk10] [INFO] 
[windows-jdk10] [INFO] --- maven-resources-plugin:3.0.2:resources (default-resources) @ maven-pdf-plugin
---
[windows-jdk10] [INFO] Using 'UTF-8' encoding to copy filtered resources.
[windows-jdk10] [INFO] Copying 7 resources
[windows-jdk10] [INFO] Copying 3 resources
[windows-jdk10] [INFO] 
[windows-jdk10] [INFO] --- maven-compiler-plugin:3.7.0:compile (default-compile) @ maven-pdf-plugin
---
[windows-jdk10] [INFO] Changes detected - recompiling the module!
[windows-jdk10] [INFO] Compiling 5 source files to f:\jenkins\jenkins-slave\workspace\box_maven-pdf-plugin_master-FPCFJFGXNRRHGLAILVNFYWPL2XYTEX5DLUMGNQ6QU547MZNTAW3Q\m\target\classes
[windows-jdk10] [INFO] /f:/jenkins/jenkins-slave/workspace/box_maven-pdf-plugin_master-FPCFJFGXNRRHGLAILVNFYWPL2XYTEX5DLUMGNQ6QU547MZNTAW3Q/m/src/main/java/org/apache/maven/plugins/pdf/PdfMojo.java:
f:\jenkins\jenkins-slave\workspace\box_maven-pdf-plugin_master-FPCFJFGXNRRHGLAILVNFYWPL2XYTEX5DLUMGNQ6QU547MZNTAW3Q\m\src\main\java\org\apache\maven\plugins\pdf\PdfMojo.java
uses or overrides a deprecated API.
[windows-jdk10] [INFO] /f:/jenkins/jenkins-slave/workspace/box_maven-pdf-plugin_master-FPCFJFGXNRRHGLAILVNFYWPL2XYTEX5DLUMGNQ6QU547MZNTAW3Q/m/src/main/java/org/apache/maven/plugins/pdf/PdfMojo.java:
Recompile with -Xlint:deprecation for details.
[windows-jdk10] [INFO] /f:/jenkins/jenkins-slave/workspace/box_maven-pdf-plugin_master-FPCFJFGXNRRHGLAILVNFYWPL2XYTEX5DLUMGNQ6QU547MZNTAW3Q/m/src/main/java/org/apache/maven/plugins/pdf/PdfMojo.java:
f:\jenkins\jenkins-slave\workspace\box_maven-pdf-plugin_master-FPCFJFGXNRRHGLAILVNFYWPL2XYTEX5DLUMGNQ6QU547MZNTAW3Q\m\src\main\java\org\apache\maven\plugins\pdf\PdfMojo.java
uses unchecked or unsafe operations.
[windows-jdk10] [INFO] /f:/jenkins/jenkins-slave/workspace/box_maven-pdf-plugin_master-FPCFJFGXNRRHGLAILVNFYWPL2XYTEX5DLUMGNQ6QU547MZNTAW3Q/m/src/main/java/org/apache/maven/plugins/pdf/PdfMojo.java:
Recompile with -Xlint:unchecked for details.
[windows-jdk10] [INFO] 
[windows-jdk10] [INFO] --- maven-plugin-plugin:3.5.1:descriptor (default-descriptor) @ maven-pdf-plugin
---
[windows-jdk10] [INFO] Using 'UTF-8' encoding to read mojo source files.
[windows-jdk10] [INFO] java-javadoc mojo extractor found 0 mojo descriptor.
[windows-jdk10] [INFO] java-annotations mojo extractor found 2 mojo descriptors.
[windows-jdk10] [INFO] 
[windows-jdk10] [INFO] --- maven-resources-plugin:3.0.2:testResources (default-testResources)
@ maven-pdf-plugin ---
[windows-jdk10] [INFO] Using 'UTF-8' encoding to copy filtered resources.
[windows-jdk10] [INFO] Copying 14 resources
[windows-jdk10] [INFO] Copying 3 resources
[windows-jdk10] [INFO] 
[windows-jdk10] [INFO] --- maven-compiler-plugin:3.7.0:testCompile (default-testCompile) @
maven-pdf-plugin ---
[windows-jdk10] [INFO] Changes detected - recompiling the module!
[windows-jdk10] [INFO] Compiling 8 source files to f:\jenkins\jenkins-slave\workspace\box_maven-pdf-plugin_master-FPCFJFGXNRRHGLAILVNFYWPL2XYTEX5DLUMGNQ6QU547MZNTAW3Q\m\target\test-classes
[windows-jdk10] [INFO] /f:/jenkins/jenkins-slave/workspace/box_maven-pdf-plugin_master-FPCFJFGXNRRHGLAILVNFYWPL2XYTEX5DLUMGNQ6QU547MZNTAW3Q/m/src/test/java/org/apache/maven/plugins/pdf/stubs/ModelBuilderMavenProjectStub.java:
f:\jenkins\jenkins-slave\workspace\box_maven-pdf-plugin_master-FPCFJFGXNRRHGLAILVNFYWPL2XYTEX5DLUMGNQ6QU547MZNTAW3Q\m\src\test\java\org\apache\maven\plugins\pdf\stubs\ModelBuilderMavenProjectStub.java
uses unchecked or unsafe operations.
[windows-jdk10] [INFO] /f:/jenkins/jenkins-slave/workspace/box_maven-pdf-plugin_master-FPCFJFGXNRRHGLAILVNFYWPL2XYTEX5DLUMGNQ6QU547MZNTAW3Q/m/src/test/java/org/apache/maven/plugins/pdf/stubs/ModelBuilderMavenProjectStub.java:
Recompile with -Xlint:unchecked for details.
[windows-jdk10] [INFO] 
[windows-jdk10] [INFO] --- maven-surefire-plugin:2.20.1:test (default-test) @ maven-pdf-plugin
---
[windows-jdk10] [INFO] ------------------------------------------------------------------------
[windows-jdk10] [INFO] BUILD FAILURE
[windows-jdk10] [INFO] ------------------------------------------------------------------------
[windows-jdk10] [INFO] Total time: 21.170 s
[windows-jdk10] [INFO] Finished at: 2018-05-11T14:35:08Z
[windows-jdk10] [INFO] Final Memory: 41M/144M
[windows-jdk10] [INFO] ------------------------------------------------------------------------
[windows-jdk10] [INFO] [jenkins-event-spy] Generated F:\jenkins\jenkins-slave\workspace\box_maven-pdf-plugin_master-FPCFJFGXNRRHGLAILVNFYWPL2XYTEX5DLUMGNQ6QU547MZNTAW3Q@tmp\withMaven295ffeba\maven-spy-20180511-143446-7945304548449435697591.log
[windows-jdk10] [ERROR] Failed to execute goal org.apache.maven.plugins:maven-surefire-plugin:2.20.1:test
(default-test) on project maven-pdf-plugin: Execution default-test of goal org.apache.maven.plugins:maven-surefire-plugin:2.20.1:test
failed. NullPointerException -> [Help 1]
[windows-jdk10] [ERROR] 
[windows-jdk10] [ERROR] To see the full stack trace of the errors, re-run Maven with the -e
switch.
[windows-jdk10] [ERROR] Re-run Maven using the -X switch to enable full debug logging.
[windows-jdk10] [ERROR] 
[windows-jdk10] [ERROR] For more information about the errors and possible solutions, please
read the following articles:
[windows-jdk10] [ERROR] [Help 1] http://cwiki.apache.org/confluence/display/MAVEN/PluginExecutionException
[Pipeline] [windows-jdk10] }
[Pipeline] [windows-jdk10] // dir
[Pipeline] [windows-jdk10] }
[windows-jdk10] [withMaven] junitPublisher - Archive test results for Maven artifact org.apache.maven.plugins:maven-pdf-plugin:1.5-SNAPSHOT
generated by maven-surefire-plugin:test (default-test): m\target\surefire-reports\*.xml
[windows-jdk10] Recording test results
[windows-jdk10] None of the test reports contained any result
[Pipeline] [windows-jdk10] // withMaven
[Pipeline] [windows-jdk10] echo
[windows-jdk10] [FAIL FAST] This is the first failure and likely root cause
[Pipeline] [windows-jdk10] }
[Pipeline] [windows-jdk10] // stage
[Pipeline] [windows-jdk10] }
[Pipeline] [windows-jdk10] // node
[Pipeline] [windows-jdk10] }
[windows-jdk10] Failed in branch windows-jdk10
[Pipeline] [linux-jdk7] // node
[Pipeline] [linux-jdk8] // node
[Pipeline] [linux-jdk9] // node
[Pipeline] [linux-jdk10] // node
[Pipeline] [linux-jdk7] }
[linux-jdk7] Failed in branch linux-jdk7
[Pipeline] [linux-jdk8] }
[linux-jdk8] Failed in branch linux-jdk8
[Pipeline] [linux-jdk9] }
[linux-jdk9] Failed in branch linux-jdk9
[Pipeline] [linux-jdk10] }
[linux-jdk10] Failed in branch linux-jdk10
[Pipeline] // parallel
[Pipeline] echo
***** FAST FAILURE *****

Fast failure triggered by windows-jdk10

***** FAST FAILURE *****
[Pipeline] stage
[Pipeline] { (Notifications)
[Pipeline] echo
Build result: FAILURE
[Pipeline] jiraIssueSelector
[Pipeline] jiraComment
Mime
  • Unnamed multipart/mixed (inline, None, 0 bytes)
View raw message