maven-notifications mailing list archives

Site index · List index
Message view « Date » · « Thread »
Top « Date » · « Thread »
From Apache Jenkins Server <jenk...@builds.apache.org>
Subject Build failed in Jenkins: Maven TLP » maven-plugin-tools » master #28
Date Sun, 20 May 2018 09:47:22 GMT
See https://builds.apache.org/job/maven-box/job/maven-plugin-tools/job/master/28/

Changes:

* enable TLS 1.2 for Java 7
* [MPLUGIN-334] - Upgrade mave-surefire/failsafe-plugin 2.21.0
* [MPLUGIN-334] - Upgrade mave-surefire/failsafe-plugin 2.21.0
* [MPLUGIN-334] - Upgrade mave-surefire/failsafe-plugin 2.21.0
* [MPLUGIN-334] - Upgrade mave-surefire/failsafe-plugin 2.21.0
* [MPLUGIN-334] - Upgrade mave-surefire/failsafe-plugin 2.21.0
* [MPLUGIN-334] - Upgrade mave-surefire/failsafe-plugin 2.21.0
* [MPLUGIN-334] - Upgrade mave-surefire/failsafe-plugin 2.21.0
* [MPLUGIN-334] - Upgrade mave-surefire/failsafe-plugin 2.21.0

All tests passed

Build log:
[...truncated 3.28 MB...]
[windows-jdk7] [INFO] -------------------------------------------------------
[windows-jdk7] [INFO] Running org.apache.maven.tools.plugin.extractor.ant.AntMojoDescriptorExtractorTest
[windows-jdk7] [INFO] Tests run: 1, Failures: 0, Errors: 0, Skipped: 0, Time elapsed: 0.061
s - in org.apache.maven.tools.plugin.extractor.ant.AntMojoDescriptorExtractorTest
[linux-jdk8] [INFO] run post-build script verify.bsh
[linux-jdk8] [INFO]           plugin-report/pom.xml ............................ FAILED (9.6
s)
[linux-jdk8] [INFO]   The post-build script returned false.
[linux-jdk8] [INFO] Building: mplugin-191/pom.xml
[linux-jdk8] Terminated
[linux-jdk9] [INFO] java-annotations mojo extractor found 6 mojo descriptors.
[linux-jdk9] Sending interrupt signal to process
[linux-jdk9] [INFO] 
[linux-jdk9] [INFO] --- maven-resources-plugin:3.0.2:testResources (default-testResources)
@ maven-plugin-plugin ---
[linux-jdk9] [INFO] Using 'UTF-8' encoding to copy filtered resources.
[linux-jdk9] [INFO] skip non existing resourceDirectory /home/jenkins/jenkins-slave/workspace/x_maven-plugin-tools_master-XKS4EHY3PSXHGP4DHIXUDAAM6TMAKT3YNFP2XDSSXFM24ZMKWIXQ/m/maven-plugin-plugin/src/test/resources
[linux-jdk9] [INFO] Copying 3 resources
[linux-jdk9] [INFO] 
[linux-jdk9] [INFO] --- maven-compiler-plugin:3.7.0:testCompile (default-testCompile) @ maven-plugin-plugin
---
[linux-jdk9] [INFO] No sources to compile
[linux-jdk9] [INFO] 
[linux-jdk9] [INFO] --- maven-surefire-plugin:2.21.0:test (default-test) @ maven-plugin-plugin
---
[linux-jdk9] [INFO] 
[linux-jdk9] [INFO] --- maven-jar-plugin:3.0.2:jar (default-jar) @ maven-plugin-plugin ---
[linux-jdk9] [INFO] Building jar: /home/jenkins/jenkins-slave/workspace/x_maven-plugin-tools_master-XKS4EHY3PSXHGP4DHIXUDAAM6TMAKT3YNFP2XDSSXFM24ZMKWIXQ/m/maven-plugin-plugin/target/maven-plugin-plugin-3.5.2-SNAPSHOT.jar
[linux-jdk9] [INFO] 
[linux-jdk9] [INFO] --- maven-plugin-plugin:3.5:addPluginArtifactMetadata (default-addPluginArtifactMetadata)
@ maven-plugin-plugin ---
[linux-jdk9] [INFO] 
[linux-jdk9] [INFO] --- maven-site-plugin:3.7.1:attach-descriptor (attach-descriptor) @ maven-plugin-plugin
---
[linux-jdk9] [INFO] Skipping because packaging 'maven-plugin' is not pom.
[linux-jdk9] [INFO] 
[linux-jdk9] [INFO] --- maven-invoker-plugin:3.0.1:install (integration-test) @ maven-plugin-plugin
---
[linux-jdk9] [INFO] Installing /home/jenkins/jenkins-slave/workspace/x_maven-plugin-tools_master-XKS4EHY3PSXHGP4DHIXUDAAM6TMAKT3YNFP2XDSSXFM24ZMKWIXQ/m/pom.xml
to /home/jenkins/jenkins-slave/workspace/x_maven-plugin-tools_master-XKS4EHY3PSXHGP4DHIXUDAAM6TMAKT3YNFP2XDSSXFM24ZMKWIXQ/m/maven-plugin-plugin/target/local-repo/org/apache/maven/plugin-tools/maven-plugin-tools/3.5.2-SNAPSHOT/maven-plugin-tools-3.5.2-SNAPSHOT.pom
[linux-jdk9] [INFO] Installing /home/jenkins/jenkins-slave/workspace/x_maven-plugin-tools_master-XKS4EHY3PSXHGP4DHIXUDAAM6TMAKT3YNFP2XDSSXFM24ZMKWIXQ/m/target/maven-plugin-tools-3.5.2-SNAPSHOT-site.xml
to /home/jenkins/jenkins-slave/workspace/x_maven-plugin-tools_master-XKS4EHY3PSXHGP4DHIXUDAAM6TMAKT3YNFP2XDSSXFM24ZMKWIXQ/m/maven-plugin-plugin/target/local-repo/org/apache/maven/plugin-tools/maven-plugin-tools/3.5.2-SNAPSHOT/maven-plugin-tools-3.5.2-SNAPSHOT-site.xml
[linux-jdk9] [INFO] Installing /home/jenkins/jenkins-slave/workspace/x_maven-plugin-tools_master-XKS4EHY3PSXHGP4DHIXUDAAM6TMAKT3YNFP2XDSSXFM24ZMKWIXQ/m/maven-plugin-tools-api/pom.xml
to /home/jenkins/jenkins-slave/workspace/x_maven-plugin-tools_master-XKS4EHY3PSXHGP4DHIXUDAAM6TMAKT3YNFP2XDSSXFM24ZMKWIXQ/m/maven-plugin-plugin/target/local-repo/org/apache/maven/plugin-tools/maven-plugin-tools-api/3.5.2-SNAPSHOT/maven-plugin-tools-api-3.5.2-SNAPSHOT.pom
[linux-jdk9] [INFO] Installing /home/jenkins/jenkins-slave/workspace/x_maven-plugin-tools_master-XKS4EHY3PSXHGP4DHIXUDAAM6TMAKT3YNFP2XDSSXFM24ZMKWIXQ/m/maven-plugin-tools-api/target/maven-plugin-tools-api-3.5.2-SNAPSHOT.jar
to /home/jenkins/jenkins-slave/workspace/x_maven-plugin-tools_master-XKS4EHY3PSXHGP4DHIXUDAAM6TMAKT3YNFP2XDSSXFM24ZMKWIXQ/m/maven-plugin-plugin/target/local-repo/org/apache/maven/plugin-tools/maven-plugin-tools-api/3.5.2-SNAPSHOT/maven-plugin-tools-api-3.5.2-SNAPSHOT.jar
[linux-jdk9] [INFO] Installing /home/jenkins/jenkins-slave/workspace/x_maven-plugin-tools_master-XKS4EHY3PSXHGP4DHIXUDAAM6TMAKT3YNFP2XDSSXFM24ZMKWIXQ/m/maven-plugin-tools-generators/pom.xml
to /home/jenkins/jenkins-slave/workspace/x_maven-plugin-tools_master-XKS4EHY3PSXHGP4DHIXUDAAM6TMAKT3YNFP2XDSSXFM24ZMKWIXQ/m/maven-plugin-plugin/target/local-repo/org/apache/maven/plugin-tools/maven-plugin-tools-generators/3.5.2-SNAPSHOT/maven-plugin-tools-generators-3.5.2-SNAPSHOT.pom
[linux-jdk9] [INFO] Installing /home/jenkins/jenkins-slave/workspace/x_maven-plugin-tools_master-XKS4EHY3PSXHGP4DHIXUDAAM6TMAKT3YNFP2XDSSXFM24ZMKWIXQ/m/maven-plugin-tools-generators/target/maven-plugin-tools-generators-3.5.2-SNAPSHOT.jar
to /home/jenkins/jenkins-slave/workspace/x_maven-plugin-tools_master-XKS4EHY3PSXHGP4DHIXUDAAM6TMAKT3YNFP2XDSSXFM24ZMKWIXQ/m/maven-plugin-plugin/target/local-repo/org/apache/maven/plugin-tools/maven-plugin-tools-generators/3.5.2-SNAPSHOT/maven-plugin-tools-generators-3.5.2-SNAPSHOT.jar
[linux-jdk9] [INFO] Installing /home/jenkins/jenkins-slave/workspace/x_maven-plugin-tools_master-XKS4EHY3PSXHGP4DHIXUDAAM6TMAKT3YNFP2XDSSXFM24ZMKWIXQ/m/maven-plugin-tools-java/pom.xml
to /home/jenkins/jenkins-slave/workspace/x_maven-plugin-tools_master-XKS4EHY3PSXHGP4DHIXUDAAM6TMAKT3YNFP2XDSSXFM24ZMKWIXQ/m/maven-plugin-plugin/target/local-repo/org/apache/maven/plugin-tools/maven-plugin-tools-java/3.5.2-SNAPSHOT/maven-plugin-tools-java-3.5.2-SNAPSHOT.pom
[linux-jdk9] [INFO] Installing /home/jenkins/jenkins-slave/workspace/x_maven-plugin-tools_master-XKS4EHY3PSXHGP4DHIXUDAAM6TMAKT3YNFP2XDSSXFM24ZMKWIXQ/m/maven-plugin-tools-java/target/maven-plugin-tools-java-3.5.2-SNAPSHOT.jar
to /home/jenkins/jenkins-slave/workspace/x_maven-plugin-tools_master-XKS4EHY3PSXHGP4DHIXUDAAM6TMAKT3YNFP2XDSSXFM24ZMKWIXQ/m/maven-plugin-plugin/target/local-repo/org/apache/maven/plugin-tools/maven-plugin-tools-java/3.5.2-SNAPSHOT/maven-plugin-tools-java-3.5.2-SNAPSHOT.jar
[linux-jdk9] [INFO] Installing /home/jenkins/jenkins-slave/workspace/x_maven-plugin-tools_master-XKS4EHY3PSXHGP4DHIXUDAAM6TMAKT3YNFP2XDSSXFM24ZMKWIXQ/m/maven-plugin-annotations/pom.xml
to /home/jenkins/jenkins-slave/workspace/x_maven-plugin-tools_master-XKS4EHY3PSXHGP4DHIXUDAAM6TMAKT3YNFP2XDSSXFM24ZMKWIXQ/m/maven-plugin-plugin/target/local-repo/org/apache/maven/plugin-tools/maven-plugin-annotations/3.5.2-SNAPSHOT/maven-plugin-annotations-3.5.2-SNAPSHOT.pom
[linux-jdk9] [INFO] Installing /home/jenkins/jenkins-slave/workspace/x_maven-plugin-tools_master-XKS4EHY3PSXHGP4DHIXUDAAM6TMAKT3YNFP2XDSSXFM24ZMKWIXQ/m/maven-plugin-annotations/target/maven-plugin-annotations-3.5.2-SNAPSHOT.jar
to /home/jenkins/jenkins-slave/workspace/x_maven-plugin-tools_master-XKS4EHY3PSXHGP4DHIXUDAAM6TMAKT3YNFP2XDSSXFM24ZMKWIXQ/m/maven-plugin-plugin/target/local-repo/org/apache/maven/plugin-tools/maven-plugin-annotations/3.5.2-SNAPSHOT/maven-plugin-annotations-3.5.2-SNAPSHOT.jar
[linux-jdk9] [INFO] Installing /home/jenkins/jenkins-slave/workspace/x_maven-plugin-tools_master-XKS4EHY3PSXHGP4DHIXUDAAM6TMAKT3YNFP2XDSSXFM24ZMKWIXQ/m/maven-plugin-tools-annotations/pom.xml
to /home/jenkins/jenkins-slave/workspace/x_maven-plugin-tools_master-XKS4EHY3PSXHGP4DHIXUDAAM6TMAKT3YNFP2XDSSXFM24ZMKWIXQ/m/maven-plugin-plugin/target/local-repo/org/apache/maven/plugin-tools/maven-plugin-tools-annotations/3.5.2-SNAPSHOT/maven-plugin-tools-annotations-3.5.2-SNAPSHOT.pom
[linux-jdk9] [INFO] Installing /home/jenkins/jenkins-slave/workspace/x_maven-plugin-tools_master-XKS4EHY3PSXHGP4DHIXUDAAM6TMAKT3YNFP2XDSSXFM24ZMKWIXQ/m/maven-plugin-tools-annotations/target/maven-plugin-tools-annotations-3.5.2-SNAPSHOT.jar
to /home/jenkins/jenkins-slave/workspace/x_maven-plugin-tools_master-XKS4EHY3PSXHGP4DHIXUDAAM6TMAKT3YNFP2XDSSXFM24ZMKWIXQ/m/maven-plugin-plugin/target/local-repo/org/apache/maven/plugin-tools/maven-plugin-tools-annotations/3.5.2-SNAPSHOT/maven-plugin-tools-annotations-3.5.2-SNAPSHOT.jar
[linux-jdk9] [INFO] Installing /home/jenkins/jenkins-slave/workspace/x_maven-plugin-tools_master-XKS4EHY3PSXHGP4DHIXUDAAM6TMAKT3YNFP2XDSSXFM24ZMKWIXQ/m/maven-plugin-tools-annotations/target/maven-plugin-tools-annotations-3.5.2-SNAPSHOT-tests.jar
to /home/jenkins/jenkins-slave/workspace/x_maven-plugin-tools_master-XKS4EHY3PSXHGP4DHIXUDAAM6TMAKT3YNFP2XDSSXFM24ZMKWIXQ/m/maven-plugin-plugin/target/local-repo/org/apache/maven/plugin-tools/maven-plugin-tools-annotations/3.5.2-SNAPSHOT/maven-plugin-tools-annotations-3.5.2-SNAPSHOT-tests.jar
[linux-jdk9] [INFO] Installing /home/jenkins/jenkins-slave/workspace/x_maven-plugin-tools_master-XKS4EHY3PSXHGP4DHIXUDAAM6TMAKT3YNFP2XDSSXFM24ZMKWIXQ/m/maven-plugin-tools-annotations/target/maven-plugin-tools-annotations-3.5.2-SNAPSHOT-test-sources.jar
to /home/jenkins/jenkins-slave/workspace/x_maven-plugin-tools_master-XKS4EHY3PSXHGP4DHIXUDAAM6TMAKT3YNFP2XDSSXFM24ZMKWIXQ/m/maven-plugin-plugin/target/local-repo/org/apache/maven/plugin-tools/maven-plugin-tools-annotations/3.5.2-SNAPSHOT/maven-plugin-tools-annotations-3.5.2-SNAPSHOT-test-sources.jar
[linux-jdk9] [INFO] Installing /home/jenkins/jenkins-slave/workspace/x_maven-plugin-tools_master-XKS4EHY3PSXHGP4DHIXUDAAM6TMAKT3YNFP2XDSSXFM24ZMKWIXQ/m/maven-plugin-tools-javadoc/pom.xml
to /home/jenkins/jenkins-slave/workspace/x_maven-plugin-tools_master-XKS4EHY3PSXHGP4DHIXUDAAM6TMAKT3YNFP2XDSSXFM24ZMKWIXQ/m/maven-plugin-plugin/target/local-repo/org/apache/maven/plugin-tools/maven-plugin-tools-javadoc/3.5.2-SNAPSHOT/maven-plugin-tools-javadoc-3.5.2-SNAPSHOT.pom
[linux-jdk9] [INFO] Installing /home/jenkins/jenkins-slave/workspace/x_maven-plugin-tools_master-XKS4EHY3PSXHGP4DHIXUDAAM6TMAKT3YNFP2XDSSXFM24ZMKWIXQ/m/maven-plugin-tools-javadoc/target/maven-plugin-tools-javadoc-3.5.2-SNAPSHOT.jar
to /home/jenkins/jenkins-slave/workspace/x_maven-plugin-tools_master-XKS4EHY3PSXHGP4DHIXUDAAM6TMAKT3YNFP2XDSSXFM24ZMKWIXQ/m/maven-plugin-plugin/target/local-repo/org/apache/maven/plugin-tools/maven-plugin-tools-javadoc/3.5.2-SNAPSHOT/maven-plugin-tools-javadoc-3.5.2-SNAPSHOT.jar
[linux-jdk9] [INFO] Installing /home/jenkins/jenkins-slave/workspace/x_maven-plugin-tools_master-XKS4EHY3PSXHGP4DHIXUDAAM6TMAKT3YNFP2XDSSXFM24ZMKWIXQ/m/maven-script/pom.xml
to /home/jenkins/jenkins-slave/workspace/x_maven-plugin-tools_master-XKS4EHY3PSXHGP4DHIXUDAAM6TMAKT3YNFP2XDSSXFM24ZMKWIXQ/m/maven-plugin-plugin/target/local-repo/org/apache/maven/plugin-tools/maven-script/3.5.2-SNAPSHOT/maven-script-3.5.2-SNAPSHOT.pom
[linux-jdk9] [INFO] Installing /home/jenkins/jenkins-slave/workspace/x_maven-plugin-tools_master-XKS4EHY3PSXHGP4DHIXUDAAM6TMAKT3YNFP2XDSSXFM24ZMKWIXQ/m/maven-script/target/maven-script-3.5.2-SNAPSHOT-site.xml
to /home/jenkins/jenkins-slave/workspace/x_maven-plugin-tools_master-XKS4EHY3PSXHGP4DHIXUDAAM6TMAKT3YNFP2XDSSXFM24ZMKWIXQ/m/maven-plugin-plugin/target/local-repo/org/apache/maven/plugin-tools/maven-script/3.5.2-SNAPSHOT/maven-script-3.5.2-SNAPSHOT-site.xml
[linux-jdk9] [INFO] Installing /home/jenkins/jenkins-slave/workspace/x_maven-plugin-tools_master-XKS4EHY3PSXHGP4DHIXUDAAM6TMAKT3YNFP2XDSSXFM24ZMKWIXQ/m/maven-script/maven-plugin-tools-model/pom.xml
to /home/jenkins/jenkins-slave/workspace/x_maven-plugin-tools_master-XKS4EHY3PSXHGP4DHIXUDAAM6TMAKT3YNFP2XDSSXFM24ZMKWIXQ/m/maven-plugin-plugin/target/local-repo/org/apache/maven/plugin-tools/maven-plugin-tools-model/3.5.2-SNAPSHOT/maven-plugin-tools-model-3.5.2-SNAPSHOT.pom
[linux-jdk9] [INFO] Installing /home/jenkins/jenkins-slave/workspace/x_maven-plugin-tools_master-XKS4EHY3PSXHGP4DHIXUDAAM6TMAKT3YNFP2XDSSXFM24ZMKWIXQ/m/maven-script/maven-plugin-tools-model/target/maven-plugin-tools-model-3.5.2-SNAPSHOT.jar
to /home/jenkins/jenkins-slave/workspace/x_maven-plugin-tools_master-XKS4EHY3PSXHGP4DHIXUDAAM6TMAKT3YNFP2XDSSXFM24ZMKWIXQ/m/maven-plugin-plugin/target/local-repo/org/apache/maven/plugin-tools/maven-plugin-tools-model/3.5.2-SNAPSHOT/maven-plugin-tools-model-3.5.2-SNAPSHOT.jar
[linux-jdk9] [INFO] Installing /home/jenkins/jenkins-slave/workspace/x_maven-plugin-tools_master-XKS4EHY3PSXHGP4DHIXUDAAM6TMAKT3YNFP2XDSSXFM24ZMKWIXQ/m/maven-script/maven-plugin-tools-ant/pom.xml
to /home/jenkins/jenkins-slave/workspace/x_maven-plugin-tools_master-XKS4EHY3PSXHGP4DHIXUDAAM6TMAKT3YNFP2XDSSXFM24ZMKWIXQ/m/maven-plugin-plugin/target/local-repo/org/apache/maven/plugin-tools/maven-plugin-tools-ant/3.5.2-SNAPSHOT/maven-plugin-tools-ant-3.5.2-SNAPSHOT.pom
[linux-jdk9] [INFO] Installing /home/jenkins/jenkins-slave/workspace/x_maven-plugin-tools_master-XKS4EHY3PSXHGP4DHIXUDAAM6TMAKT3YNFP2XDSSXFM24ZMKWIXQ/m/maven-script/maven-plugin-tools-ant/target/maven-plugin-tools-ant-3.5.2-SNAPSHOT.jar
to /home/jenkins/jenkins-slave/workspace/x_maven-plugin-tools_master-XKS4EHY3PSXHGP4DHIXUDAAM6TMAKT3YNFP2XDSSXFM24ZMKWIXQ/m/maven-plugin-plugin/target/local-repo/org/apache/maven/plugin-tools/maven-plugin-tools-ant/3.5.2-SNAPSHOT/maven-plugin-tools-ant-3.5.2-SNAPSHOT.jar
[linux-jdk9] [INFO] Installing /home/jenkins/jenkins-slave/workspace/x_maven-plugin-tools_master-XKS4EHY3PSXHGP4DHIXUDAAM6TMAKT3YNFP2XDSSXFM24ZMKWIXQ/m/maven-script/maven-script-ant/pom.xml
to /home/jenkins/jenkins-slave/workspace/x_maven-plugin-tools_master-XKS4EHY3PSXHGP4DHIXUDAAM6TMAKT3YNFP2XDSSXFM24ZMKWIXQ/m/maven-plugin-plugin/target/local-repo/org/apache/maven/plugin-tools/maven-script-ant/3.5.2-SNAPSHOT/maven-script-ant-3.5.2-SNAPSHOT.pom
[linux-jdk9] [INFO] Installing /home/jenkins/jenkins-slave/workspace/x_maven-plugin-tools_master-XKS4EHY3PSXHGP4DHIXUDAAM6TMAKT3YNFP2XDSSXFM24ZMKWIXQ/m/maven-script/maven-script-ant/target/maven-script-ant-3.5.2-SNAPSHOT.jar
to /home/jenkins/jenkins-slave/workspace/x_maven-plugin-tools_master-XKS4EHY3PSXHGP4DHIXUDAAM6TMAKT3YNFP2XDSSXFM24ZMKWIXQ/m/maven-plugin-plugin/target/local-repo/org/apache/maven/plugin-tools/maven-script-ant/3.5.2-SNAPSHOT/maven-script-ant-3.5.2-SNAPSHOT.jar
[linux-jdk9] [INFO] Installing /home/jenkins/jenkins-slave/workspace/x_maven-plugin-tools_master-XKS4EHY3PSXHGP4DHIXUDAAM6TMAKT3YNFP2XDSSXFM24ZMKWIXQ/m/maven-script/maven-plugin-tools-beanshell/pom.xml
to /home/jenkins/jenkins-slave/workspace/x_maven-plugin-tools_master-XKS4EHY3PSXHGP4DHIXUDAAM6TMAKT3YNFP2XDSSXFM24ZMKWIXQ/m/maven-plugin-plugin/target/local-repo/org/apache/maven/plugin-tools/maven-plugin-tools-beanshell/3.5.2-SNAPSHOT/maven-plugin-tools-beanshell-3.5.2-SNAPSHOT.pom
[linux-jdk9] [INFO] Installing /home/jenkins/jenkins-slave/workspace/x_maven-plugin-tools_master-XKS4EHY3PSXHGP4DHIXUDAAM6TMAKT3YNFP2XDSSXFM24ZMKWIXQ/m/maven-script/maven-plugin-tools-beanshell/target/maven-plugin-tools-beanshell-3.5.2-SNAPSHOT.jar
to /home/jenkins/jenkins-slave/workspace/x_maven-plugin-tools_master-XKS4EHY3PSXHGP4DHIXUDAAM6TMAKT3YNFP2XDSSXFM24ZMKWIXQ/m/maven-plugin-plugin/target/local-repo/org/apache/maven/plugin-tools/maven-plugin-tools-beanshell/3.5.2-SNAPSHOT/maven-plugin-tools-beanshell-3.5.2-SNAPSHOT.jar
[linux-jdk9] [INFO] Installing /home/jenkins/jenkins-slave/workspace/x_maven-plugin-tools_master-XKS4EHY3PSXHGP4DHIXUDAAM6TMAKT3YNFP2XDSSXFM24ZMKWIXQ/m/maven-script/maven-script-beanshell/pom.xml
to /home/jenkins/jenkins-slave/workspace/x_maven-plugin-tools_master-XKS4EHY3PSXHGP4DHIXUDAAM6TMAKT3YNFP2XDSSXFM24ZMKWIXQ/m/maven-plugin-plugin/target/local-repo/org/apache/maven/plugin-tools/maven-script-beanshell/3.5.2-SNAPSHOT/maven-script-beanshell-3.5.2-SNAPSHOT.pom
[linux-jdk9] [INFO] Installing /home/jenkins/jenkins-slave/workspace/x_maven-plugin-tools_master-XKS4EHY3PSXHGP4DHIXUDAAM6TMAKT3YNFP2XDSSXFM24ZMKWIXQ/m/maven-script/maven-script-beanshell/target/maven-script-beanshell-3.5.2-SNAPSHOT.jar
to /home/jenkins/jenkins-slave/workspace/x_maven-plugin-tools_master-XKS4EHY3PSXHGP4DHIXUDAAM6TMAKT3YNFP2XDSSXFM24ZMKWIXQ/m/maven-plugin-plugin/target/local-repo/org/apache/maven/plugin-tools/maven-script-beanshell/3.5.2-SNAPSHOT/maven-script-beanshell-3.5.2-SNAPSHOT.jar
[linux-jdk9] [INFO] Installing /home/jenkins/jenkins-slave/workspace/x_maven-plugin-tools_master-XKS4EHY3PSXHGP4DHIXUDAAM6TMAKT3YNFP2XDSSXFM24ZMKWIXQ/m/maven-plugin-plugin/pom.xml
to /home/jenkins/jenkins-slave/workspace/x_maven-plugin-tools_master-XKS4EHY3PSXHGP4DHIXUDAAM6TMAKT3YNFP2XDSSXFM24ZMKWIXQ/m/maven-plugin-plugin/target/local-repo/org/apache/maven/plugins/maven-plugin-plugin/3.5.2-SNAPSHOT/maven-plugin-plugin-3.5.2-SNAPSHOT.pom
[linux-jdk9] [INFO] Installing /home/jenkins/jenkins-slave/workspace/x_maven-plugin-tools_master-XKS4EHY3PSXHGP4DHIXUDAAM6TMAKT3YNFP2XDSSXFM24ZMKWIXQ/m/maven-plugin-plugin/target/maven-plugin-plugin-3.5.2-SNAPSHOT.jar
to /home/jenkins/jenkins-slave/workspace/x_maven-plugin-tools_master-XKS4EHY3PSXHGP4DHIXUDAAM6TMAKT3YNFP2XDSSXFM24ZMKWIXQ/m/maven-plugin-plugin/target/local-repo/org/apache/maven/plugins/maven-plugin-plugin/3.5.2-SNAPSHOT/maven-plugin-plugin-3.5.2-SNAPSHOT.jar
[linux-jdk9] [INFO] 
[linux-jdk9] [INFO] --- maven-invoker-plugin:3.0.1:run (integration-test) @ maven-plugin-plugin
---
[windows-jdk7] [INFO] 
[windows-jdk7] [INFO] Results:
[windows-jdk7] [INFO] 
[windows-jdk7] [INFO] Tests run: 1, Failures: 0, Errors: 0, Skipped: 0
[windows-jdk7] [INFO] 
[windows-jdk7] [INFO] 
[windows-jdk7] [INFO] --- maven-jar-plugin:3.0.2:jar (default-jar) @ maven-plugin-tools-ant
---
[windows-jdk7] [INFO] Building jar: F:\jenkins\jenkins-slave\workspace\x_maven-plugin-tools_master-XKS4EHY3PSXHGP4DHIXUDAAM6TMAKT3YNFP2XDSSXFM24ZMKWIXQ\m\maven-script\maven-plugin-tools-ant\target\maven-plugin-tools-ant-3.5.2-SNAPSHOT.jar
[windows-jdk7] [INFO] 
[windows-jdk7] [INFO] --- maven-site-plugin:3.7.1:attach-descriptor (attach-descriptor) @
maven-plugin-tools-ant ---
[windows-jdk7] [INFO] Skipping because packaging 'jar' is not pom.
[windows-jdk7] [INFO] 
[windows-jdk7] [INFO] --- maven-checkstyle-plugin:3.0.0:check (checkstyle-check) @ maven-plugin-tools-ant
---
[windows-jdk7] [INFO] There is 1 error reported by Checkstyle 6.18 with config/maven_checks.xml
ruleset.
[windows-jdk7] [INFO] Ignored 1 error, 0 violation remaining.
[windows-jdk7] [INFO] 
[windows-jdk7] [INFO] ------------------------------------------------------------------------
[windows-jdk7] [INFO] Building Maven Ant Mojo Support 3.5.2-SNAPSHOT
[windows-jdk7] [INFO] ------------------------------------------------------------------------
[windows-jdk7] [INFO] Downloading: https://repo.maven.apache.org/maven2/org/apache/ant/ant/1.7.1/ant-1.7.1.pom
[windows-jdk7] [INFO] Downloaded: https://repo.maven.apache.org/maven2/org/apache/ant/ant/1.7.1/ant-1.7.1.pom
(9.8 kB at 697 kB/s)
[windows-jdk7] [INFO] Downloading: https://repo.maven.apache.org/maven2/org/apache/ant/ant-parent/1.7.1/ant-parent-1.7.1.pom
[windows-jdk7] [INFO] Downloaded: https://repo.maven.apache.org/maven2/org/apache/ant/ant-parent/1.7.1/ant-parent-1.7.1.pom
(4.4 kB at 337 kB/s)
[windows-jdk7] [INFO] Downloading: https://repo.maven.apache.org/maven2/org/apache/ant/ant-launcher/1.7.1/ant-launcher-1.7.1.pom
[windows-jdk7] [INFO] Downloaded: https://repo.maven.apache.org/maven2/org/apache/ant/ant-launcher/1.7.1/ant-launcher-1.7.1.pom
(2.4 kB at 183 kB/s)
[windows-jdk7] [INFO] Downloading: https://repo.maven.apache.org/maven2/org/codehaus/plexus/plexus-ant-factory/1.0-alpha-2.1/plexus-ant-factory-1.0-alpha-2.1.pom
[windows-jdk7] [INFO] Downloaded: https://repo.maven.apache.org/maven2/org/codehaus/plexus/plexus-ant-factory/1.0-alpha-2.1/plexus-ant-factory-1.0-alpha-2.1.pom
(1.5 kB at 123 kB/s)
[windows-jdk7] [INFO] Downloading: https://repo.maven.apache.org/maven2/org/codehaus/plexus/plexus-component-factories/1.0-alpha-8/plexus-component-factories-1.0-alpha-8.pom
[windows-jdk7] [INFO] Downloaded: https://repo.maven.apache.org/maven2/org/codehaus/plexus/plexus-component-factories/1.0-alpha-8/plexus-component-factories-1.0-alpha-8.pom
(878 B at 68 kB/s)
[windows-jdk7] [INFO] Downloading: https://repo.maven.apache.org/maven2/org/apache/ant/ant/1.7.1/ant-1.7.1.jar
[windows-jdk7] [INFO] Downloading: https://repo.maven.apache.org/maven2/org/apache/ant/ant-launcher/1.7.1/ant-launcher-1.7.1.jar
[windows-jdk7] [INFO] Downloading: https://repo.maven.apache.org/maven2/org/codehaus/plexus/plexus-ant-factory/1.0-alpha-2.1/plexus-ant-factory-1.0-alpha-2.1.jar
[windows-jdk7] [INFO] Downloaded: https://repo.maven.apache.org/maven2/org/apache/ant/ant-launcher/1.7.1/ant-launcher-1.7.1.jar
(12 kB at 187 kB/s)
[windows-jdk7] [INFO] Downloaded: https://repo.maven.apache.org/maven2/org/codehaus/plexus/plexus-ant-factory/1.0-alpha-2.1/plexus-ant-factory-1.0-alpha-2.1.jar
(10 kB at 150 kB/s)
[windows-jdk7] [INFO] Downloaded: https://repo.maven.apache.org/maven2/org/apache/ant/ant/1.7.1/ant-1.7.1.jar
(1.3 MB at 19 MB/s)
[windows-jdk7] [INFO] 
[windows-jdk7] [INFO] --- maven-clean-plugin:3.0.0:clean (default-clean) @ maven-script-ant
---
[windows-jdk7] [INFO] 
[windows-jdk7] [INFO] --- maven-enforcer-plugin:1.4.1:enforce (enforce-maven-version) @ maven-script-ant
---
[windows-jdk7] [INFO] 
[windows-jdk7] [INFO] --- maven-enforcer-plugin:1.4.1:enforce (enforce-bytecode-version) @
maven-script-ant ---
[windows-jdk7] [INFO] 
[windows-jdk7] [INFO] --- maven-enforcer-plugin:1.4.1:enforce (ban-known-bad-maven-versions)
@ maven-script-ant ---
[windows-jdk7] [INFO] 
[windows-jdk7] [INFO] --- apache-rat-plugin:0.12:check (rat-check) @ maven-script-ant ---
[windows-jdk7] [INFO] Enabled default license matchers.
[windows-jdk7] [INFO] Will parse SCM ignores for exclusions...
[windows-jdk7] [INFO] Finished adding exclusions from SCM ignore files.
[windows-jdk7] [INFO] 61 implicit excludes (use -debug for more details).
[windows-jdk7] [INFO] Exclude: .repository/**
[windows-jdk7] [INFO] Exclude: .maven/spy.log
[windows-jdk7] [INFO] Exclude: dependency-reduced-pom.xml
[windows-jdk7] [INFO] Exclude: .java-version
[windows-jdk7] [INFO] 10 resources included (use -debug for more details)
[windows-jdk7] [INFO] Rat check: Summary over all files. Unapproved: 0, unknown: 0, generated:
0, approved: 10 licenses.
[windows-jdk7] [INFO] 
[windows-jdk7] [INFO] --- maven-remote-resources-plugin:1.5:process (process-resource-bundles)
@ maven-script-ant ---
[windows-jdk7] Sending interrupt signal to process
[windows-jdk7] [INFO] 
[windows-jdk7] [INFO] --- maven-resources-plugin:3.0.2:resources (default-resources) @ maven-script-ant
---
[windows-jdk7] [INFO] Using 'UTF-8' encoding to copy filtered resources.
[windows-jdk7] [INFO] Copying 1 resource
[windows-jdk7] [INFO] Copying 3 resources
[windows-jdk7] [INFO] 
[windows-jdk7] [INFO] --- maven-compiler-plugin:3.7.0:compile (default-compile) @ maven-script-ant
---
[windows-jdk7] [INFO] Changes detected - recompiling the module!
[windows-jdk7] [INFO] Compiling 3 source files to F:\jenkins\jenkins-slave\workspace\x_maven-plugin-tools_master-XKS4EHY3PSXHGP4DHIXUDAAM6TMAKT3YNFP2XDSSXFM24ZMKWIXQ\m\maven-script\maven-script-ant\target\classes
[windows-jdk7] [INFO] /F:/jenkins/jenkins-slave/workspace/x_maven-plugin-tools_master-XKS4EHY3PSXHGP4DHIXUDAAM6TMAKT3YNFP2XDSSXFM24ZMKWIXQ/m/maven-script/maven-script-ant/src/main/java/org/apache/maven/script/ant/AntMojoWrapper.java:
F:\jenkins\jenkins-slave\workspace\x_maven-plugin-tools_master-XKS4EHY3PSXHGP4DHIXUDAAM6TMAKT3YNFP2XDSSXFM24ZMKWIXQ\m\maven-script\maven-script-ant\src\main\java\org\apache\maven\script\ant\AntMojoWrapper.java
uses unchecked or unsafe operations.
[windows-jdk7] [INFO] /F:/jenkins/jenkins-slave/workspace/x_maven-plugin-tools_master-XKS4EHY3PSXHGP4DHIXUDAAM6TMAKT3YNFP2XDSSXFM24ZMKWIXQ/m/maven-script/maven-script-ant/src/main/java/org/apache/maven/script/ant/AntMojoWrapper.java:
Recompile with -Xlint:unchecked for details.
[windows-jdk7] [INFO] 
[windows-jdk7] [INFO] --- maven-resources-plugin:3.0.2:testResources (default-testResources)
@ maven-script-ant ---
[windows-jdk7] [INFO] Using 'UTF-8' encoding to copy filtered resources.
[windows-jdk7] [INFO] Copying 3 resources
[windows-jdk7] [INFO] Copying 3 resources
[windows-jdk7] [INFO] 
[windows-jdk7] [INFO] --- maven-compiler-plugin:3.7.0:testCompile (default-testCompile) @
maven-script-ant ---
[windows-jdk7] [INFO] Changes detected - recompiling the module!
[windows-jdk7] [INFO] Compiling 1 source file to F:\jenkins\jenkins-slave\workspace\x_maven-plugin-tools_master-XKS4EHY3PSXHGP4DHIXUDAAM6TMAKT3YNFP2XDSSXFM24ZMKWIXQ\m\maven-script\maven-script-ant\target\test-classes
[windows-jdk8] Sending interrupt signal to process
[windows-jdk7] [INFO] 
[windows-jdk7] [INFO] --- maven-surefire-plugin:2.21.0:test (default-test) @ maven-script-ant
---
[windows-jdk7] [INFO] 
[windows-jdk7] [INFO] -------------------------------------------------------
[windows-jdk7] [INFO]  T E S T S
[windows-jdk7] [INFO] -------------------------------------------------------
[windows-jdk8] [INFO] run post-build script verify.bsh.bsh
[windows-jdk8] [INFO]           basic\pom.xml .................................... FAILED
(4.1 s)
[windows-jdk8] [INFO]   The post-build script did not succeed. F:\jenkins\jenkins-slave\workspace\x_maven-plugin-tools_master-XKS4EHY3PSXHGP4DHIXUDAAM6TMAKT3YNFP2XDSSXFM24ZMKWIXQ\m\maven-plugin-tools-javadoc\target\it\basic\target\site\apidocs
was not created
[windows-jdk8] [INFO] -------------------------------------------------
[windows-jdk8] [INFO] Build Summary:
[windows-jdk8] [INFO]   Passed: 0, Failed: 1, Errors: 0, Skipped: 0
[windows-jdk8] [INFO] -------------------------------------------------
[windows-jdk8] [WARNING] The following builds failed:
[windows-jdk8] [WARNING] *  basic\pom.xml
[windows-jdk8] [INFO] -------------------------------------------------
[windows-jdk8] [WARNING] Ignoring that 1 build failed.
[windows-jdk8] [INFO] 
[windows-jdk8] [INFO] --- maven-checkstyle-plugin:3.0.0:check (checkstyle-check) @ maven-plugin-tools-javadoc
---
[windows-jdk9] Sending interrupt signal to process
[Pipeline] [windows-jdk10] // stage
[Pipeline] [windows-jdk10] }
[Pipeline] [windows-jdk7] }
[Pipeline] [linux-jdk8] }
[Pipeline] [linux-jdk7] }
[Pipeline] [linux-jdk9] }
[Pipeline] [windows-jdk8] }
[Pipeline] [windows-jdk10] // node
[Pipeline] [windows-jdk7] // dir
[Pipeline] [linux-jdk8] // dir
[Pipeline] [linux-jdk7] // dir
[Pipeline] [linux-jdk9] // dir
[Pipeline] [windows-jdk8] // dir
[Pipeline] [windows-jdk10] }
[Pipeline] [windows-jdk7] }
[windows-jdk7] [withMaven] One or multiple Maven executions have been ignored by the Jenkins
Pipeline Maven Plugin because they have been interrupted before completion (1). See Pipeline
Maven Plugin FAQ for more details.
[Pipeline] [linux-jdk8] }
[linux-jdk8] [withMaven] One or multiple Maven executions have been ignored by the Jenkins
Pipeline Maven Plugin because they have been interrupted before completion (1). See Pipeline
Maven Plugin FAQ for more details.
[Pipeline] [linux-jdk7] }
[linux-jdk7] [withMaven] One or multiple Maven executions have been ignored by the Jenkins
Pipeline Maven Plugin because they have been interrupted before completion (1). See Pipeline
Maven Plugin FAQ for more details.
[Pipeline] [linux-jdk9] }
[linux-jdk9] [withMaven] One or multiple Maven executions have been ignored by the Jenkins
Pipeline Maven Plugin because they have been interrupted before completion (1). See Pipeline
Maven Plugin FAQ for more details.
[Pipeline] [windows-jdk8] }
[windows-jdk8] [withMaven] One or multiple Maven executions have been ignored by the Jenkins
Pipeline Maven Plugin because they have been interrupted before completion (1). See Pipeline
Maven Plugin FAQ for more details.
[Pipeline] [windows-jdk7] // withMaven
[Pipeline] [linux-jdk8] // withMaven
[Pipeline] [linux-jdk7] // withMaven
[Pipeline] [linux-jdk9] // withMaven
[Pipeline] [windows-jdk8] // withMaven
[Pipeline] [windows-jdk7] }
[Pipeline] [linux-jdk8] echo
[linux-jdk8] [FAIL FAST] linux-jdk10 had first failure, ignoring script returned exit code
143
[Pipeline] [linux-jdk8] }
[Pipeline] [linux-jdk7] echo
[linux-jdk7] [FAIL FAST] linux-jdk10 had first failure, ignoring script returned exit code
143
[Pipeline] [linux-jdk7] }
[Pipeline] [linux-jdk9] echo
[linux-jdk9] [FAIL FAST] linux-jdk10 had first failure, ignoring script returned exit code
143
[Pipeline] [linux-jdk9] }
[Pipeline] [windows-jdk9] }
[Pipeline] [windows-jdk8] echo
[windows-jdk8] [FAIL FAST] linux-jdk10 had first failure, ignoring script returned exit code
-1
[Pipeline] [windows-jdk8] }
[Pipeline] [windows-jdk7] // stage
[Pipeline] [linux-jdk8] // stage
[Pipeline] [linux-jdk7] // stage
[Pipeline] [linux-jdk9] // stage
[Pipeline] [windows-jdk9] // dir
[Pipeline] [windows-jdk8] // stage
[Pipeline] [linux-jdk7] }
[Pipeline] [linux-jdk8] }
[Pipeline] [linux-jdk9] }
[Pipeline] [windows-jdk7] }
[Pipeline] [windows-jdk8] }
[Pipeline] [windows-jdk9] }
[windows-jdk9] [withMaven] One or multiple Maven executions have been ignored by the Jenkins
Pipeline Maven Plugin because they have been interrupted before completion (1). See Pipeline
Maven Plugin FAQ for more details.
[Pipeline] [linux-jdk7] // node
[Pipeline] [linux-jdk8] // node
[Pipeline] [linux-jdk9] // node
[Pipeline] [windows-jdk7] // node
[Pipeline] [windows-jdk8] // node
[Pipeline] [windows-jdk9] // withMaven
[Pipeline] [linux-jdk7] }
[Pipeline] [linux-jdk8] }
[Pipeline] [linux-jdk9] }
[Pipeline] [windows-jdk7] }
[Pipeline] [windows-jdk8] }
[Pipeline] [windows-jdk9] echo
[windows-jdk9] [FAIL FAST] linux-jdk10 had first failure, ignoring script returned exit code
-1
[Pipeline] [windows-jdk9] }
[Pipeline] [windows-jdk9] // stage
[Pipeline] [windows-jdk9] }
[Pipeline] [windows-jdk9] // node
[Pipeline] [windows-jdk9] }
[Pipeline] // parallel
[Pipeline] echo
***** FAST FAILURE *****

Fast failure triggered by linux-jdk10

***** FAST FAILURE *****
[Pipeline] stage
[Pipeline] { (Notifications)
[Pipeline] echo
Build result: FAILURE
[Pipeline] jiraIssueSelector
[Pipeline] jiraComment
[Pipeline] emailext
Mime
  • Unnamed multipart/mixed (inline, None, 0 bytes)
View raw message