maven-notifications mailing list archives

Site index · List index
Message view « Date » · « Thread »
Top « Date » · « Thread »
From Apache Jenkins Server <jenk...@builds.apache.org>
Subject Build failed in Jenkins: Maven TLP » maven-enforcer » MENFORCER-299 #1
Date Wed, 09 May 2018 20:22:36 GMT
See https://builds.apache.org/job/maven-box/job/maven-enforcer/job/MENFORCER-299/1/

No changes.

No tests ran.

Build log:
[...truncated 1.57 MB...]
[windows-jdk8] [INFO] Downloading: https://repo.maven.apache.org/maven2/org/apache/maven/archetype/archetype-registry/2.2/archetype-registry-2.2.jar
[windows-jdk8] [INFO] Downloading: https://repo.maven.apache.org/maven2/org/apache/maven/archetype/archetype-descriptor/2.2/archetype-descriptor-2.2.jar
[windows-jdk8] [INFO] Downloading: https://repo.maven.apache.org/maven2/org/apache/maven/archetype/archetype-catalog/2.2/archetype-catalog-2.2.jar
[windows-jdk8] [INFO] Downloaded: https://repo.maven.apache.org/maven2/org/apache/maven/archetype/archetype-descriptor/2.2/archetype-descriptor-2.2.jar
(26 kB at 2.0 MB/s)
[windows-jdk8] [INFO] Downloading: https://repo.maven.apache.org/maven2/net/sourceforge/jchardet/jchardet/1.0/jchardet-1.0.jar
[windows-jdk8] [INFO] Downloaded: https://repo.maven.apache.org/maven2/org/codehaus/mojo/mrm-api/1.0.0/mrm-api-1.0.0.jar
(17 kB at 1.1 MB/s)
[windows-jdk8] [INFO] Downloading: https://repo.maven.apache.org/maven2/dom4j/dom4j/1.6.1/dom4j-1.6.1.jar
[windows-jdk8] [INFO] Downloaded: https://repo.maven.apache.org/maven2/org/apache/maven/archetype/archetype-registry/2.2/archetype-registry-2.2.jar
(20 kB at 1.3 MB/s)
[windows-jdk8] [INFO] Downloading: https://repo.maven.apache.org/maven2/xml-apis/xml-apis/1.0.b2/xml-apis-1.0.b2.jar
[windows-jdk8] [INFO] Downloaded: https://repo.maven.apache.org/maven2/org/apache/maven/archetype/archetype-catalog/2.2/archetype-catalog-2.2.jar
(22 kB at 957 kB/s)
[windows-jdk8] [INFO] Downloading: https://repo.maven.apache.org/maven2/jdom/jdom/1.0/jdom-1.0.jar
[windows-jdk8] [INFO] Downloaded: https://repo.maven.apache.org/maven2/org/apache/maven/archetype/archetype-common/2.2/archetype-common-2.2.jar
(176 kB at 6.8 MB/s)
[windows-jdk8] [INFO] Downloading: https://repo.maven.apache.org/maven2/org/apache/maven/shared/maven-invoker/2.0.11/maven-invoker-2.0.11.jar
[windows-jdk8] [INFO] Downloaded: https://repo.maven.apache.org/maven2/net/sourceforge/jchardet/jchardet/1.0/jchardet-1.0.jar
(27 kB at 950 kB/s)
[windows-jdk8] [INFO] Downloading: https://repo.maven.apache.org/maven2/commons-collections/commons-collections/3.1/commons-collections-3.1.jar
[windows-jdk8] [INFO] Downloaded: https://repo.maven.apache.org/maven2/xml-apis/xml-apis/1.0.b2/xml-apis-1.0.b2.jar
(109 kB at 3.8 MB/s)
[windows-jdk8] [INFO] Downloading: https://repo.maven.apache.org/maven2/org/codehaus/mojo/mrm-servlet/1.0.0/mrm-servlet-1.0.0.jar
[windows-jdk8] [INFO] Downloaded: https://repo.maven.apache.org/maven2/org/apache/maven/shared/maven-invoker/2.0.11/maven-invoker-2.0.11.jar
(29 kB at 826 kB/s)
[windows-jdk8] [INFO] Downloading: https://repo.maven.apache.org/maven2/commons-io/commons-io/2.0.1/commons-io-2.0.1.jar
[windows-jdk8] [INFO] Downloaded: https://repo.maven.apache.org/maven2/jdom/jdom/1.0/jdom-1.0.jar
(153 kB at 3.9 MB/s)
[windows-jdk8] [INFO] Downloading: https://repo.maven.apache.org/maven2/org/mortbay/jetty/jetty/6.1.5/jetty-6.1.5.jar
[windows-jdk8] [INFO] Downloaded: https://repo.maven.apache.org/maven2/dom4j/dom4j/1.6.1/dom4j-1.6.1.jar
(314 kB at 7.3 MB/s)
[windows-jdk8] [INFO] Downloading: https://repo.maven.apache.org/maven2/org/mortbay/jetty/jetty-util/6.1.5/jetty-util-6.1.5.jar
[windows-jdk8] [INFO] Downloaded: https://repo.maven.apache.org/maven2/org/codehaus/mojo/mrm-servlet/1.0.0/mrm-servlet-1.0.0.jar
(83 kB at 1.9 MB/s)
[windows-jdk8] [INFO] Downloading: https://repo.maven.apache.org/maven2/org/mortbay/jetty/servlet-api-2.5/6.1.5/servlet-api-2.5-6.1.5.jar
[windows-jdk8] [INFO] Downloaded: https://repo.maven.apache.org/maven2/commons-io/commons-io/2.0.1/commons-io-2.0.1.jar
(160 kB at 2.9 MB/s)
[windows-jdk8] [INFO] Downloading: https://repo.maven.apache.org/maven2/org/apache/maven/maven-repository-metadata/3.0.3/maven-repository-metadata-3.0.3.jar
[windows-jdk8] [INFO] Downloaded: https://repo.maven.apache.org/maven2/org/mortbay/jetty/jetty-util/6.1.5/jetty-util-6.1.5.jar
(138 kB at 2.5 MB/s)
[windows-jdk8] [INFO] Downloaded: https://repo.maven.apache.org/maven2/commons-collections/commons-collections/3.1/commons-collections-3.1.jar
(559 kB at 9.0 MB/s)
[windows-jdk8] [INFO] Downloaded: https://repo.maven.apache.org/maven2/org/mortbay/jetty/servlet-api-2.5/6.1.5/servlet-api-2.5-6.1.5.jar
(133 kB at 2.1 MB/s)
[windows-jdk8] [INFO] Downloaded: https://repo.maven.apache.org/maven2/org/apache/maven/maven-repository-metadata/3.0.3/maven-repository-metadata-3.0.3.jar
(30 kB at 449 kB/s)
[windows-jdk8] [INFO] Downloaded: https://repo.maven.apache.org/maven2/org/mortbay/jetty/jetty/6.1.5/jetty-6.1.5.jar
(486 kB at 6.7 MB/s)
[Pipeline] [windows-jdk10] }
[windows-jdk10] [withMaven] junitPublisher - Archive test results for Maven artifact org.apache.maven.enforcer:enforcer-api:3.0.0-SNAPSHOT
generated by maven-surefire-plugin:test (default-test): m\enforcer-api\target\surefire-reports\*.xml
[windows-jdk10] Recording test results
[windows-jdk10] None of the test reports contained any result
[windows-jdk10] [withMaven] junitPublisher - Archive test results for Maven artifact org.apache.maven.enforcer:enforcer-rules:3.0.0-SNAPSHOT
generated by maven-surefire-plugin:test (default-test): m\enforcer-rules\target\surefire-reports\*.xml
[windows-jdk10] Recording test results
[windows-jdk10] None of the test reports contained any result
[Pipeline] [windows-jdk10] // withMaven
[Pipeline] [windows-jdk10] echo
[windows-jdk10] [FAIL FAST] This is the first failure and likely root cause
[Pipeline] [windows-jdk10] }
[Pipeline] [windows-jdk10] // stage
[Pipeline] [windows-jdk10] }
[windows-jdk8] [INFO] Configuring Mock Repository Manager...
[windows-jdk8] [INFO]   Mock content (source: F:\jenkins\jenkins-slave\workspace\aven-enforcer_MENFORCER-299-JYF4EYVQU3RDML3TRBRXRLFNLPIH5JHTRNK27BN6C35J3VPSG73Q\m\maven-enforcer-plugin\src\it\mrm\repository)
[windows-jdk8] [INFO]   Proxy (source: this Maven session)
[windows-jdk8] [INFO] Starting Mock Repository Manager
[Pipeline] [windows-jdk10] // node
[Pipeline] [windows-jdk10] }
[linux-jdk7] Sending interrupt signal to process
[windows-jdk10] Failed in branch windows-jdk10
[windows-jdk8] [INFO] Logging to org.slf4j.impl.MavenSimpleLogger(org.mortbay.log) via org.mortbay.log.Slf4jLog
[windows-jdk8] [INFO] jetty-6.1.5
[windows-jdk8] [INFO] Started SocketConnector@0.0.0.0:60510
[windows-jdk8] [INFO] Mock Repository Manager http://localhost:60510 is started.
[windows-jdk8] [INFO] Setting property 'repository.proxy.url' to 'http://localhost:60510'.
[windows-jdk8] [INFO] 
[windows-jdk8] [INFO] --- maven-invoker-plugin:3.0.1:run (integration-test) @ maven-enforcer-plugin
---
[windows-jdk8] [INFO] Running Setup Jobs
[windows-jdk8] [INFO] Building: always-fail\pom.xml
[windows-jdk9] [INFO] Installing f:\jenkins\jenkins-slave\workspace\aven-enforcer_MENFORCER-299-JYF4EYVQU3RDML3TRBRXRLFNLPIH5JHTRNK27BN6C35J3VPSG73Q\m\pom.xml
to F:\jenkins\jenkins-slave\workspace\aven-enforcer_MENFORCER-299-JYF4EYVQU3RDML3TRBRXRLFNLPIH5JHTRNK27BN6C35J3VPSG73Q\m\maven-enforcer-plugin\target\local-repo\org\apache\maven\enforcer\enforcer\3.0.0-SNAPSHOT\enforcer-3.0.0-SNAPSHOT.pom
[windows-jdk9] [INFO] Installing f:\jenkins\jenkins-slave\workspace\aven-enforcer_MENFORCER-299-JYF4EYVQU3RDML3TRBRXRLFNLPIH5JHTRNK27BN6C35J3VPSG73Q\m\target\enforcer-3.0.0-SNAPSHOT-site.xml
to F:\jenkins\jenkins-slave\workspace\aven-enforcer_MENFORCER-299-JYF4EYVQU3RDML3TRBRXRLFNLPIH5JHTRNK27BN6C35J3VPSG73Q\m\maven-enforcer-plugin\target\local-repo\org\apache\maven\enforcer\enforcer\3.0.0-SNAPSHOT\enforcer-3.0.0-SNAPSHOT-site.xml
[windows-jdk9] [INFO] Installing F:\jenkins\jenkins-slave\workspace\aven-enforcer_MENFORCER-299-JYF4EYVQU3RDML3TRBRXRLFNLPIH5JHTRNK27BN6C35J3VPSG73Q\m\enforcer-api\pom.xml
to F:\jenkins\jenkins-slave\workspace\aven-enforcer_MENFORCER-299-JYF4EYVQU3RDML3TRBRXRLFNLPIH5JHTRNK27BN6C35J3VPSG73Q\m\maven-enforcer-plugin\target\local-repo\org\apache\maven\enforcer\enforcer-api\3.0.0-SNAPSHOT\enforcer-api-3.0.0-SNAPSHOT.pom
[windows-jdk9] [INFO] Installing F:\jenkins\jenkins-slave\workspace\aven-enforcer_MENFORCER-299-JYF4EYVQU3RDML3TRBRXRLFNLPIH5JHTRNK27BN6C35J3VPSG73Q\m\enforcer-api\target\enforcer-api-3.0.0-SNAPSHOT.jar
to F:\jenkins\jenkins-slave\workspace\aven-enforcer_MENFORCER-299-JYF4EYVQU3RDML3TRBRXRLFNLPIH5JHTRNK27BN6C35J3VPSG73Q\m\maven-enforcer-plugin\target\local-repo\org\apache\maven\enforcer\enforcer-api\3.0.0-SNAPSHOT\enforcer-api-3.0.0-SNAPSHOT.jar
[windows-jdk9] [INFO] Installing F:\jenkins\jenkins-slave\workspace\aven-enforcer_MENFORCER-299-JYF4EYVQU3RDML3TRBRXRLFNLPIH5JHTRNK27BN6C35J3VPSG73Q\m\enforcer-rules\pom.xml
to F:\jenkins\jenkins-slave\workspace\aven-enforcer_MENFORCER-299-JYF4EYVQU3RDML3TRBRXRLFNLPIH5JHTRNK27BN6C35J3VPSG73Q\m\maven-enforcer-plugin\target\local-repo\org\apache\maven\enforcer\enforcer-rules\3.0.0-SNAPSHOT\enforcer-rules-3.0.0-SNAPSHOT.pom
[windows-jdk9] [INFO] Installing F:\jenkins\jenkins-slave\workspace\aven-enforcer_MENFORCER-299-JYF4EYVQU3RDML3TRBRXRLFNLPIH5JHTRNK27BN6C35J3VPSG73Q\m\enforcer-rules\target\enforcer-rules-3.0.0-SNAPSHOT.jar
to F:\jenkins\jenkins-slave\workspace\aven-enforcer_MENFORCER-299-JYF4EYVQU3RDML3TRBRXRLFNLPIH5JHTRNK27BN6C35J3VPSG73Q\m\maven-enforcer-plugin\target\local-repo\org\apache\maven\enforcer\enforcer-rules\3.0.0-SNAPSHOT\enforcer-rules-3.0.0-SNAPSHOT.jar
[windows-jdk9] [INFO] Installing F:\jenkins\jenkins-slave\workspace\aven-enforcer_MENFORCER-299-JYF4EYVQU3RDML3TRBRXRLFNLPIH5JHTRNK27BN6C35J3VPSG73Q\m\enforcer-rules\target\enforcer-rules-3.0.0-SNAPSHOT-tests.jar
to F:\jenkins\jenkins-slave\workspace\aven-enforcer_MENFORCER-299-JYF4EYVQU3RDML3TRBRXRLFNLPIH5JHTRNK27BN6C35J3VPSG73Q\m\maven-enforcer-plugin\target\local-repo\org\apache\maven\enforcer\enforcer-rules\3.0.0-SNAPSHOT\enforcer-rules-3.0.0-SNAPSHOT-tests.jar
[windows-jdk9] [INFO] Installing F:\jenkins\jenkins-slave\workspace\aven-enforcer_MENFORCER-299-JYF4EYVQU3RDML3TRBRXRLFNLPIH5JHTRNK27BN6C35J3VPSG73Q\m\maven-enforcer-plugin\pom.xml
to F:\jenkins\jenkins-slave\workspace\aven-enforcer_MENFORCER-299-JYF4EYVQU3RDML3TRBRXRLFNLPIH5JHTRNK27BN6C35J3VPSG73Q\m\maven-enforcer-plugin\target\local-repo\org\apache\maven\plugins\maven-enforcer-plugin\3.0.0-SNAPSHOT\maven-enforcer-plugin-3.0.0-SNAPSHOT.pom
[windows-jdk9] [INFO] Installing F:\jenkins\jenkins-slave\workspace\aven-enforcer_MENFORCER-299-JYF4EYVQU3RDML3TRBRXRLFNLPIH5JHTRNK27BN6C35J3VPSG73Q\m\maven-enforcer-plugin\target\maven-enforcer-plugin-3.0.0-SNAPSHOT.jar
to F:\jenkins\jenkins-slave\workspace\aven-enforcer_MENFORCER-299-JYF4EYVQU3RDML3TRBRXRLFNLPIH5JHTRNK27BN6C35J3VPSG73Q\m\maven-enforcer-plugin\target\local-repo\org\apache\maven\plugins\maven-enforcer-plugin\3.0.0-SNAPSHOT\maven-enforcer-plugin-3.0.0-SNAPSHOT.jar
[windows-jdk9] [INFO] 
[windows-jdk9] [INFO] --- mrm-maven-plugin:1.0.0:start (default) @ maven-enforcer-plugin ---
[windows-jdk9] [INFO] Downloading: https://repo.maven.apache.org/maven2/org/codehaus/mojo/mrm-api/1.0.0/mrm-api-1.0.0.pom
[windows-jdk9] [INFO] Downloaded: https://repo.maven.apache.org/maven2/org/codehaus/mojo/mrm-api/1.0.0/mrm-api-1.0.0.pom
(2.1 kB at 149 kB/s)
[windows-jdk9] [INFO] Downloading: https://repo.maven.apache.org/maven2/org/apache/maven/maven-repository-metadata/3.0.3/maven-repository-metadata-3.0.3.pom
[windows-jdk9] [INFO] Downloaded: https://repo.maven.apache.org/maven2/org/apache/maven/maven-repository-metadata/3.0.3/maven-repository-metadata-3.0.3.pom
(1.9 kB at 161 kB/s)
[windows-jdk9] [INFO] Downloading: https://repo.maven.apache.org/maven2/org/apache/maven/maven/3.0.3/maven-3.0.3.pom
[windows-jdk9] [INFO] Downloaded: https://repo.maven.apache.org/maven2/org/apache/maven/maven/3.0.3/maven-3.0.3.pom
(23 kB at 1.9 MB/s)
[windows-jdk9] [INFO] Downloading: https://repo.maven.apache.org/maven2/junit/junit/4.10/junit-4.10.pom
[windows-jdk9] [INFO] Downloaded: https://repo.maven.apache.org/maven2/junit/junit/4.10/junit-4.10.pom
(2.3 kB at 213 kB/s)
[windows-jdk9] [INFO] Downloading: https://repo.maven.apache.org/maven2/org/hamcrest/hamcrest-core/1.1/hamcrest-core-1.1.pom
[windows-jdk9] [INFO] Downloaded: https://repo.maven.apache.org/maven2/org/hamcrest/hamcrest-core/1.1/hamcrest-core-1.1.pom
(481 B at 40 kB/s)
[windows-jdk9] [INFO] Downloading: https://repo.maven.apache.org/maven2/org/hamcrest/hamcrest-parent/1.1/hamcrest-parent-1.1.pom
[windows-jdk9] [INFO] Downloaded: https://repo.maven.apache.org/maven2/org/hamcrest/hamcrest-parent/1.1/hamcrest-parent-1.1.pom
(5.9 kB at 452 kB/s)
[windows-jdk9] [INFO] Downloading: https://repo.maven.apache.org/maven2/org/apache/maven/archetype/archetype-common/2.2/archetype-common-2.2.pom
[windows-jdk9] [INFO] Downloaded: https://repo.maven.apache.org/maven2/org/apache/maven/archetype/archetype-common/2.2/archetype-common-2.2.pom
(16 kB at 1.2 MB/s)
[windows-jdk9] [INFO] Downloading: https://repo.maven.apache.org/maven2/org/apache/maven/archetype/maven-archetype/2.2/maven-archetype-2.2.pom
[windows-jdk9] [INFO] Downloaded: https://repo.maven.apache.org/maven2/org/apache/maven/archetype/maven-archetype/2.2/maven-archetype-2.2.pom
(15 kB at 1.1 MB/s)
[windows-jdk9] [INFO] Downloading: https://repo.maven.apache.org/maven2/org/apache/maven/archetype/archetype-catalog/2.2/archetype-catalog-2.2.pom
[windows-jdk9] [INFO] Downloaded: https://repo.maven.apache.org/maven2/org/apache/maven/archetype/archetype-catalog/2.2/archetype-catalog-2.2.pom
(1.9 kB at 157 kB/s)
[windows-jdk9] [INFO] Downloading: https://repo.maven.apache.org/maven2/org/apache/maven/archetype/archetype-models/2.2/archetype-models-2.2.pom
[windows-jdk9] [INFO] Downloaded: https://repo.maven.apache.org/maven2/org/apache/maven/archetype/archetype-models/2.2/archetype-models-2.2.pom
(2.7 kB at 210 kB/s)
[windows-jdk9] [INFO] Downloading: https://repo.maven.apache.org/maven2/org/apache/maven/archetype/archetype-descriptor/2.2/archetype-descriptor-2.2.pom
[windows-jdk9] [INFO] Downloaded: https://repo.maven.apache.org/maven2/org/apache/maven/archetype/archetype-descriptor/2.2/archetype-descriptor-2.2.pom
(1.9 kB at 158 kB/s)
[windows-jdk9] [INFO] Downloading: https://repo.maven.apache.org/maven2/org/apache/maven/archetype/archetype-registry/2.2/archetype-registry-2.2.pom
[windows-jdk9] [INFO] Downloaded: https://repo.maven.apache.org/maven2/org/apache/maven/archetype/archetype-registry/2.2/archetype-registry-2.2.pom
(1.9 kB at 145 kB/s)
[windows-jdk9] [INFO] Downloading: https://repo.maven.apache.org/maven2/net/sourceforge/jchardet/jchardet/1.0/jchardet-1.0.pom
[windows-jdk9] [INFO] Downloaded: https://repo.maven.apache.org/maven2/net/sourceforge/jchardet/jchardet/1.0/jchardet-1.0.pom
(1.3 kB at 111 kB/s)
[windows-jdk9] [INFO] Downloading: https://repo.maven.apache.org/maven2/dom4j/dom4j/1.6.1/dom4j-1.6.1.pom
[windows-jdk9] [INFO] Downloaded: https://repo.maven.apache.org/maven2/dom4j/dom4j/1.6.1/dom4j-1.6.1.pom
(6.8 kB at 564 kB/s)
[windows-jdk9] [INFO] Downloading: https://repo.maven.apache.org/maven2/jdom/jdom/1.0/jdom-1.0.pom
[windows-jdk9] [INFO] Downloaded: https://repo.maven.apache.org/maven2/jdom/jdom/1.0/jdom-1.0.pom
(1.2 kB at 117 kB/s)
[windows-jdk9] [INFO] Downloading: https://repo.maven.apache.org/maven2/org/apache/maven/shared/maven-invoker/2.0.11/maven-invoker-2.0.11.pom
[windows-jdk9] [INFO] Downloaded: https://repo.maven.apache.org/maven2/org/apache/maven/shared/maven-invoker/2.0.11/maven-invoker-2.0.11.pom
(5.1 kB at 461 kB/s)
[windows-jdk9] [INFO] Downloading: https://repo.maven.apache.org/maven2/commons-io/commons-io/2.0.1/commons-io-2.0.1.pom
[windows-jdk9] [INFO] Downloaded: https://repo.maven.apache.org/maven2/commons-io/commons-io/2.0.1/commons-io-2.0.1.pom
(9.0 kB at 819 kB/s)
[windows-jdk9] [INFO] Downloading: https://repo.maven.apache.org/maven2/org/apache/commons/commons-parent/15/commons-parent-15.pom
[windows-jdk9] [INFO] Downloaded: https://repo.maven.apache.org/maven2/org/apache/commons/commons-parent/15/commons-parent-15.pom
(32 kB at 2.6 MB/s)
[windows-jdk9] [INFO] Downloading: https://repo.maven.apache.org/maven2/org/codehaus/mojo/mrm-servlet/1.0.0/mrm-servlet-1.0.0.pom
[windows-jdk9] [INFO] Downloaded: https://repo.maven.apache.org/maven2/org/codehaus/mojo/mrm-servlet/1.0.0/mrm-servlet-1.0.0.pom
(2.7 kB at 210 kB/s)
[linux-jdk7] [INFO]           require-plugin-versions-plugin-with-extensions/pom.xml FAILED
(3.8 s)
[linux-jdk7] [INFO]   The build exited with code 143. See /home/jenkins/jenkins-slave/workspace/aven-enforcer_MENFORCER-299-JYF4EYVQU3RDML3TRBRXRLFNLPIH5JHTRNK27BN6C35J3VPSG73Q/m/maven-enforcer-plugin/target/it/require-plugin-versions-plugin-with-extensions/build.log
for details.
[linux-jdk7] [INFO] Building: require-plugin-versions-mm-ci-friendly/pom.xml
[linux-jdk7] Terminated
[windows-jdk7] Sending interrupt signal to process
[windows-jdk8] Sending interrupt signal to process
[windows-jdk9] Sending interrupt signal to process
[windows-jdk8] [INFO]           always-fail\pom.xml .............................. FAILED
(0.8 s)
[windows-jdk8] [INFO]   The build exited with code 0. See F:\jenkins\jenkins-slave\workspace\aven-enforcer_MENFORCER-299-JYF4EYVQU3RDML3TRBRXRLFNLPIH5JHTRNK27BN6C35J3VPSG73Q\m\maven-enforcer-plugin\target\it\always-fail\build.log
for details.
[windows-jdk8] [INFO] Building: always-fail-warn\pom.xml
[windows-jdk9] [INFO] Downloading: https://repo.maven.apache.org/maven2/org/mortbay/jetty/jetty/6.1.5/jetty-6.1.5.pom
[windows-jdk9] [INFO] Downloaded: https://repo.maven.apache.org/maven2/org/mortbay/jetty/jetty/6.1.5/jetty-6.1.5.pom
(4.1 kB at 295 kB/s)
[windows-jdk9] [INFO] Downloading: https://repo.maven.apache.org/maven2/org/mortbay/jetty/project/6.1.5/project-6.1.5.pom
[windows-jdk9] [INFO] Downloaded: https://repo.maven.apache.org/maven2/org/mortbay/jetty/project/6.1.5/project-6.1.5.pom
(13 kB at 1.0 MB/s)
[windows-jdk9] [INFO] Downloading: https://repo.maven.apache.org/maven2/org/mortbay/jetty/jetty-util/6.1.5/jetty-util-6.1.5.pom
[windows-jdk9] [INFO] Downloaded: https://repo.maven.apache.org/maven2/org/mortbay/jetty/jetty-util/6.1.5/jetty-util-6.1.5.pom
(3.9 kB at 322 kB/s)
[windows-jdk9] [INFO] Downloading: https://repo.maven.apache.org/maven2/org/mortbay/jetty/servlet-api-2.5/6.1.5/servlet-api-2.5-6.1.5.pom
[windows-jdk9] [INFO] Downloaded: https://repo.maven.apache.org/maven2/org/mortbay/jetty/servlet-api-2.5/6.1.5/servlet-api-2.5-6.1.5.pom
(4.0 kB at 310 kB/s)
[windows-jdk9] [INFO] Downloading: https://repo.maven.apache.org/maven2/org/codehaus/mojo/mrm-api/1.0.0/mrm-api-1.0.0.jar
[windows-jdk9] [INFO] Downloading: https://repo.maven.apache.org/maven2/org/apache/maven/archetype/archetype-common/2.2/archetype-common-2.2.jar
[windows-jdk9] [INFO] Downloading: https://repo.maven.apache.org/maven2/org/apache/maven/archetype/archetype-catalog/2.2/archetype-catalog-2.2.jar
[windows-jdk9] [INFO] Downloading: https://repo.maven.apache.org/maven2/org/apache/maven/archetype/archetype-descriptor/2.2/archetype-descriptor-2.2.jar
[windows-jdk9] [INFO] Downloading: https://repo.maven.apache.org/maven2/org/apache/maven/archetype/archetype-registry/2.2/archetype-registry-2.2.jar
[windows-jdk9] [INFO] Downloaded: https://repo.maven.apache.org/maven2/org/apache/maven/archetype/archetype-common/2.2/archetype-common-2.2.jar
(176 kB at 7.3 MB/s)
[windows-jdk9] [INFO] Downloading: https://repo.maven.apache.org/maven2/net/sourceforge/jchardet/jchardet/1.0/jchardet-1.0.jar
[windows-jdk9] [INFO] Downloaded: https://repo.maven.apache.org/maven2/org/apache/maven/archetype/archetype-registry/2.2/archetype-registry-2.2.jar
(20 kB at 233 kB/s)
[windows-jdk9] [INFO] Downloading: https://repo.maven.apache.org/maven2/dom4j/dom4j/1.6.1/dom4j-1.6.1.jar
[windows-jdk9] [INFO] Downloaded: https://repo.maven.apache.org/maven2/org/codehaus/mojo/mrm-api/1.0.0/mrm-api-1.0.0.jar
(17 kB at 174 kB/s)
[windows-jdk9] [INFO] Downloading: https://repo.maven.apache.org/maven2/xml-apis/xml-apis/1.0.b2/xml-apis-1.0.b2.jar
[windows-jdk9] [INFO] Downloaded: https://repo.maven.apache.org/maven2/dom4j/dom4j/1.6.1/dom4j-1.6.1.jar
(314 kB at 3.0 MB/s)
[windows-jdk9] [INFO] Downloading: https://repo.maven.apache.org/maven2/jdom/jdom/1.0/jdom-1.0.jar
[windows-jdk9] [INFO] Downloaded: https://repo.maven.apache.org/maven2/org/apache/maven/archetype/archetype-catalog/2.2/archetype-catalog-2.2.jar
(22 kB at 204 kB/s)
[windows-jdk9] [INFO] Downloading: https://repo.maven.apache.org/maven2/org/apache/maven/shared/maven-invoker/2.0.11/maven-invoker-2.0.11.jar
[windows-jdk9] [INFO] Downloaded: https://repo.maven.apache.org/maven2/jdom/jdom/1.0/jdom-1.0.jar
(153 kB at 1.2 MB/s)
[windows-jdk9] [INFO] Downloading: https://repo.maven.apache.org/maven2/commons-collections/commons-collections/3.1/commons-collections-3.1.jar
[windows-jdk9] [INFO] Downloaded: https://repo.maven.apache.org/maven2/xml-apis/xml-apis/1.0.b2/xml-apis-1.0.b2.jar
(109 kB at 847 kB/s)
[windows-jdk9] [INFO] Downloading: https://repo.maven.apache.org/maven2/org/codehaus/mojo/mrm-servlet/1.0.0/mrm-servlet-1.0.0.jar
[windows-jdk9] [INFO] Downloaded: https://repo.maven.apache.org/maven2/net/sourceforge/jchardet/jchardet/1.0/jchardet-1.0.jar
(27 kB at 203 kB/s)
[windows-jdk9] [INFO] Downloading: https://repo.maven.apache.org/maven2/commons-io/commons-io/2.0.1/commons-io-2.0.1.jar
[windows-jdk9] [INFO] Downloaded: https://repo.maven.apache.org/maven2/commons-collections/commons-collections/3.1/commons-collections-3.1.jar
(559 kB at 3.7 MB/s)
[windows-jdk9] [INFO] Downloading: https://repo.maven.apache.org/maven2/org/mortbay/jetty/jetty/6.1.5/jetty-6.1.5.jar
[windows-jdk9] [INFO] Downloaded: https://repo.maven.apache.org/maven2/org/codehaus/mojo/mrm-servlet/1.0.0/mrm-servlet-1.0.0.jar
(83 kB at 537 kB/s)
[windows-jdk9] [INFO] Downloading: https://repo.maven.apache.org/maven2/org/mortbay/jetty/jetty-util/6.1.5/jetty-util-6.1.5.jar
[windows-jdk9] [INFO] Downloaded: https://repo.maven.apache.org/maven2/commons-io/commons-io/2.0.1/commons-io-2.0.1.jar
(160 kB at 973 kB/s)
[windows-jdk9] [INFO] Downloading: https://repo.maven.apache.org/maven2/org/mortbay/jetty/servlet-api-2.5/6.1.5/servlet-api-2.5-6.1.5.jar
[windows-jdk9] [INFO] Downloaded: https://repo.maven.apache.org/maven2/org/mortbay/jetty/jetty/6.1.5/jetty-6.1.5.jar
(486 kB at 2.7 MB/s)
[windows-jdk9] [INFO] Downloading: https://repo.maven.apache.org/maven2/org/apache/maven/maven-repository-metadata/3.0.3/maven-repository-metadata-3.0.3.jar
[windows-jdk9] [INFO] Downloaded: https://repo.maven.apache.org/maven2/org/mortbay/jetty/servlet-api-2.5/6.1.5/servlet-api-2.5-6.1.5.jar
(133 kB at 646 kB/s)
[windows-jdk9] [INFO] Downloaded: https://repo.maven.apache.org/maven2/org/apache/maven/archetype/archetype-descriptor/2.2/archetype-descriptor-2.2.jar
(26 kB at 122 kB/s)
[windows-jdk9] [INFO] Downloaded: https://repo.maven.apache.org/maven2/org/mortbay/jetty/jetty-util/6.1.5/jetty-util-6.1.5.jar
(138 kB at 620 kB/s)
[windows-jdk9] [INFO] Downloaded: https://repo.maven.apache.org/maven2/org/apache/maven/shared/maven-invoker/2.0.11/maven-invoker-2.0.11.jar
(29 kB at 119 kB/s)
[windows-jdk9] [INFO] Downloaded: https://repo.maven.apache.org/maven2/org/apache/maven/maven-repository-metadata/3.0.3/maven-repository-metadata-3.0.3.jar
(30 kB at 119 kB/s)
[windows-jdk9] [INFO] Configuring Mock Repository Manager...
[windows-jdk9] [INFO]   Mock content (source: F:\jenkins\jenkins-slave\workspace\aven-enforcer_MENFORCER-299-JYF4EYVQU3RDML3TRBRXRLFNLPIH5JHTRNK27BN6C35J3VPSG73Q\m\maven-enforcer-plugin\src\it\mrm\repository)
[windows-jdk9] [INFO]   Proxy (source: this Maven session)
[windows-jdk9] [INFO] Starting Mock Repository Manager
[windows-jdk9] [INFO] Logging to org.slf4j.impl.MavenSimpleLogger(org.mortbay.log) via org.mortbay.log.Slf4jLog
[windows-jdk9] [INFO] jetty-6.1.x
[windows-jdk9] [INFO] Started SocketConnector@0.0.0.0:59837
[windows-jdk9] [INFO] Mock Repository Manager http://localhost:59837 is started.
[windows-jdk9] [INFO] Setting property 'repository.proxy.url' to 'http://localhost:59837'.
[windows-jdk9] [INFO] 
[windows-jdk9] [INFO] --- maven-invoker-plugin:3.0.1:run (integration-test) @ maven-enforcer-plugin
---
[windows-jdk9] [INFO] Running Setup Jobs
[windows-jdk9] [INFO] Building: always-fail\pom.xml
[Pipeline] [linux-jdk8] // node
[Pipeline] [linux-jdk9] // node
[Pipeline] [linux-jdk10] // node
[Pipeline] [linux-jdk8] }
[linux-jdk8] Failed in branch linux-jdk8
[Pipeline] [linux-jdk9] }
[linux-jdk9] Failed in branch linux-jdk9
[Pipeline] [linux-jdk10] }
[linux-jdk10] Failed in branch linux-jdk10
[Pipeline] [windows-jdk8] }
[Pipeline] [linux-jdk7] }
[Pipeline] [windows-jdk8] // dir
[Pipeline] [linux-jdk7] // dir
[windows-jdk9] [INFO]           always-fail\pom.xml .............................. SUCCESS
(0.8 s)
[windows-jdk9] [INFO] Building: always-fail-warn\pom.xml
[Pipeline] [windows-jdk8] }
[windows-jdk8] [withMaven] One or multiple Maven executions have been ignored by the Jenkins
Pipeline Maven Plugin because they have been interrupted before completion (1). See Pipeline
Maven Plugin FAQ for more details.
[Pipeline] [linux-jdk7] }
[linux-jdk7] [withMaven] One or multiple Maven executions have been ignored by the Jenkins
Pipeline Maven Plugin because they have been interrupted before completion (1). See Pipeline
Maven Plugin FAQ for more details.
[Pipeline] [windows-jdk8] // withMaven
[Pipeline] [linux-jdk7] // withMaven
[Pipeline] [windows-jdk8] echo
[windows-jdk8] [FAIL FAST] windows-jdk10 had first failure, ignoring script returned exit
code -1
[Pipeline] [windows-jdk8] }
[Pipeline] [windows-jdk9] }
[Pipeline] [linux-jdk7] echo
[linux-jdk7] [FAIL FAST] windows-jdk10 had first failure, ignoring script returned exit code
143
[Pipeline] [linux-jdk7] }
[Pipeline] [windows-jdk8] // stage
[Pipeline] [windows-jdk9] // dir
[Pipeline] [linux-jdk7] // stage
[Pipeline] [windows-jdk8] }
[Pipeline] [linux-jdk7] }
[Pipeline] [windows-jdk9] }
[windows-jdk9] [withMaven] One or multiple Maven executions have been ignored by the Jenkins
Pipeline Maven Plugin because they have been interrupted before completion (1). See Pipeline
Maven Plugin FAQ for more details.
[Pipeline] [windows-jdk8] // node
[Pipeline] [linux-jdk7] // node
[Pipeline] [windows-jdk9] // withMaven
[Pipeline] [linux-jdk7] }
[Pipeline] [windows-jdk8] }
[Pipeline] [windows-jdk9] echo
[windows-jdk9] [FAIL FAST] windows-jdk10 had first failure, ignoring script returned exit
code -1
[Pipeline] [windows-jdk9] }
[Pipeline] [windows-jdk9] // stage
[Pipeline] [windows-jdk9] }
[Pipeline] [windows-jdk9] // node
[Pipeline] [windows-jdk9] }
[windows-jdk7] After 10s process did not stop
[Pipeline] [windows-jdk7] }
[Pipeline] [windows-jdk7] // dir
[Pipeline] [windows-jdk7] }
[windows-jdk7] [withMaven] One or multiple Maven executions have been ignored by the Jenkins
Pipeline Maven Plugin because they have been interrupted before completion (1). See Pipeline
Maven Plugin FAQ for more details.
[Pipeline] [windows-jdk7] // withMaven
[Pipeline] [windows-jdk7] echo
[windows-jdk7] [FAIL FAST] windows-jdk10 had first failure, ignoring null
[Pipeline] [windows-jdk7] }
[Pipeline] [windows-jdk7] // stage
[Pipeline] [windows-jdk7] }
[Pipeline] [windows-jdk7] // node
[Pipeline] [windows-jdk7] }
[Pipeline] // parallel
[Pipeline] echo
***** FAST FAILURE *****

Fast failure triggered by windows-jdk10

***** FAST FAILURE *****
[Pipeline] stage
[Pipeline] { (Notifications)
[Pipeline] echo
Build result: FAILURE
[Pipeline] jiraIssueSelector
[Pipeline] emailext
Mime
  • Unnamed multipart/mixed (inline, None, 0 bytes)
View raw message