maven-notifications mailing list archives

Site index · List index
Message view « Date » · « Thread »
Top « Date » · « Thread »
From Apache Jenkins Server <jenk...@builds.apache.org>
Subject Build failed in Jenkins: Maven TLP » maven-plugin-tools » MPLUGIN-334 #1
Date Fri, 04 May 2018 05:37:17 GMT
See https://builds.apache.org/job/maven-box/job/maven-plugin-tools/job/MPLUGIN-334/1/

No changes.

All tests passed

Build log:
[...truncated 2.69 MB...]
[windows-jdk10] [INFO] Copying 5 resources
[windows-jdk10] [INFO] Copying 3 resources
[windows-jdk9] [INFO] Downloaded: https://repo.maven.apache.org/maven2/xmlunit/xmlunit/1.5/xmlunit-1.5.pom
(3.0 kB at 117 kB/s)
[windows-jdk9] [INFO] Downloading: https://repo.maven.apache.org/maven2/org/apache/maven/doxia/doxia-site-renderer/1.6/doxia-site-renderer-1.6.pom
[windows-jdk9] [INFO] Downloaded: https://repo.maven.apache.org/maven2/org/apache/maven/doxia/doxia-site-renderer/1.6/doxia-site-renderer-1.6.pom
(6.1 kB at 1.0 MB/s)
[windows-jdk9] [INFO] Downloading: https://repo.maven.apache.org/maven2/org/apache/maven/doxia/doxia-module-xhtml/1.6/doxia-module-xhtml-1.6.pom
[windows-jdk9] [INFO] Downloaded: https://repo.maven.apache.org/maven2/org/apache/maven/doxia/doxia-module-xhtml/1.6/doxia-module-xhtml-1.6.pom
(1.6 kB at 233 kB/s)
[windows-jdk9] [INFO] Downloading: https://repo.maven.apache.org/maven2/org/apache/maven/doxia/doxia-modules/1.6/doxia-modules-1.6.pom
[windows-jdk9] [INFO] Downloaded: https://repo.maven.apache.org/maven2/org/apache/maven/doxia/doxia-modules/1.6/doxia-modules-1.6.pom
(2.6 kB at 437 kB/s)
[windows-jdk9] [INFO] Downloading: https://repo.maven.apache.org/maven2/org/apache/maven/doxia/doxia-module-fml/1.6/doxia-module-fml-1.6.pom
[windows-jdk9] [INFO] Downloaded: https://repo.maven.apache.org/maven2/org/apache/maven/doxia/doxia-module-fml/1.6/doxia-module-fml-1.6.pom
(4.8 kB at 801 kB/s)
[windows-jdk9] [INFO] Downloading: https://repo.maven.apache.org/maven2/commons-validator/commons-validator/1.4.1/commons-validator-1.4.1.pom
[windows-jdk9] [INFO] Downloaded: https://repo.maven.apache.org/maven2/commons-validator/commons-validator/1.4.1/commons-validator-1.4.1.pom
(13 kB at 2.1 MB/s)
[windows-jdk9] [INFO] Downloading: https://repo.maven.apache.org/maven2/org/apache/commons/commons-parent/36/commons-parent-36.pom
[windows-jdk9] [INFO] Downloaded: https://repo.maven.apache.org/maven2/org/apache/commons/commons-parent/36/commons-parent-36.pom
(58 kB at 8.3 MB/s)
[windows-jdk9] [INFO] Downloading: https://repo.maven.apache.org/maven2/commons-beanutils/commons-beanutils/1.8.3/commons-beanutils-1.8.3.pom
[windows-jdk9] [INFO] Downloaded: https://repo.maven.apache.org/maven2/commons-beanutils/commons-beanutils/1.8.3/commons-beanutils-1.8.3.pom
(11 kB at 1.9 MB/s)
[windows-jdk9] [INFO] Downloading: https://repo.maven.apache.org/maven2/org/apache/commons/commons-parent/14/commons-parent-14.pom
[windows-jdk9] [INFO] Downloaded: https://repo.maven.apache.org/maven2/org/apache/commons/commons-parent/14/commons-parent-14.pom
(31 kB at 4.5 MB/s)
[windows-jdk9] [INFO] Downloading: https://repo.maven.apache.org/maven2/commons-digester/commons-digester/1.8.1/commons-digester-1.8.1.pom
[windows-jdk9] [INFO] Downloaded: https://repo.maven.apache.org/maven2/commons-digester/commons-digester/1.8.1/commons-digester-1.8.1.pom
(10 kB at 1.4 MB/s)
[windows-jdk9] [INFO] Downloading: https://repo.maven.apache.org/maven2/org/apache/maven/shared/maven-script-interpreter/1.2/maven-script-interpreter-1.2.pom
[windows-jdk9] [INFO] Downloaded: https://repo.maven.apache.org/maven2/org/apache/maven/shared/maven-script-interpreter/1.2/maven-script-interpreter-1.2.pom
(4.0 kB at 500 kB/s)
[windows-jdk9] [INFO] Downloading: https://repo.maven.apache.org/maven2/org/apache/ant/ant/1.8.1/ant-1.8.1.pom
[windows-jdk9] [INFO] Downloaded: https://repo.maven.apache.org/maven2/org/apache/ant/ant/1.8.1/ant-1.8.1.pom
(8.8 kB at 1.1 MB/s)
[windows-jdk9] [INFO] Downloading: https://repo.maven.apache.org/maven2/org/apache/ant/ant-parent/1.8.1/ant-parent-1.8.1.pom
[windows-jdk9] [INFO] Downloaded: https://repo.maven.apache.org/maven2/org/apache/ant/ant-parent/1.8.1/ant-parent-1.8.1.pom
(4.3 kB at 714 kB/s)
[windows-jdk9] [INFO] Downloading: https://repo.maven.apache.org/maven2/org/apache/maven/shared/maven-artifact-transfer/0.9.1/maven-artifact-transfer-0.9.1.pom
[windows-jdk9] [INFO] Downloaded: https://repo.maven.apache.org/maven2/org/apache/maven/shared/maven-artifact-transfer/0.9.1/maven-artifact-transfer-0.9.1.pom
(7.6 kB at 1.3 MB/s)
[windows-jdk9] [INFO] Downloading: https://repo.maven.apache.org/maven2/org/apache/maven/shared/maven-common-artifact-filters/3.0.1/maven-common-artifact-filters-3.0.1.pom
[windows-jdk9] [INFO] Downloaded: https://repo.maven.apache.org/maven2/org/apache/maven/shared/maven-common-artifact-filters/3.0.1/maven-common-artifact-filters-3.0.1.pom
(4.8 kB at 967 kB/s)
[windows-jdk9] [INFO] Downloading: https://repo.maven.apache.org/maven2/commons-codec/commons-codec/1.6/commons-codec-1.6.pom
[windows-jdk9] [INFO] Downloaded: https://repo.maven.apache.org/maven2/commons-codec/commons-codec/1.6/commons-codec-1.6.pom
(11 kB at 1.6 MB/s)
[windows-jdk9] [INFO] Downloading: https://repo.maven.apache.org/maven2/org/apache/commons/commons-parent/22/commons-parent-22.pom
[windows-jdk9] [INFO] Downloaded: https://repo.maven.apache.org/maven2/org/apache/commons/commons-parent/22/commons-parent-22.pom
(42 kB at 6.0 MB/s)
[windows-jdk9] [INFO] Downloading: https://repo.maven.apache.org/maven2/org/slf4j/slf4j-api/1.7.5/slf4j-api-1.7.5.pom
[windows-jdk9] [INFO] Downloaded: https://repo.maven.apache.org/maven2/org/slf4j/slf4j-api/1.7.5/slf4j-api-1.7.5.pom
(2.7 kB at 538 kB/s)
[windows-jdk9] [INFO] Downloading: https://repo.maven.apache.org/maven2/org/slf4j/slf4j-parent/1.7.5/slf4j-parent-1.7.5.pom
[windows-jdk9] [INFO] Downloaded: https://repo.maven.apache.org/maven2/org/slf4j/slf4j-parent/1.7.5/slf4j-parent-1.7.5.pom
(12 kB at 1.7 MB/s)
[windows-jdk9] [INFO] Downloading: https://repo.maven.apache.org/maven2/org/apache/maven/doxia/doxia-sink-api/1.7/doxia-sink-api-1.7.pom
[windows-jdk9] [INFO] Downloaded: https://repo.maven.apache.org/maven2/org/apache/maven/doxia/doxia-sink-api/1.7/doxia-sink-api-1.7.pom
(1.5 kB at 219 kB/s)
[windows-jdk9] [INFO] Downloading: https://repo.maven.apache.org/maven2/org/apache/maven/doxia/doxia/1.7/doxia-1.7.pom
[windows-jdk9] [INFO] Downloaded: https://repo.maven.apache.org/maven2/org/apache/maven/doxia/doxia/1.7/doxia-1.7.pom
(15 kB at 2.2 MB/s)
[windows-jdk9] [INFO] Downloading: https://repo.maven.apache.org/maven2/org/apache/maven/doxia/doxia-logging-api/1.7/doxia-logging-api-1.7.pom
[windows-jdk9] [INFO] Downloaded: https://repo.maven.apache.org/maven2/org/apache/maven/doxia/doxia-logging-api/1.7/doxia-logging-api-1.7.pom
(1.5 kB at 219 kB/s)
[windows-jdk9] [INFO] Downloading: https://repo.maven.apache.org/maven2/org/apache/maven/doxia/doxia-site-renderer/1.7.4/doxia-site-renderer-1.7.4.pom
[windows-jdk9] [INFO] Downloaded: https://repo.maven.apache.org/maven2/org/apache/maven/doxia/doxia-site-renderer/1.7.4/doxia-site-renderer-1.7.4.pom
(6.7 kB at 1.1 MB/s)
[windows-jdk9] [INFO] Downloading: https://repo.maven.apache.org/maven2/org/apache/maven/doxia/doxia-sitetools/1.7.4/doxia-sitetools-1.7.4.pom
[windows-jdk9] [INFO] Downloaded: https://repo.maven.apache.org/maven2/org/apache/maven/doxia/doxia-sitetools/1.7.4/doxia-sitetools-1.7.4.pom
(14 kB at 2.4 MB/s)
[windows-jdk9] [INFO] Downloading: https://repo.maven.apache.org/maven2/org/apache/maven/doxia/doxia-core/1.7/doxia-core-1.7.pom
[windows-jdk9] [INFO] Downloaded: https://repo.maven.apache.org/maven2/org/apache/maven/doxia/doxia-core/1.7/doxia-core-1.7.pom
(4.1 kB at 580 kB/s)
[windows-jdk9] [INFO] Downloading: https://repo.maven.apache.org/maven2/org/apache/maven/doxia/doxia-decoration-model/1.7.4/doxia-decoration-model-1.7.4.pom
[windows-jdk9] [INFO] Downloaded: https://repo.maven.apache.org/maven2/org/apache/maven/doxia/doxia-decoration-model/1.7.4/doxia-decoration-model-1.7.4.pom
(3.4 kB at 485 kB/s)
[windows-jdk9] [INFO] Downloading: https://repo.maven.apache.org/maven2/org/apache/maven/doxia/doxia-skin-model/1.7.4/doxia-skin-model-1.7.4.pom
[windows-jdk9] [INFO] Downloaded: https://repo.maven.apache.org/maven2/org/apache/maven/doxia/doxia-skin-model/1.7.4/doxia-skin-model-1.7.4.pom
(3.0 kB at 432 kB/s)
[windows-jdk9] [INFO] Downloading: https://repo.maven.apache.org/maven2/org/apache/maven/doxia/doxia-module-xhtml/1.7/doxia-module-xhtml-1.7.pom
[windows-jdk9] [INFO] Downloaded: https://repo.maven.apache.org/maven2/org/apache/maven/doxia/doxia-module-xhtml/1.7/doxia-module-xhtml-1.7.pom
(1.6 kB at 272 kB/s)
[windows-jdk9] [INFO] Downloading: https://repo.maven.apache.org/maven2/org/apache/maven/doxia/doxia-modules/1.7/doxia-modules-1.7.pom
[windows-jdk9] [INFO] Downloaded: https://repo.maven.apache.org/maven2/org/apache/maven/doxia/doxia-modules/1.7/doxia-modules-1.7.pom
(2.6 kB at 375 kB/s)
[windows-jdk9] [INFO] Downloading: https://repo.maven.apache.org/maven2/org/codehaus/groovy/groovy-all/2.4.8/groovy-all-2.4.8.pom
[windows-jdk9] [INFO] Downloaded: https://repo.maven.apache.org/maven2/org/codehaus/groovy/groovy-all/2.4.8/groovy-all-2.4.8.pom
(21 kB at 2.7 MB/s)
[windows-jdk9] [INFO] Downloading: https://repo.maven.apache.org/maven2/org/codehaus/plexus/plexus-interpolation/1.24/plexus-interpolation-1.24.pom
[windows-jdk9] [INFO] Downloaded: https://repo.maven.apache.org/maven2/org/codehaus/plexus/plexus-interpolation/1.24/plexus-interpolation-1.24.pom
(2.6 kB at 328 kB/s)
[windows-jdk9] [INFO] Downloading: https://repo.maven.apache.org/maven2/org/apache/maven/shared/maven-invoker/3.0.0/maven-invoker-3.0.0.jar
[windows-jdk9] [INFO] Downloading: https://repo.maven.apache.org/maven2/commons-validator/commons-validator/1.4.1/commons-validator-1.4.1.jar
[windows-jdk9] [INFO] Downloading: https://repo.maven.apache.org/maven2/org/apache/maven/reporting/maven-reporting-impl/2.4/maven-reporting-impl-2.4.jar
[windows-jdk9] [INFO] Downloading: https://repo.maven.apache.org/maven2/org/apache/maven/doxia/doxia-core/1.6/doxia-core-1.6.jar
[windows-jdk9] [INFO] Downloading: https://repo.maven.apache.org/maven2/xmlunit/xmlunit/1.5/xmlunit-1.5.jar
[windows-jdk9] [INFO] Downloaded: https://repo.maven.apache.org/maven2/org/apache/maven/reporting/maven-reporting-impl/2.4/maven-reporting-impl-2.4.jar
(20 kB at 1.0 MB/s)
[windows-jdk9] [INFO] Downloading: https://repo.maven.apache.org/maven2/commons-beanutils/commons-beanutils/1.8.3/commons-beanutils-1.8.3.jar
[windows-jdk9] [INFO] Downloaded: https://repo.maven.apache.org/maven2/org/apache/maven/shared/maven-invoker/3.0.0/maven-invoker-3.0.0.jar
(33 kB at 1.6 MB/s)
[windows-jdk9] [INFO] Downloading: https://repo.maven.apache.org/maven2/commons-digester/commons-digester/1.8.1/commons-digester-1.8.1.jar
[windows-jdk9] [INFO] Downloaded: https://repo.maven.apache.org/maven2/org/apache/maven/doxia/doxia-core/1.6/doxia-core-1.6.jar
(162 kB at 8.1 MB/s)
[windows-jdk9] [INFO] Downloading: https://repo.maven.apache.org/maven2/commons-logging/commons-logging/1.2/commons-logging-1.2.jar
[windows-jdk9] [INFO] Downloaded: https://repo.maven.apache.org/maven2/xmlunit/xmlunit/1.5/xmlunit-1.5.jar
(98 kB at 4.2 MB/s)
[windows-jdk9] [INFO] Downloading: https://repo.maven.apache.org/maven2/org/apache/maven/shared/maven-script-interpreter/1.2/maven-script-interpreter-1.2.jar
[windows-jdk9] [INFO] Downloaded: https://repo.maven.apache.org/maven2/commons-validator/commons-validator/1.4.1/commons-validator-1.4.1.jar
(190 kB at 5.9 MB/s)
[windows-jdk9] [INFO] Downloading: https://repo.maven.apache.org/maven2/org/apache/ant/ant/1.8.1/ant-1.8.1.jar
[windows-jdk9] [INFO] Downloaded: https://repo.maven.apache.org/maven2/commons-logging/commons-logging/1.2/commons-logging-1.2.jar
(62 kB at 1.9 MB/s)
[windows-jdk9] [INFO] Downloading: https://repo.maven.apache.org/maven2/org/apache/maven/shared/maven-artifact-transfer/0.9.1/maven-artifact-transfer-0.9.1.jar
[windows-jdk9] [INFO] Downloaded: https://repo.maven.apache.org/maven2/commons-beanutils/commons-beanutils/1.8.3/commons-beanutils-1.8.3.jar
(232 kB at 6.6 MB/s)
[windows-jdk9] [INFO] Downloading: https://repo.maven.apache.org/maven2/org/apache/maven/shared/maven-common-artifact-filters/3.0.1/maven-common-artifact-filters-3.0.1.jar
[windows-jdk9] [INFO] Downloaded: https://repo.maven.apache.org/maven2/commons-digester/commons-digester/1.8.1/commons-digester-1.8.1.jar
(146 kB at 4.1 MB/s)
[windows-jdk9] [INFO] Downloading: https://repo.maven.apache.org/maven2/commons-codec/commons-codec/1.6/commons-codec-1.6.jar
[windows-jdk9] [INFO] Downloaded: https://repo.maven.apache.org/maven2/org/apache/maven/shared/maven-common-artifact-filters/3.0.1/maven-common-artifact-filters-3.0.1.jar
(61 kB at 1.3 MB/s)
[windows-jdk9] [INFO] Downloading: https://repo.maven.apache.org/maven2/org/slf4j/slf4j-api/1.7.5/slf4j-api-1.7.5.jar
[windows-jdk9] [INFO] Downloaded: https://repo.maven.apache.org/maven2/org/apache/maven/shared/maven-artifact-transfer/0.9.1/maven-artifact-transfer-0.9.1.jar
(123 kB at 2.2 MB/s)
[windows-jdk9] [INFO] Downloading: https://repo.maven.apache.org/maven2/org/apache/maven/doxia/doxia-sink-api/1.7/doxia-sink-api-1.7.jar
[windows-jdk9] [INFO] Downloaded: https://repo.maven.apache.org/maven2/org/apache/maven/shared/maven-script-interpreter/1.2/maven-script-interpreter-1.2.jar
(22 kB at 394 kB/s)
[windows-jdk9] [INFO] Downloading: https://repo.maven.apache.org/maven2/org/apache/maven/doxia/doxia-logging-api/1.7/doxia-logging-api-1.7.jar
[windows-jdk9] [INFO] Downloaded: https://repo.maven.apache.org/maven2/commons-codec/commons-codec/1.6/commons-codec-1.6.jar
(233 kB at 3.9 MB/s)
[windows-jdk9] [INFO] Downloading: https://repo.maven.apache.org/maven2/org/apache/maven/doxia/doxia-site-renderer/1.7.4/doxia-site-renderer-1.7.4.jar
[windows-jdk9] [INFO] Downloaded: https://repo.maven.apache.org/maven2/org/slf4j/slf4j-api/1.7.5/slf4j-api-1.7.5.jar
(26 kB at 428 kB/s)
[windows-jdk9] [INFO] Downloading: https://repo.maven.apache.org/maven2/org/apache/maven/doxia/doxia-decoration-model/1.7.4/doxia-decoration-model-1.7.4.jar
[windows-jdk9] [INFO] Downloaded: https://repo.maven.apache.org/maven2/org/apache/maven/doxia/doxia-sink-api/1.7/doxia-sink-api-1.7.jar
(11 kB at 181 kB/s)
[windows-jdk9] [INFO] Downloading: https://repo.maven.apache.org/maven2/org/apache/maven/doxia/doxia-skin-model/1.7.4/doxia-skin-model-1.7.4.jar
[windows-jdk9] [INFO] Downloaded: https://repo.maven.apache.org/maven2/org/apache/maven/doxia/doxia-logging-api/1.7/doxia-logging-api-1.7.jar
(12 kB at 178 kB/s)
[windows-jdk9] [INFO] Downloading: https://repo.maven.apache.org/maven2/org/apache/maven/doxia/doxia-module-xhtml/1.7/doxia-module-xhtml-1.7.jar
[windows-jdk9] [INFO] Downloaded: https://repo.maven.apache.org/maven2/org/apache/maven/doxia/doxia-site-renderer/1.7.4/doxia-site-renderer-1.7.4.jar
(64 kB at 913 kB/s)
[windows-jdk9] [INFO] Downloading: https://repo.maven.apache.org/maven2/org/codehaus/groovy/groovy-all/2.4.8/groovy-all-2.4.8.jar
[windows-jdk9] [INFO] Downloaded: https://repo.maven.apache.org/maven2/org/apache/maven/doxia/doxia-skin-model/1.7.4/doxia-skin-model-1.7.4.jar
(16 kB at 222 kB/s)
[windows-jdk9] [INFO] Downloading: https://repo.maven.apache.org/maven2/org/codehaus/plexus/plexus-interpolation/1.24/plexus-interpolation-1.24.jar
[windows-jdk9] [INFO] Downloaded: https://repo.maven.apache.org/maven2/org/apache/maven/doxia/doxia-decoration-model/1.7.4/doxia-decoration-model-1.7.4.jar
(61 kB at 798 kB/s)
[windows-jdk9] [INFO] Downloaded: https://repo.maven.apache.org/maven2/org/apache/ant/ant/1.8.1/ant-1.8.1.jar
(1.5 MB at 18 MB/s)
[windows-jdk9] [INFO] Downloaded: https://repo.maven.apache.org/maven2/org/codehaus/plexus/plexus-interpolation/1.24/plexus-interpolation-1.24.jar
(79 kB at 896 kB/s)
[windows-jdk9] [INFO] Downloaded: https://repo.maven.apache.org/maven2/org/apache/maven/doxia/doxia-module-xhtml/1.7/doxia-module-xhtml-1.7.jar
(17 kB at 198 kB/s)
[windows-jdk9] [INFO] Downloaded: https://repo.maven.apache.org/maven2/org/codehaus/groovy/groovy-all/2.4.8/groovy-all-2.4.8.jar
(7.0 MB at 30 MB/s)
[windows-jdk9] Sending interrupt signal to process
[windows-jdk10] [INFO] 
[windows-jdk10] [INFO] --- maven-compiler-plugin:3.5.1:compile (default-compile) @ maven-plugin-tools-generators
---
[windows-jdk10] [INFO] Changes detected - recompiling the module!
[windows-jdk10] [INFO] Compiling 6 source files to F:\jenkins\jenkins-slave\workspace\en-plugin-tools_MPLUGIN-334-P26KBAHNKAAPSTVERO3RZWBXBQ643VCLPA5ONYKYHESNMZYUQRCA\m\maven-plugin-tools-generators\target\classes
[windows-jdk10] [INFO] /F:/jenkins/jenkins-slave/workspace/en-plugin-tools_MPLUGIN-334-P26KBAHNKAAPSTVERO3RZWBXBQ643VCLPA5ONYKYHESNMZYUQRCA/m/maven-plugin-tools-generators/src/main/java/org/apache/maven/tools/plugin/generator/PluginHelpGenerator.java:
Some input files use or override a deprecated API.
[windows-jdk10] [INFO] /F:/jenkins/jenkins-slave/workspace/en-plugin-tools_MPLUGIN-334-P26KBAHNKAAPSTVERO3RZWBXBQ643VCLPA5ONYKYHESNMZYUQRCA/m/maven-plugin-tools-generators/src/main/java/org/apache/maven/tools/plugin/generator/PluginHelpGenerator.java:
Recompile with -Xlint:deprecation for details.
[windows-jdk10] [INFO] 
[windows-jdk10] [INFO] --- maven-resources-plugin:2.7:testResources (default-testResources)
@ maven-plugin-tools-generators ---
[windows-jdk10] [INFO] Using 'UTF-8' encoding to copy filtered resources.
[windows-jdk10] [INFO] skip non existing resourceDirectory F:\jenkins\jenkins-slave\workspace\en-plugin-tools_MPLUGIN-334-P26KBAHNKAAPSTVERO3RZWBXBQ643VCLPA5ONYKYHESNMZYUQRCA\m\maven-plugin-tools-generators\src\test\resources
[windows-jdk10] [INFO] Copying 3 resources
[windows-jdk10] [INFO] 
[windows-jdk10] [INFO] --- maven-compiler-plugin:3.5.1:testCompile (default-testCompile) @
maven-plugin-tools-generators ---
[windows-jdk10] [INFO] Changes detected - recompiling the module!
[windows-jdk10] [INFO] Compiling 6 source files to F:\jenkins\jenkins-slave\workspace\en-plugin-tools_MPLUGIN-334-P26KBAHNKAAPSTVERO3RZWBXBQ643VCLPA5ONYKYHESNMZYUQRCA\m\maven-plugin-tools-generators\target\test-classes
[windows-jdk9] [INFO] Installing f:\jenkins\jenkins-slave\workspace\en-plugin-tools_MPLUGIN-334-P26KBAHNKAAPSTVERO3RZWBXBQ643VCLPA5ONYKYHESNMZYUQRCA\m\pom.xml
to F:\jenkins\jenkins-slave\workspace\en-plugin-tools_MPLUGIN-334-P26KBAHNKAAPSTVERO3RZWBXBQ643VCLPA5ONYKYHESNMZYUQRCA\m\maven-plugin-tools-javadoc\target\local-repo\org\apache\maven\plugin-tools\maven-plugin-tools\3.5.2-SNAPSHOT\maven-plugin-tools-3.5.2-SNAPSHOT.pom
[windows-jdk9] [INFO] Installing f:\jenkins\jenkins-slave\workspace\en-plugin-tools_MPLUGIN-334-P26KBAHNKAAPSTVERO3RZWBXBQ643VCLPA5ONYKYHESNMZYUQRCA\m\target\maven-plugin-tools-3.5.2-SNAPSHOT-site.xml
to F:\jenkins\jenkins-slave\workspace\en-plugin-tools_MPLUGIN-334-P26KBAHNKAAPSTVERO3RZWBXBQ643VCLPA5ONYKYHESNMZYUQRCA\m\maven-plugin-tools-javadoc\target\local-repo\org\apache\maven\plugin-tools\maven-plugin-tools\3.5.2-SNAPSHOT\maven-plugin-tools-3.5.2-SNAPSHOT-site.xml
[windows-jdk9] [INFO] Installing F:\jenkins\jenkins-slave\workspace\en-plugin-tools_MPLUGIN-334-P26KBAHNKAAPSTVERO3RZWBXBQ643VCLPA5ONYKYHESNMZYUQRCA\m\maven-plugin-tools-api\pom.xml
to F:\jenkins\jenkins-slave\workspace\en-plugin-tools_MPLUGIN-334-P26KBAHNKAAPSTVERO3RZWBXBQ643VCLPA5ONYKYHESNMZYUQRCA\m\maven-plugin-tools-javadoc\target\local-repo\org\apache\maven\plugin-tools\maven-plugin-tools-api\3.5.2-SNAPSHOT\maven-plugin-tools-api-3.5.2-SNAPSHOT.pom
[windows-jdk9] [INFO] Installing F:\jenkins\jenkins-slave\workspace\en-plugin-tools_MPLUGIN-334-P26KBAHNKAAPSTVERO3RZWBXBQ643VCLPA5ONYKYHESNMZYUQRCA\m\maven-plugin-tools-api\target\maven-plugin-tools-api-3.5.2-SNAPSHOT.jar
to F:\jenkins\jenkins-slave\workspace\en-plugin-tools_MPLUGIN-334-P26KBAHNKAAPSTVERO3RZWBXBQ643VCLPA5ONYKYHESNMZYUQRCA\m\maven-plugin-tools-javadoc\target\local-repo\org\apache\maven\plugin-tools\maven-plugin-tools-api\3.5.2-SNAPSHOT\maven-plugin-tools-api-3.5.2-SNAPSHOT.jar
[windows-jdk9] [INFO] Installing F:\jenkins\jenkins-slave\workspace\en-plugin-tools_MPLUGIN-334-P26KBAHNKAAPSTVERO3RZWBXBQ643VCLPA5ONYKYHESNMZYUQRCA\m\maven-plugin-tools-generators\pom.xml
to F:\jenkins\jenkins-slave\workspace\en-plugin-tools_MPLUGIN-334-P26KBAHNKAAPSTVERO3RZWBXBQ643VCLPA5ONYKYHESNMZYUQRCA\m\maven-plugin-tools-javadoc\target\local-repo\org\apache\maven\plugin-tools\maven-plugin-tools-generators\3.5.2-SNAPSHOT\maven-plugin-tools-generators-3.5.2-SNAPSHOT.pom
[windows-jdk9] [INFO] Installing F:\jenkins\jenkins-slave\workspace\en-plugin-tools_MPLUGIN-334-P26KBAHNKAAPSTVERO3RZWBXBQ643VCLPA5ONYKYHESNMZYUQRCA\m\maven-plugin-tools-generators\target\maven-plugin-tools-generators-3.5.2-SNAPSHOT.jar
to F:\jenkins\jenkins-slave\workspace\en-plugin-tools_MPLUGIN-334-P26KBAHNKAAPSTVERO3RZWBXBQ643VCLPA5ONYKYHESNMZYUQRCA\m\maven-plugin-tools-javadoc\target\local-repo\org\apache\maven\plugin-tools\maven-plugin-tools-generators\3.5.2-SNAPSHOT\maven-plugin-tools-generators-3.5.2-SNAPSHOT.jar
[windows-jdk9] [INFO] Installing F:\jenkins\jenkins-slave\workspace\en-plugin-tools_MPLUGIN-334-P26KBAHNKAAPSTVERO3RZWBXBQ643VCLPA5ONYKYHESNMZYUQRCA\m\maven-plugin-tools-java\pom.xml
to F:\jenkins\jenkins-slave\workspace\en-plugin-tools_MPLUGIN-334-P26KBAHNKAAPSTVERO3RZWBXBQ643VCLPA5ONYKYHESNMZYUQRCA\m\maven-plugin-tools-javadoc\target\local-repo\org\apache\maven\plugin-tools\maven-plugin-tools-java\3.5.2-SNAPSHOT\maven-plugin-tools-java-3.5.2-SNAPSHOT.pom
[windows-jdk9] [INFO] Installing F:\jenkins\jenkins-slave\workspace\en-plugin-tools_MPLUGIN-334-P26KBAHNKAAPSTVERO3RZWBXBQ643VCLPA5ONYKYHESNMZYUQRCA\m\maven-plugin-tools-java\target\maven-plugin-tools-java-3.5.2-SNAPSHOT.jar
to F:\jenkins\jenkins-slave\workspace\en-plugin-tools_MPLUGIN-334-P26KBAHNKAAPSTVERO3RZWBXBQ643VCLPA5ONYKYHESNMZYUQRCA\m\maven-plugin-tools-javadoc\target\local-repo\org\apache\maven\plugin-tools\maven-plugin-tools-java\3.5.2-SNAPSHOT\maven-plugin-tools-java-3.5.2-SNAPSHOT.jar
[windows-jdk9] [INFO] Installing F:\jenkins\jenkins-slave\workspace\en-plugin-tools_MPLUGIN-334-P26KBAHNKAAPSTVERO3RZWBXBQ643VCLPA5ONYKYHESNMZYUQRCA\m\maven-plugin-annotations\pom.xml
to F:\jenkins\jenkins-slave\workspace\en-plugin-tools_MPLUGIN-334-P26KBAHNKAAPSTVERO3RZWBXBQ643VCLPA5ONYKYHESNMZYUQRCA\m\maven-plugin-tools-javadoc\target\local-repo\org\apache\maven\plugin-tools\maven-plugin-annotations\3.5.2-SNAPSHOT\maven-plugin-annotations-3.5.2-SNAPSHOT.pom
[windows-jdk9] [INFO] Installing F:\jenkins\jenkins-slave\workspace\en-plugin-tools_MPLUGIN-334-P26KBAHNKAAPSTVERO3RZWBXBQ643VCLPA5ONYKYHESNMZYUQRCA\m\maven-plugin-annotations\target\maven-plugin-annotations-3.5.2-SNAPSHOT.jar
to F:\jenkins\jenkins-slave\workspace\en-plugin-tools_MPLUGIN-334-P26KBAHNKAAPSTVERO3RZWBXBQ643VCLPA5ONYKYHESNMZYUQRCA\m\maven-plugin-tools-javadoc\target\local-repo\org\apache\maven\plugin-tools\maven-plugin-annotations\3.5.2-SNAPSHOT\maven-plugin-annotations-3.5.2-SNAPSHOT.jar
[windows-jdk9] [INFO] Installing F:\jenkins\jenkins-slave\workspace\en-plugin-tools_MPLUGIN-334-P26KBAHNKAAPSTVERO3RZWBXBQ643VCLPA5ONYKYHESNMZYUQRCA\m\maven-plugin-tools-annotations\pom.xml
to F:\jenkins\jenkins-slave\workspace\en-plugin-tools_MPLUGIN-334-P26KBAHNKAAPSTVERO3RZWBXBQ643VCLPA5ONYKYHESNMZYUQRCA\m\maven-plugin-tools-javadoc\target\local-repo\org\apache\maven\plugin-tools\maven-plugin-tools-annotations\3.5.2-SNAPSHOT\maven-plugin-tools-annotations-3.5.2-SNAPSHOT.pom
[windows-jdk9] [INFO] Installing F:\jenkins\jenkins-slave\workspace\en-plugin-tools_MPLUGIN-334-P26KBAHNKAAPSTVERO3RZWBXBQ643VCLPA5ONYKYHESNMZYUQRCA\m\maven-plugin-tools-annotations\target\maven-plugin-tools-annotations-3.5.2-SNAPSHOT.jar
to F:\jenkins\jenkins-slave\workspace\en-plugin-tools_MPLUGIN-334-P26KBAHNKAAPSTVERO3RZWBXBQ643VCLPA5ONYKYHESNMZYUQRCA\m\maven-plugin-tools-javadoc\target\local-repo\org\apache\maven\plugin-tools\maven-plugin-tools-annotations\3.5.2-SNAPSHOT\maven-plugin-tools-annotations-3.5.2-SNAPSHOT.jar
[windows-jdk9] [INFO] Installing F:\jenkins\jenkins-slave\workspace\en-plugin-tools_MPLUGIN-334-P26KBAHNKAAPSTVERO3RZWBXBQ643VCLPA5ONYKYHESNMZYUQRCA\m\maven-plugin-tools-annotations\target\maven-plugin-tools-annotations-3.5.2-SNAPSHOT-tests.jar
to F:\jenkins\jenkins-slave\workspace\en-plugin-tools_MPLUGIN-334-P26KBAHNKAAPSTVERO3RZWBXBQ643VCLPA5ONYKYHESNMZYUQRCA\m\maven-plugin-tools-javadoc\target\local-repo\org\apache\maven\plugin-tools\maven-plugin-tools-annotations\3.5.2-SNAPSHOT\maven-plugin-tools-annotations-3.5.2-SNAPSHOT-tests.jar
[windows-jdk9] [INFO] Installing F:\jenkins\jenkins-slave\workspace\en-plugin-tools_MPLUGIN-334-P26KBAHNKAAPSTVERO3RZWBXBQ643VCLPA5ONYKYHESNMZYUQRCA\m\maven-plugin-tools-annotations\target\maven-plugin-tools-annotations-3.5.2-SNAPSHOT-test-sources.jar
to F:\jenkins\jenkins-slave\workspace\en-plugin-tools_MPLUGIN-334-P26KBAHNKAAPSTVERO3RZWBXBQ643VCLPA5ONYKYHESNMZYUQRCA\m\maven-plugin-tools-javadoc\target\local-repo\org\apache\maven\plugin-tools\maven-plugin-tools-annotations\3.5.2-SNAPSHOT\maven-plugin-tools-annotations-3.5.2-SNAPSHOT-test-sources.jar
[windows-jdk9] [INFO] Installing F:\jenkins\jenkins-slave\workspace\en-plugin-tools_MPLUGIN-334-P26KBAHNKAAPSTVERO3RZWBXBQ643VCLPA5ONYKYHESNMZYUQRCA\m\maven-plugin-tools-javadoc\pom.xml
to F:\jenkins\jenkins-slave\workspace\en-plugin-tools_MPLUGIN-334-P26KBAHNKAAPSTVERO3RZWBXBQ643VCLPA5ONYKYHESNMZYUQRCA\m\maven-plugin-tools-javadoc\target\local-repo\org\apache\maven\plugin-tools\maven-plugin-tools-javadoc\3.5.2-SNAPSHOT\maven-plugin-tools-javadoc-3.5.2-SNAPSHOT.pom
[windows-jdk9] [INFO] Installing F:\jenkins\jenkins-slave\workspace\en-plugin-tools_MPLUGIN-334-P26KBAHNKAAPSTVERO3RZWBXBQ643VCLPA5ONYKYHESNMZYUQRCA\m\maven-plugin-tools-javadoc\target\maven-plugin-tools-javadoc-3.5.2-SNAPSHOT.jar
to F:\jenkins\jenkins-slave\workspace\en-plugin-tools_MPLUGIN-334-P26KBAHNKAAPSTVERO3RZWBXBQ643VCLPA5ONYKYHESNMZYUQRCA\m\maven-plugin-tools-javadoc\target\local-repo\org\apache\maven\plugin-tools\maven-plugin-tools-javadoc\3.5.2-SNAPSHOT\maven-plugin-tools-javadoc-3.5.2-SNAPSHOT.jar
[windows-jdk9] [INFO] 
[windows-jdk9] [INFO] --- maven-invoker-plugin:3.0.1:run (integration-test) @ maven-plugin-tools-javadoc
---
[windows-jdk9] [INFO] Running Setup Jobs
[windows-jdk9] [INFO] Building: basic\pom.xml
[windows-jdk10] Sending interrupt signal to process
[windows-jdk10] [INFO] /F:/jenkins/jenkins-slave/workspace/en-plugin-tools_MPLUGIN-334-P26KBAHNKAAPSTVERO3RZWBXBQ643VCLPA5ONYKYHESNMZYUQRCA/m/maven-plugin-tools-generators/src/test/java/org/apache/maven/tools/plugin/generator/AbstractGeneratorTestCase.java:
F:\jenkins\jenkins-slave\workspace\en-plugin-tools_MPLUGIN-334-P26KBAHNKAAPSTVERO3RZWBXBQ643VCLPA5ONYKYHESNMZYUQRCA\m\maven-plugin-tools-generators\src\test\java\org\apache\maven\tools\plugin\generator\AbstractGeneratorTestCase.java
uses or overrides a deprecated API.
[windows-jdk10] [INFO] /F:/jenkins/jenkins-slave/workspace/en-plugin-tools_MPLUGIN-334-P26KBAHNKAAPSTVERO3RZWBXBQ643VCLPA5ONYKYHESNMZYUQRCA/m/maven-plugin-tools-generators/src/test/java/org/apache/maven/tools/plugin/generator/AbstractGeneratorTestCase.java:
Recompile with -Xlint:deprecation for details.
[windows-jdk10] [INFO] 
[windows-jdk10] [INFO] --- maven-surefire-plugin:2.21.0:test (default-test) @ maven-plugin-tools-generators
---
[windows-jdk10] [INFO] 
[windows-jdk10] [INFO] -------------------------------------------------------
[windows-jdk10] [INFO]  T E S T S
[windows-jdk10] [INFO] -------------------------------------------------------
[windows-jdk10] [INFO] Running org.apache.maven.tools.plugin.generator.GeneratorUtilsTest
[Pipeline] [windows-jdk9] }
[Pipeline] [linux-jdk9] }
[Pipeline] [windows-jdk7] }
[Pipeline] [linux-jdk7] }
[Pipeline] [linux-jdk8] }
[Pipeline] [windows-jdk10] }
[Pipeline] [windows-jdk9] // dir
[Pipeline] [linux-jdk9] // dir
[Pipeline] [windows-jdk7] // dir
[Pipeline] [linux-jdk7] // dir
[Pipeline] [linux-jdk8] // dir
[Pipeline] [windows-jdk10] // dir
[Pipeline] [windows-jdk9] }
[windows-jdk9] [withMaven] One or multiple Maven executions have been ignored by the Jenkins
Pipeline Maven Plugin because they have been interrupted before completion (1). See Pipeline
Maven Plugin FAQ for more details.
[Pipeline] [linux-jdk9] }
[linux-jdk9] [withMaven] One or multiple Maven executions have been ignored by the Jenkins
Pipeline Maven Plugin because they have been interrupted before completion (1). See Pipeline
Maven Plugin FAQ for more details.
[Pipeline] [windows-jdk7] }
[windows-jdk7] [withMaven] One or multiple Maven executions have been ignored by the Jenkins
Pipeline Maven Plugin because they have been interrupted before completion (1). See Pipeline
Maven Plugin FAQ for more details.
[Pipeline] [linux-jdk7] }
[linux-jdk7] [withMaven] One or multiple Maven executions have been ignored by the Jenkins
Pipeline Maven Plugin because they have been interrupted before completion (1). See Pipeline
Maven Plugin FAQ for more details.
[Pipeline] [linux-jdk8] }
[linux-jdk8] [withMaven] One or multiple Maven executions have been ignored by the Jenkins
Pipeline Maven Plugin because they have been interrupted before completion (1). See Pipeline
Maven Plugin FAQ for more details.
[Pipeline] [windows-jdk10] }
[windows-jdk10] [withMaven] One or multiple Maven executions have been ignored by the Jenkins
Pipeline Maven Plugin because they have been interrupted before completion (1). See Pipeline
Maven Plugin FAQ for more details.
[Pipeline] [windows-jdk9] // withMaven
[Pipeline] [linux-jdk9] // withMaven
[Pipeline] [windows-jdk7] // withMaven
[Pipeline] [linux-jdk7] // withMaven
[Pipeline] [linux-jdk8] // withMaven
[Pipeline] [windows-jdk10] // withMaven
[Pipeline] [windows-jdk9] echo
[windows-jdk9] [FAIL FAST] linux-jdk10 had first failure, ignoring script returned exit code
-1
[Pipeline] [windows-jdk9] }
[Pipeline] [linux-jdk9] echo
[linux-jdk9] [FAIL FAST] linux-jdk10 had first failure, ignoring script returned exit code
143
[Pipeline] [linux-jdk9] }
[Pipeline] [windows-jdk7] echo
[windows-jdk7] [FAIL FAST] linux-jdk10 had first failure, ignoring script returned exit code
-1
[Pipeline] [windows-jdk7] }
[Pipeline] [linux-jdk7] echo
[linux-jdk7] [FAIL FAST] linux-jdk10 had first failure, ignoring script returned exit code
143
[Pipeline] [linux-jdk7] }
[Pipeline] [linux-jdk8] echo
[linux-jdk8] [FAIL FAST] linux-jdk10 had first failure, ignoring script returned exit code
143
[Pipeline] [linux-jdk8] }
[Pipeline] [windows-jdk10] }
[Pipeline] [windows-jdk9] // stage
[Pipeline] [linux-jdk9] // stage
[Pipeline] [windows-jdk7] // stage
[Pipeline] [linux-jdk7] // stage
[Pipeline] [linux-jdk8] // stage
[Pipeline] [windows-jdk10] // stage
[Pipeline] [linux-jdk7] }
[Pipeline] [linux-jdk8] }
[Pipeline] [linux-jdk9] }
[Pipeline] [windows-jdk7] }
[Pipeline] [windows-jdk9] }
[Pipeline] [windows-jdk10] }
[Pipeline] [linux-jdk7] // node
[Pipeline] [linux-jdk8] // node
[Pipeline] [linux-jdk9] // node
[Pipeline] [windows-jdk7] // node
[Pipeline] [windows-jdk9] // node
[Pipeline] [windows-jdk10] // node
[Pipeline] [linux-jdk7] }
[Pipeline] [linux-jdk8] }
[Pipeline] [linux-jdk9] }
[Pipeline] [windows-jdk7] }
[Pipeline] [windows-jdk9] }
[Pipeline] [windows-jdk10] }
[windows-jdk8] After 10s process did not stop
[Pipeline] [windows-jdk8] }
[Pipeline] [windows-jdk8] // dir
[Pipeline] [windows-jdk8] }
[windows-jdk8] [withMaven] One or multiple Maven executions have been ignored by the Jenkins
Pipeline Maven Plugin because they have been interrupted before completion (1). See Pipeline
Maven Plugin FAQ for more details.
[Pipeline] [windows-jdk8] // withMaven
[Pipeline] [windows-jdk8] echo
[windows-jdk8] [FAIL FAST] linux-jdk10 had first failure, ignoring null
[Pipeline] [windows-jdk8] }
[Pipeline] [windows-jdk8] // stage
[Pipeline] [windows-jdk8] }
[Pipeline] [windows-jdk8] // node
[Pipeline] [windows-jdk8] }
[Pipeline] // parallel
[Pipeline] echo
***** FAST FAILURE *****

Fast failure triggered by linux-jdk10

***** FAST FAILURE *****
[Pipeline] stage
[Pipeline] { (Notifications)
[Pipeline] echo
Build result: FAILURE
[Pipeline] jiraIssueSelector
[Pipeline] emailext
Mime
  • Unnamed multipart/mixed (inline, None, 0 bytes)
View raw message