maven-notifications mailing list archives

Site index · List index
Message view « Date » · « Thread »
Top « Date » · « Thread »
From Apache Jenkins Server <jenk...@builds.apache.org>
Subject Build failed in Jenkins: Maven TLP » maven-doxia-site » master #2
Date Fri, 11 May 2018 14:38:34 GMT
See https://builds.apache.org/job/maven-box/job/maven-doxia-site/job/master/2/

No changes.

No tests ran.

Build log:
Started by user hboutemy
Obtained Jenkinsfile from 7b7bc85e76dc199af2282a00c9eac3ed7dafb183
Running in Durability level: MAX_SURVIVABILITY
Loading library jenkins-env@master
Attempting to resolve master from remote references...
 > git --version # timeout=10
 > git ls-remote -h -t https://gitbox.apache.org/repos/asf/maven-jenkins-env.git # timeout=10
Found match: refs/heads/master revision 005a4ef5e07c06395b8f1eaf1aedd68b97aa8446
 > git rev-parse --is-inside-work-tree # timeout=10
Fetching changes from the remote Git repository
 > git config remote.origin.url https://gitbox.apache.org/repos/asf/maven-jenkins-env.git
# timeout=10
Fetching without tags
Fetching upstream changes from https://gitbox.apache.org/repos/asf/maven-jenkins-env.git
 > git --version # timeout=10
 > git fetch --no-tags --progress https://gitbox.apache.org/repos/asf/maven-jenkins-env.git
+refs/heads/*:refs/remotes/origin/*
Checking out Revision 005a4ef5e07c06395b8f1eaf1aedd68b97aa8446 (master)
 > git config core.sparsecheckout # timeout=10
 > git checkout -f 005a4ef5e07c06395b8f1eaf1aedd68b97aa8446
Commit message: "Add Java 11-ea"
 > git rev-list --no-walk 005a4ef5e07c06395b8f1eaf1aedd68b97aa8446 # timeout=10
Loading library jenkins-lib@master
Attempting to resolve master from remote references...
 > git --version # timeout=10
 > git ls-remote -h -t https://gitbox.apache.org/repos/asf/maven-jenkins-lib.git # timeout=10
Found match: refs/heads/master revision c82ebd99d2082dec7dbb571527a5e75cc1ceb8ca
 > git rev-parse --is-inside-work-tree # timeout=10
Fetching changes from the remote Git repository
 > git config remote.origin.url https://gitbox.apache.org/repos/asf/maven-jenkins-lib.git
# timeout=10
Fetching without tags
Fetching upstream changes from https://gitbox.apache.org/repos/asf/maven-jenkins-lib.git
 > git --version # timeout=10
 > git fetch --no-tags --progress https://gitbox.apache.org/repos/asf/maven-jenkins-lib.git
+refs/heads/*:refs/remotes/origin/*
Checking out Revision c82ebd99d2082dec7dbb571527a5e75cc1ceb8ca (master)
 > git config core.sparsecheckout # timeout=10
 > git checkout -f c82ebd99d2082dec7dbb571527a5e75cc1ceb8ca
Commit message: "revert this one as well"
 > git rev-list --no-walk c82ebd99d2082dec7dbb571527a5e75cc1ceb8ca # timeout=10
[Pipeline] node
Running on websites1 in /home/jenkins/jenkins-slave/workspace/box_maven-doxia-site_master-IVLIM3FD7IHMMFNW5G7AIUYHFYH7R75A6TO3URHNGEW2DEHYMTVQ
[Pipeline] {
[Pipeline] stage
[Pipeline] { (Declarative: Checkout SCM)
[Pipeline] checkout
 > git rev-parse --is-inside-work-tree # timeout=10
Fetching changes from the remote Git repository
 > git config remote.origin.url https://gitbox.apache.org/repos/asf/maven-doxia-site.git
# timeout=10
Fetching without tags
Fetching upstream changes from https://gitbox.apache.org/repos/asf/maven-doxia-site.git
 > git --version # timeout=10
 > git fetch --no-tags --progress https://gitbox.apache.org/repos/asf/maven-doxia-site.git
+refs/heads/*:refs/remotes/origin/*
Checking out Revision 7b7bc85e76dc199af2282a00c9eac3ed7dafb183 (master)
 > git config core.sparsecheckout # timeout=10
 > git checkout -f 7b7bc85e76dc199af2282a00c9eac3ed7dafb183
Commit message: "added Jenkinsfile"
 > git rev-list --no-walk 7b7bc85e76dc199af2282a00c9eac3ed7dafb183 # timeout=10
Cleaning workspace
 > git rev-parse --verify HEAD # timeout=10
Resetting working tree
 > git reset --hard # timeout=10
 > git clean -fdx # timeout=10
[Pipeline] }
[Pipeline] // stage
[Pipeline] withEnv
[Pipeline] {
[Pipeline] timeout
Timeout set to expire in 10 min
[Pipeline] {
[Pipeline] timestamps
[Pipeline] {
[Pipeline] ansiColor
[Pipeline] {
[Pipeline] stage
[Pipeline] { (Build)
Stage 'Build' skipped due to when conditional
[Pipeline] }
[Pipeline] // stage
[Pipeline] stage
[Pipeline] { (Deploy)
[Pipeline] withMaven
[withMaven] Options: [org.jenkinsci.plugins.pipeline.maven.publishers.GeneratedArtifactsPublisher[disabled=true],
org.jenkinsci.plugins.pipeline.maven.publishers.JunitTestsPublisher[disabled=true], org.jenkinsci.plugins.pipeline.maven.publishers.FindbugsAnalysisPublisher[disabled=true],
org.jenkinsci.plugins.pipeline.maven.publishers.TasksScannerPublisher[disabled=true]]
[withMaven] Available options: 
[withMaven] using JDK installation JDK 1.8 (latest)
[withMaven] using Maven installation 'Maven 3 (latest)'
[Pipeline] {
[Pipeline] sh
[box_maven-doxia-site_master-IVLIM3FD7IHMMFNW5G7AIUYHFYH7R75A6TO3URHNGEW2DEHYMTVQ] Running
shell script
+ mvn clean site-deploy
----- withMaven Wrapper script -----
Picked up JAVA_TOOL_OPTIONS: -Dmaven.ext.class.path="/home/jenkins/jenkins-slave/workspace/box_maven-doxia-site_master-IVLIM3FD7IHMMFNW5G7AIUYHFYH7R75A6TO3URHNGEW2DEHYMTVQ@tmp/withMavendf7d7285/pipeline-maven-spy.jar"
-Dorg.jenkinsci.plugins.pipeline.maven.reportsFolder="/home/jenkins/jenkins-slave/workspace/box_maven-doxia-site_master-IVLIM3FD7IHMMFNW5G7AIUYHFYH7R75A6TO3URHNGEW2DEHYMTVQ@tmp/withMavendf7d7285"

Apache Maven 3.5.2 (138edd61fd100ec658bfa2d307c43b76940a5d7d; 2017-10-18T07:58:13Z)
Maven home: /home/jenkins/tools/maven/latest3
Java version: 1.8.0_172, vendor: Oracle Corporation
Java home: /usr/local/asfpackages/java/jdk1.8.0_172/jre
Default locale: en_US, platform encoding: UTF-8
OS name: "linux", version: "4.4.0-116-generic", arch: "amd64", family: "unix"
[INFO] [jenkins-event-spy] Generate /home/jenkins/jenkins-slave/workspace/box_maven-doxia-site_master-IVLIM3FD7IHMMFNW5G7AIUYHFYH7R75A6TO3URHNGEW2DEHYMTVQ@tmp/withMavendf7d7285/maven-spy-20180511-143833-2188674816708332763462.log.tmp
...
[INFO] Scanning for projects...
[ERROR] [ERROR] Some problems were encountered while processing the POMs:
[FATAL] Non-resolvable parent POM for org.apache.maven.doxia:doxia-site:1.0-SNAPSHOT: Could
not find artifact org.apache.maven:maven-parent:pom:32-SNAPSHOT and 'parent.relativePath'
points at wrong local POM @ line 23, column 11
 @ 
[INFO] [jenkins-event-spy] Generated /home/jenkins/jenkins-slave/workspace/box_maven-doxia-site_master-IVLIM3FD7IHMMFNW5G7AIUYHFYH7R75A6TO3URHNGEW2DEHYMTVQ@tmp/withMavendf7d7285/maven-spy-20180511-143833-2188674816708332763462.log
[ERROR] The build could not read 1 project -> [Help 1]
[ERROR]   
[ERROR]   The project org.apache.maven.doxia:doxia-site:1.0-SNAPSHOT (/home/jenkins/jenkins-slave/workspace/box_maven-doxia-site_master-IVLIM3FD7IHMMFNW5G7AIUYHFYH7R75A6TO3URHNGEW2DEHYMTVQ/pom.xml)
has 1 error
[ERROR]     Non-resolvable parent POM for org.apache.maven.doxia:doxia-site:1.0-SNAPSHOT:
Could not find artifact org.apache.maven:maven-parent:pom:32-SNAPSHOT and 'parent.relativePath'
points at wrong local POM @ line 23, column 11 -> [Help 2]
[ERROR] 
[ERROR] To see the full stack trace of the errors, re-run Maven with the -e switch.
[ERROR] Re-run Maven using the -X switch to enable full debug logging.
[ERROR] 
[ERROR] For more information about the errors and possible solutions, please read the following
articles:
[ERROR] [Help 1] http://cwiki.apache.org/confluence/display/MAVEN/ProjectBuildingException
[ERROR] [Help 2] http://cwiki.apache.org/confluence/display/MAVEN/UnresolvableModelException
[Pipeline] }
[Pipeline] // withMaven
[Pipeline] }
[Pipeline] // stage
[Pipeline] stage
[Pipeline] { (Declarative: Post Actions)
[Pipeline] echo
Build result: FAILURE
[Pipeline] jiraIssueSelector
Mime
  • Unnamed multipart/mixed (inline, None, 0 bytes)
View raw message