maven-notifications mailing list archives

Site index · List index
Message view « Date » · « Thread »
Top « Date » · « Thread »
From Apache Jenkins Server <jenk...@builds.apache.org>
Subject Build failed in Jenkins: Maven TLP » maven » master #18
Date Sun, 27 May 2018 00:43:45 GMT
See https://builds.apache.org/job/maven-box/job/maven/job/master/18/

Changes:

* magnify a bit this line :-)

All tests passed

Build log:
[...truncated 479.85 KB...]
[INFO] ------------------------------------------------------------------------
[INFO] BUILD FAILURE
[INFO] ------------------------------------------------------------------------
[INFO] Total time: 02:02 min
[INFO] Finished at: 2018-05-27T00:41:24Z
[INFO] Final Memory: 73M/1511M
[INFO] ------------------------------------------------------------------------
[INFO] [jenkins-event-spy] Generated /home/jenkins/jenkins-slave/workspace/maven-box_maven_master-DVEN5KAF4FLE3WDK7SWFNYUY4YZ7X45JVWYY6FZT5ZEB3CLWABVQ/build@tmp/withMaven191c51ea/maven-spy-20180527-003921-7476947847856267511494.log
[ERROR] Failed to execute goal org.apache.maven.plugins:maven-remote-resources-plugin:1.5:process
(process-resource-bundles) on project apache-maven: Error rendering velocity resource. Invocation
of method 'getResourceAsFile' in  class org.codehaus.plexus.resource.DefaultResourceManager
threw exception org.codehaus.plexus.resource.loader.ResourceNotFoundException: Could not find
resource 'https://www.apache.org/licenses/LICENSE-2.0.txt'. at remote-resources[line 38, column
26] -> [Help 1]
org.apache.maven.lifecycle.LifecycleExecutionException: Failed to execute goal org.apache.maven.plugins:maven-remote-resources-plugin:1.5:process
(process-resource-bundles) on project apache-maven: Error rendering velocity resource.
    at org.apache.maven.lifecycle.internal.MojoExecutor.execute (MojoExecutor.java:213)
    at org.apache.maven.lifecycle.internal.MojoExecutor.execute (MojoExecutor.java:154)
    at org.apache.maven.lifecycle.internal.MojoExecutor.execute (MojoExecutor.java:146)
    at org.apache.maven.lifecycle.internal.LifecycleModuleBuilder.buildProject (LifecycleModuleBuilder.java:117)
    at org.apache.maven.lifecycle.internal.LifecycleModuleBuilder.buildProject (LifecycleModuleBuilder.java:81)
    at org.apache.maven.lifecycle.internal.builder.singlethreaded.SingleThreadedBuilder.build
(SingleThreadedBuilder.java:51)
    at org.apache.maven.lifecycle.internal.LifecycleStarter.execute (LifecycleStarter.java:128)
    at org.apache.maven.DefaultMaven.doExecute (DefaultMaven.java:309)
    at org.apache.maven.DefaultMaven.doExecute (DefaultMaven.java:194)
    at org.apache.maven.DefaultMaven.execute (DefaultMaven.java:107)
    at org.apache.maven.cli.MavenCli.execute (MavenCli.java:955)
    at org.apache.maven.cli.MavenCli.doMain (MavenCli.java:290)
    at org.apache.maven.cli.MavenCli.main (MavenCli.java:194)
    at sun.reflect.NativeMethodAccessorImpl.invoke0 (Native Method)
    at sun.reflect.NativeMethodAccessorImpl.invoke (NativeMethodAccessorImpl.java:57)
    at sun.reflect.DelegatingMethodAccessorImpl.invoke (DelegatingMethodAccessorImpl.java:43)
    at java.lang.reflect.Method.invoke (Method.java:606)
    at org.codehaus.plexus.classworlds.launcher.Launcher.launchEnhanced (Launcher.java:289)
    at org.codehaus.plexus.classworlds.launcher.Launcher.launch (Launcher.java:229)
    at org.codehaus.plexus.classworlds.launcher.Launcher.mainWithExitCode (Launcher.java:415)
    at org.codehaus.plexus.classworlds.launcher.Launcher.main (Launcher.java:356)
Caused by: org.apache.maven.plugin.MojoExecutionException: Error rendering velocity resource.
    at org.apache.maven.plugin.resources.remote.ProcessRemoteResourcesMojo.processResourceBundles
(ProcessRemoteResourcesMojo.java:1246)
    at org.apache.maven.plugin.resources.remote.ProcessRemoteResourcesMojo.execute (ProcessRemoteResourcesMojo.java:520)
    at org.apache.maven.plugin.DefaultBuildPluginManager.executeMojo (DefaultBuildPluginManager.java:134)
    at org.apache.maven.lifecycle.internal.MojoExecutor.execute (MojoExecutor.java:208)
    at org.apache.maven.lifecycle.internal.MojoExecutor.execute (MojoExecutor.java:154)
    at org.apache.maven.lifecycle.internal.MojoExecutor.execute (MojoExecutor.java:146)
    at org.apache.maven.lifecycle.internal.LifecycleModuleBuilder.buildProject (LifecycleModuleBuilder.java:117)
    at org.apache.maven.lifecycle.internal.LifecycleModuleBuilder.buildProject (LifecycleModuleBuilder.java:81)
    at org.apache.maven.lifecycle.internal.builder.singlethreaded.SingleThreadedBuilder.build
(SingleThreadedBuilder.java:51)
    at org.apache.maven.lifecycle.internal.LifecycleStarter.execute (LifecycleStarter.java:128)
    at org.apache.maven.DefaultMaven.doExecute (DefaultMaven.java:309)
    at org.apache.maven.DefaultMaven.doExecute (DefaultMaven.java:194)
    at org.apache.maven.DefaultMaven.execute (DefaultMaven.java:107)
    at org.apache.maven.cli.MavenCli.execute (MavenCli.java:955)
    at org.apache.maven.cli.MavenCli.doMain (MavenCli.java:290)
    at org.apache.maven.cli.MavenCli.main (MavenCli.java:194)
    at sun.reflect.NativeMethodAccessorImpl.invoke0 (Native Method)
    at sun.reflect.NativeMethodAccessorImpl.invoke (NativeMethodAccessorImpl.java:57)
    at sun.reflect.DelegatingMethodAccessorImpl.invoke (DelegatingMethodAccessorImpl.java:43)
    at java.lang.reflect.Method.invoke (Method.java:606)
    at org.codehaus.plexus.classworlds.launcher.Launcher.launchEnhanced (Launcher.java:289)
    at org.codehaus.plexus.classworlds.launcher.Launcher.launch (Launcher.java:229)
    at org.codehaus.plexus.classworlds.launcher.Launcher.mainWithExitCode (Launcher.java:415)
    at org.codehaus.plexus.classworlds.launcher.Launcher.main (Launcher.java:356)
Caused by: org.apache.velocity.exception.MethodInvocationException: Invocation of method 'getResourceAsFile'
in  class org.codehaus.plexus.resource.DefaultResourceManager threw exception org.codehaus.plexus.resource.loader.ResourceNotFoundException:
Could not find resource 'https://www.apache.org/licenses/LICENSE-2.0.txt'. at remote-resources[line
38, column 26]
    at org.apache.velocity.runtime.parser.node.ASTMethod.handleInvocationException (ASTMethod.java:243)
    at org.apache.velocity.runtime.parser.node.ASTMethod.execute (ASTMethod.java:187)
    at org.apache.velocity.runtime.parser.node.ASTReference.execute (ASTReference.java:280)
    at org.apache.velocity.runtime.parser.node.ASTReference.value (ASTReference.java:567)
    at org.apache.velocity.runtime.parser.node.ASTExpression.value (ASTExpression.java:71)
    at org.apache.velocity.runtime.parser.node.ASTSetDirective.render (ASTSetDirective.java:142)
    at org.apache.velocity.runtime.parser.node.ASTBlock.render (ASTBlock.java:72)
    at org.apache.velocity.runtime.parser.node.ASTIfStatement.render (ASTIfStatement.java:87)
    at org.apache.velocity.runtime.parser.node.ASTBlock.render (ASTBlock.java:72)
    at org.apache.velocity.runtime.parser.node.ASTIfStatement.render (ASTIfStatement.java:87)
    at org.apache.velocity.runtime.parser.node.ASTBlock.render (ASTBlock.java:72)
    at org.apache.velocity.runtime.directive.Foreach.render (Foreach.java:420)
    at org.apache.velocity.runtime.parser.node.ASTDirective.render (ASTDirective.java:207)
    at org.apache.velocity.runtime.parser.node.ASTBlock.render (ASTBlock.java:72)
    at org.apache.velocity.runtime.directive.Foreach.render (Foreach.java:420)
    at org.apache.velocity.runtime.parser.node.ASTDirective.render (ASTDirective.java:207)
    at org.apache.velocity.runtime.parser.node.SimpleNode.render (SimpleNode.java:342)
    at org.apache.velocity.runtime.RuntimeInstance.render (RuntimeInstance.java:1378)
    at org.apache.velocity.runtime.RuntimeInstance.evaluate (RuntimeInstance.java:1314)
    at org.apache.velocity.app.Velocity.evaluate (Velocity.java:254)
    at org.apache.maven.plugin.resources.remote.ProcessRemoteResourcesMojo.processResourceBundles
(ProcessRemoteResourcesMojo.java:1218)
    at org.apache.maven.plugin.resources.remote.ProcessRemoteResourcesMojo.execute (ProcessRemoteResourcesMojo.java:520)
    at org.apache.maven.plugin.DefaultBuildPluginManager.executeMojo (DefaultBuildPluginManager.java:134)
    at org.apache.maven.lifecycle.internal.MojoExecutor.execute (MojoExecutor.java:208)
    at org.apache.maven.lifecycle.internal.MojoExecutor.execute (MojoExecutor.java:154)
    at org.apache.maven.lifecycle.internal.MojoExecutor.execute (MojoExecutor.java:146)
    at org.apache.maven.lifecycle.internal.LifecycleModuleBuilder.buildProject (LifecycleModuleBuilder.java:117)
    at org.apache.maven.lifecycle.internal.LifecycleModuleBuilder.buildProject (LifecycleModuleBuilder.java:81)
    at org.apache.maven.lifecycle.internal.builder.singlethreaded.SingleThreadedBuilder.build
(SingleThreadedBuilder.java:51)
    at org.apache.maven.lifecycle.internal.LifecycleStarter.execute (LifecycleStarter.java:128)
    at org.apache.maven.DefaultMaven.doExecute (DefaultMaven.java:309)
    at org.apache.maven.DefaultMaven.doExecute (DefaultMaven.java:194)
    at org.apache.maven.DefaultMaven.execute (DefaultMaven.java:107)
    at org.apache.maven.cli.MavenCli.execute (MavenCli.java:955)
    at org.apache.maven.cli.MavenCli.doMain (MavenCli.java:290)
    at org.apache.maven.cli.MavenCli.main (MavenCli.java:194)
    at sun.reflect.NativeMethodAccessorImpl.invoke0 (Native Method)
    at sun.reflect.NativeMethodAccessorImpl.invoke (NativeMethodAccessorImpl.java:57)
    at sun.reflect.DelegatingMethodAccessorImpl.invoke (DelegatingMethodAccessorImpl.java:43)
    at java.lang.reflect.Method.invoke (Method.java:606)
    at org.codehaus.plexus.classworlds.launcher.Launcher.launchEnhanced (Launcher.java:289)
    at org.codehaus.plexus.classworlds.launcher.Launcher.launch (Launcher.java:229)
    at org.codehaus.plexus.classworlds.launcher.Launcher.mainWithExitCode (Launcher.java:415)
    at org.codehaus.plexus.classworlds.launcher.Launcher.main (Launcher.java:356)
Caused by: org.codehaus.plexus.resource.loader.ResourceNotFoundException: Could not find resource
'https://www.apache.org/licenses/LICENSE-2.0.txt'.
    at org.codehaus.plexus.resource.DefaultResourceManager.getResource (DefaultResourceManager.java:173)
    at org.codehaus.plexus.resource.DefaultResourceManager.getResourceAsFile (DefaultResourceManager.java:91)
    at sun.reflect.NativeMethodAccessorImpl.invoke0 (Native Method)
    at sun.reflect.NativeMethodAccessorImpl.invoke (NativeMethodAccessorImpl.java:57)
    at sun.reflect.DelegatingMethodAccessorImpl.invoke (DelegatingMethodAccessorImpl.java:43)
    at java.lang.reflect.Method.invoke (Method.java:606)
    at org.apache.velocity.util.introspection.UberspectImpl$VelMethodImpl.doInvoke (UberspectImpl.java:395)
    at org.apache.velocity.util.introspection.UberspectImpl$VelMethodImpl.invoke (UberspectImpl.java:384)
    at org.apache.velocity.runtime.parser.node.ASTMethod.execute (ASTMethod.java:173)
    at org.apache.velocity.runtime.parser.node.ASTReference.execute (ASTReference.java:280)
    at org.apache.velocity.runtime.parser.node.ASTReference.value (ASTReference.java:567)
    at org.apache.velocity.runtime.parser.node.ASTExpression.value (ASTExpression.java:71)
    at org.apache.velocity.runtime.parser.node.ASTSetDirective.render (ASTSetDirective.java:142)
    at org.apache.velocity.runtime.parser.node.ASTBlock.render (ASTBlock.java:72)
    at org.apache.velocity.runtime.parser.node.ASTIfStatement.render (ASTIfStatement.java:87)
    at org.apache.velocity.runtime.parser.node.ASTBlock.render (ASTBlock.java:72)
    at org.apache.velocity.runtime.parser.node.ASTIfStatement.render (ASTIfStatement.java:87)
    at org.apache.velocity.runtime.parser.node.ASTBlock.render (ASTBlock.java:72)
    at org.apache.velocity.runtime.directive.Foreach.render (Foreach.java:420)
    at org.apache.velocity.runtime.parser.node.ASTDirective.render (ASTDirective.java:207)
    at org.apache.velocity.runtime.parser.node.ASTBlock.render (ASTBlock.java:72)
    at org.apache.velocity.runtime.directive.Foreach.render (Foreach.java:420)
    at org.apache.velocity.runtime.parser.node.ASTDirective.render (ASTDirective.java:207)
    at org.apache.velocity.runtime.parser.node.SimpleNode.render (SimpleNode.java:342)
    at org.apache.velocity.runtime.RuntimeInstance.render (RuntimeInstance.java:1378)
    at org.apache.velocity.runtime.RuntimeInstance.evaluate (RuntimeInstance.java:1314)
    at org.apache.velocity.app.Velocity.evaluate (Velocity.java:254)
    at org.apache.maven.plugin.resources.remote.ProcessRemoteResourcesMojo.processResourceBundles
(ProcessRemoteResourcesMojo.java:1218)
    at org.apache.maven.plugin.resources.remote.ProcessRemoteResourcesMojo.execute (ProcessRemoteResourcesMojo.java:520)
    at org.apache.maven.plugin.DefaultBuildPluginManager.executeMojo (DefaultBuildPluginManager.java:134)
    at org.apache.maven.lifecycle.internal.MojoExecutor.execute (MojoExecutor.java:208)
    at org.apache.maven.lifecycle.internal.MojoExecutor.execute (MojoExecutor.java:154)
    at org.apache.maven.lifecycle.internal.MojoExecutor.execute (MojoExecutor.java:146)
    at org.apache.maven.lifecycle.internal.LifecycleModuleBuilder.buildProject (LifecycleModuleBuilder.java:117)
    at org.apache.maven.lifecycle.internal.LifecycleModuleBuilder.buildProject (LifecycleModuleBuilder.java:81)
    at org.apache.maven.lifecycle.internal.builder.singlethreaded.SingleThreadedBuilder.build
(SingleThreadedBuilder.java:51)
    at org.apache.maven.lifecycle.internal.LifecycleStarter.execute (LifecycleStarter.java:128)
    at org.apache.maven.DefaultMaven.doExecute (DefaultMaven.java:309)
    at org.apache.maven.DefaultMaven.doExecute (DefaultMaven.java:194)
    at org.apache.maven.DefaultMaven.execute (DefaultMaven.java:107)
    at org.apache.maven.cli.MavenCli.execute (MavenCli.java:955)
    at org.apache.maven.cli.MavenCli.doMain (MavenCli.java:290)
    at org.apache.maven.cli.MavenCli.main (MavenCli.java:194)
    at sun.reflect.NativeMethodAccessorImpl.invoke0 (Native Method)
    at sun.reflect.NativeMethodAccessorImpl.invoke (NativeMethodAccessorImpl.java:57)
    at sun.reflect.DelegatingMethodAccessorImpl.invoke (DelegatingMethodAccessorImpl.java:43)
    at java.lang.reflect.Method.invoke (Method.java:606)
    at org.codehaus.plexus.classworlds.launcher.Launcher.launchEnhanced (Launcher.java:289)
    at org.codehaus.plexus.classworlds.launcher.Launcher.launch (Launcher.java:229)
    at org.codehaus.plexus.classworlds.launcher.Launcher.mainWithExitCode (Launcher.java:415)
    at org.codehaus.plexus.classworlds.launcher.Launcher.main (Launcher.java:356)
[ERROR] 
[ERROR] Re-run Maven using the -X switch to enable full debug logging.
[ERROR] 
[ERROR] For more information about the errors and possible solutions, please read the following
articles:
[ERROR] [Help 1] http://cwiki.apache.org/confluence/display/MAVEN/MojoExecutionException
[ERROR] 
[ERROR] After correcting the problems, you can resume the build with the command
[ERROR]   mvn <goals> -rf :apache-maven
[Pipeline] }
[withMaven] artifactsPublisher - Archive artifact pom.xml under org/apache/maven/maven/3.5.4-SNAPSHOT/maven-3.5.4-SNAPSHOT.pom
[withMaven] artifactsPublisher - Archive artifact maven-model/pom.xml under org/apache/maven/maven-model/3.5.4-SNAPSHOT/maven-model-3.5.4-SNAPSHOT.pom
[withMaven] artifactsPublisher - Archive artifact maven-model/target/maven-model-3.5.4-SNAPSHOT.jar
under org/apache/maven/maven-model/3.5.4-SNAPSHOT/maven-model-3.5.4-SNAPSHOT.jar
[withMaven] artifactsPublisher - Archive artifact maven-artifact/pom.xml under org/apache/maven/maven-artifact/3.5.4-SNAPSHOT/maven-artifact-3.5.4-SNAPSHOT.pom
[withMaven] artifactsPublisher - Archive artifact maven-artifact/target/maven-artifact-3.5.4-SNAPSHOT.jar
under org/apache/maven/maven-artifact/3.5.4-SNAPSHOT/maven-artifact-3.5.4-SNAPSHOT.jar
[withMaven] artifactsPublisher - Archive artifact maven-plugin-api/pom.xml under org/apache/maven/maven-plugin-api/3.5.4-SNAPSHOT/maven-plugin-api-3.5.4-SNAPSHOT.pom
[withMaven] artifactsPublisher - Archive artifact maven-plugin-api/target/maven-plugin-api-3.5.4-SNAPSHOT.jar
under org/apache/maven/maven-plugin-api/3.5.4-SNAPSHOT/maven-plugin-api-3.5.4-SNAPSHOT.jar
[withMaven] artifactsPublisher - Archive artifact maven-builder-support/pom.xml under org/apache/maven/maven-builder-support/3.5.4-SNAPSHOT/maven-builder-support-3.5.4-SNAPSHOT.pom
[withMaven] artifactsPublisher - Archive artifact maven-builder-support/target/maven-builder-support-3.5.4-SNAPSHOT.jar
under org/apache/maven/maven-builder-support/3.5.4-SNAPSHOT/maven-builder-support-3.5.4-SNAPSHOT.jar
[withMaven] artifactsPublisher - Archive artifact maven-model-builder/pom.xml under org/apache/maven/maven-model-builder/3.5.4-SNAPSHOT/maven-model-builder-3.5.4-SNAPSHOT.pom
[withMaven] artifactsPublisher - Archive artifact maven-model-builder/target/maven-model-builder-3.5.4-SNAPSHOT.jar
under org/apache/maven/maven-model-builder/3.5.4-SNAPSHOT/maven-model-builder-3.5.4-SNAPSHOT.jar
[withMaven] artifactsPublisher - Archive artifact maven-settings/pom.xml under org/apache/maven/maven-settings/3.5.4-SNAPSHOT/maven-settings-3.5.4-SNAPSHOT.pom
[withMaven] artifactsPublisher - Archive artifact maven-settings/target/maven-settings-3.5.4-SNAPSHOT.jar
under org/apache/maven/maven-settings/3.5.4-SNAPSHOT/maven-settings-3.5.4-SNAPSHOT.jar
[withMaven] artifactsPublisher - Archive artifact maven-settings-builder/pom.xml under org/apache/maven/maven-settings-builder/3.5.4-SNAPSHOT/maven-settings-builder-3.5.4-SNAPSHOT.pom
[withMaven] artifactsPublisher - Archive artifact maven-settings-builder/target/maven-settings-builder-3.5.4-SNAPSHOT.jar
under org/apache/maven/maven-settings-builder/3.5.4-SNAPSHOT/maven-settings-builder-3.5.4-SNAPSHOT.jar
[withMaven] artifactsPublisher - Archive artifact maven-repository-metadata/pom.xml under
org/apache/maven/maven-repository-metadata/3.5.4-SNAPSHOT/maven-repository-metadata-3.5.4-SNAPSHOT.pom
[withMaven] artifactsPublisher - Archive artifact maven-repository-metadata/target/maven-repository-metadata-3.5.4-SNAPSHOT.jar
under org/apache/maven/maven-repository-metadata/3.5.4-SNAPSHOT/maven-repository-metadata-3.5.4-SNAPSHOT.jar
[withMaven] artifactsPublisher - Archive artifact maven-resolver-provider/pom.xml under org/apache/maven/maven-resolver-provider/3.5.4-SNAPSHOT/maven-resolver-provider-3.5.4-SNAPSHOT.pom
[withMaven] artifactsPublisher - Archive artifact maven-resolver-provider/target/maven-resolver-provider-3.5.4-SNAPSHOT.jar
under org/apache/maven/maven-resolver-provider/3.5.4-SNAPSHOT/maven-resolver-provider-3.5.4-SNAPSHOT.jar
[withMaven] artifactsPublisher - Archive artifact maven-core/pom.xml under org/apache/maven/maven-core/3.5.4-SNAPSHOT/maven-core-3.5.4-SNAPSHOT.pom
[withMaven] artifactsPublisher - Archive artifact maven-core/target/maven-core-3.5.4-SNAPSHOT.jar
under org/apache/maven/maven-core/3.5.4-SNAPSHOT/maven-core-3.5.4-SNAPSHOT.jar
[withMaven] artifactsPublisher - Archive artifact maven-slf4j-provider/pom.xml under org/apache/maven/maven-slf4j-provider/3.5.4-SNAPSHOT/maven-slf4j-provider-3.5.4-SNAPSHOT.pom
[withMaven] artifactsPublisher - Archive artifact maven-slf4j-provider/target/maven-slf4j-provider-3.5.4-SNAPSHOT.jar
under org/apache/maven/maven-slf4j-provider/3.5.4-SNAPSHOT/maven-slf4j-provider-3.5.4-SNAPSHOT.jar
[withMaven] artifactsPublisher - Archive artifact maven-embedder/pom.xml under org/apache/maven/maven-embedder/3.5.4-SNAPSHOT/maven-embedder-3.5.4-SNAPSHOT.pom
[withMaven] artifactsPublisher - Archive artifact maven-embedder/target/maven-embedder-3.5.4-SNAPSHOT.jar
under org/apache/maven/maven-embedder/3.5.4-SNAPSHOT/maven-embedder-3.5.4-SNAPSHOT.jar
[withMaven] artifactsPublisher - Archive artifact maven-compat/pom.xml under org/apache/maven/maven-compat/3.5.4-SNAPSHOT/maven-compat-3.5.4-SNAPSHOT.pom
[withMaven] artifactsPublisher - Archive artifact maven-compat/target/maven-compat-3.5.4-SNAPSHOT.jar
under org/apache/maven/maven-compat/3.5.4-SNAPSHOT/maven-compat-3.5.4-SNAPSHOT.jar
[withMaven] artifactsPublisher - Archive artifact target/maven-3.5.4-SNAPSHOT-site.xml under
org/apache/maven/maven/3.5.4-SNAPSHOT/maven-3.5.4-SNAPSHOT-site.xml
[withMaven] junitPublisher - Archive test results for Maven artifact org.apache.maven:maven-model:3.5.4-SNAPSHOT
generated by maven-surefire-plugin:test (default-test): maven-model/target/surefire-reports/*.xml
Recording test results
[withMaven] junitPublisher - Archive test results for Maven artifact org.apache.maven:maven-artifact:3.5.4-SNAPSHOT
generated by maven-surefire-plugin:test (default-test): maven-artifact/target/surefire-reports/*.xml
Recording test results
[withMaven] junitPublisher - Archive test results for Maven artifact org.apache.maven:maven-plugin-api:3.5.4-SNAPSHOT
generated by maven-surefire-plugin:test (default-test): maven-plugin-api/target/surefire-reports/*.xml
Recording test results
[withMaven] junitPublisher - Archive test results for Maven artifact org.apache.maven:maven-builder-support:3.5.4-SNAPSHOT
generated by maven-surefire-plugin:test (default-test): maven-builder-support/target/surefire-reports/*.xml
Recording test results
[withMaven] junitPublisher - Archive test results for Maven artifact org.apache.maven:maven-model-builder:3.5.4-SNAPSHOT
generated by maven-surefire-plugin:test (default-test): maven-model-builder/target/surefire-reports/*.xml
Recording test results
[withMaven] junitPublisher - Archive test results for Maven artifact org.apache.maven:maven-settings:3.5.4-SNAPSHOT
generated by maven-surefire-plugin:test (default-test): maven-settings/target/surefire-reports/*.xml
Recording test results
None of the test reports contained any result
[withMaven] junitPublisher - Archive test results for Maven artifact org.apache.maven:maven-settings-builder:3.5.4-SNAPSHOT
generated by maven-surefire-plugin:test (default-test): maven-settings-builder/target/surefire-reports/*.xml
Recording test results
[withMaven] junitPublisher - Archive test results for Maven artifact org.apache.maven:maven-repository-metadata:3.5.4-SNAPSHOT
generated by maven-surefire-plugin:test (default-test): maven-repository-metadata/target/surefire-reports/*.xml
Recording test results
None of the test reports contained any result
[withMaven] junitPublisher - Archive test results for Maven artifact org.apache.maven:maven-resolver-provider:3.5.4-SNAPSHOT
generated by maven-surefire-plugin:test (default-test): maven-resolver-provider/target/surefire-reports/*.xml
Recording test results
[withMaven] junitPublisher - Archive test results for Maven artifact org.apache.maven:maven-core:3.5.4-SNAPSHOT
generated by maven-surefire-plugin:test (default-test): maven-core/target/surefire-reports/*.xml
Recording test results
[withMaven] junitPublisher - Archive test results for Maven artifact org.apache.maven:maven-slf4j-provider:3.5.4-SNAPSHOT
generated by maven-surefire-plugin:test (default-test): maven-slf4j-provider/target/surefire-reports/*.xml
Recording test results
None of the test reports contained any result
[withMaven] junitPublisher - Archive test results for Maven artifact org.apache.maven:maven-embedder:3.5.4-SNAPSHOT
generated by maven-surefire-plugin:test (default-test): maven-embedder/target/surefire-reports/*.xml
Recording test results
[withMaven] junitPublisher - Archive test results for Maven artifact org.apache.maven:maven-compat:3.5.4-SNAPSHOT
generated by maven-surefire-plugin:test (default-test): maven-compat/target/surefire-reports/*.xml
Recording test results
[withMaven] openTasksPublisher - Scan Tasks for Maven artifact org.apache.maven:maven-model:3.5.4-SNAPSHOT
in source directory maven-model/src/main/java
[withMaven] openTasksPublisher - Scan Tasks for Maven artifact org.apache.maven:maven-artifact:3.5.4-SNAPSHOT
in source directory maven-artifact/src/main/java
[withMaven] openTasksPublisher - Scan Tasks for Maven artifact org.apache.maven:maven-plugin-api:3.5.4-SNAPSHOT
in source directory maven-plugin-api/src/main/java
[withMaven] openTasksPublisher - Scan Tasks for Maven artifact org.apache.maven:maven-builder-support:3.5.4-SNAPSHOT
in source directory maven-builder-support/src/main/java
[withMaven] openTasksPublisher - Scan Tasks for Maven artifact org.apache.maven:maven-model-builder:3.5.4-SNAPSHOT
in source directory maven-model-builder/src/main/java
[withMaven] openTasksPublisher - Scan Tasks for Maven artifact org.apache.maven:maven-settings:3.5.4-SNAPSHOT
in source directory maven-settings/src/main/java
[withMaven] openTasksPublisher - Scan Tasks for Maven artifact org.apache.maven:maven-settings-builder:3.5.4-SNAPSHOT
in source directory maven-settings-builder/src/main/java
[withMaven] openTasksPublisher - Scan Tasks for Maven artifact org.apache.maven:maven-resolver-provider:3.5.4-SNAPSHOT
in source directory maven-resolver-provider/src/main/java
[withMaven] openTasksPublisher - Scan Tasks for Maven artifact org.apache.maven:maven-core:3.5.4-SNAPSHOT
in source directory maven-core/src/main/java
[withMaven] openTasksPublisher - Scan Tasks for Maven artifact org.apache.maven:maven-slf4j-provider:3.5.4-SNAPSHOT
in source directory maven-slf4j-provider/src/main/java
[withMaven] openTasksPublisher - Scan Tasks for Maven artifact org.apache.maven:maven-embedder:3.5.4-SNAPSHOT
in source directory maven-embedder/src/main/java
[withMaven] openTasksPublisher - Scan Tasks for Maven artifact org.apache.maven:maven-compat:3.5.4-SNAPSHOT
in source directory maven-compat/src/main/java
[TASKS] Scanning folder '/home/jenkins/jenkins-slave/workspace/maven-box_maven_master-DVEN5KAF4FLE3WDK7SWFNYUY4YZ7X45JVWYY6FZT5ZEB3CLWABVQ/build'
for files matching the pattern 'maven-model/src/main/java/**/*,maven-artifact/src/main/java/**/*,maven-plugin-api/src/main/java/**/*,maven-builder-support/src/main/java/**/*,maven-model-builder/src/main/java/**/*,maven-settings/src/main/java/**/*,maven-settings-builder/src/main/java/**/*,maven-resolver-provider/src/main/java/**/*,maven-core/src/main/java/**/*,maven-slf4j-provider/src/main/java/**/*,maven-embedder/src/main/java/**/*,maven-compat/src/main/java/**/*'
- excludes: null
[TASKS] Found 700 files to scan for tasks
[TASKS] Found 164 open tasks.
Skipping warnings blame since pipelines do not have an SCM link.%n
[TASKS] Computing warning deltas based on reference build #11
[Pipeline] // withMaven
[Pipeline] }
[Pipeline] // stage
[Pipeline] }
[Pipeline] // dir
[Pipeline] }
[Pipeline] // node
[Pipeline] stage
[Pipeline] { (Notifications)
[Pipeline] echo
Build result: FAILURE
[Pipeline] jiraIssueSelector
[Pipeline] emailext
Mime
  • Unnamed multipart/mixed (inline, None, 0 bytes)
View raw message