maven-notifications mailing list archives

Site index · List index
Message view « Date » · « Thread »
Top « Date » · « Thread »
From Apache Jenkins Server <jenk...@builds.apache.org>
Subject Build failed in Jenkins: Maven TLP » maven-plugin-tools » master #23
Date Sat, 05 May 2018 09:08:02 GMT
See https://builds.apache.org/job/maven-box/job/maven-plugin-tools/job/master/23/

Changes:

* [MPLUGIN-335] - Fix build and tests
* [MPLUGIN-335] - Fix build and tests
* [MPLUGIN-335] - Fix build and tests
* [MPLUGIN-335] - Fix build and tests
* [MPLUGIN-335] - Fix build and tests
* [MPLUGIN-335] - Fix build and tests

All tests passed

Build log:
[...truncated 3.64 MB...]
[windows-jdk7]        [INFO] --- maven-surefire-plugin:2.12.4:test (default-test) @ asm-failure
---
[windows-jdk7]        [INFO] No tests to run.
[windows-jdk7]        [INFO] 
[windows-jdk7]        [INFO] --- maven-jar-plugin:2.4:jar (default-jar) @ asm-failure ---
[windows-jdk7]        [INFO] Building jar: F:\jenkins\jenkins-slave\workspace\x_maven-plugin-tools_master-XKS4EHY3PSXHGP4DHIXUDAAM6TMAKT3YNFP2XDSSXFM24ZMKWIXQ\m\maven-plugin-plugin\target\it\asm-failure\target\asm-failure-1.0-SNAPSHOT.jar
[windows-jdk7]        [INFO] 
[windows-jdk7]        [INFO] --- maven-plugin-plugin:3.5.2-SNAPSHOT:addPluginArtifactMetadata
(default-addPluginArtifactMetadata) @ asm-failure ---
[windows-jdk7]        [INFO] ------------------------------------------------------------------------
[windows-jdk7]        [INFO] BUILD SUCCESS
[windows-jdk7]        [INFO] ------------------------------------------------------------------------
[windows-jdk7]        [INFO] Total time: 6.793 s
[windows-jdk7]        [INFO] Finished at: 2018-05-05T09:06:38Z
[windows-jdk7]        [INFO] Final Memory: 21M/368M
[windows-jdk7]        [INFO] ------------------------------------------------------------------------
[windows-jdk7]        Picked up JAVA_TOOL_OPTIONS: -Dmaven.ext.class.path="f:\jenkins\jenkins-slave\workspace\x_maven-plugin-tools_master-XKS4EHY3PSXHGP4DHIXUDAAM6TMAKT3YNFP2XDSSXFM24ZMKWIXQ@tmp\withMaven083d2924\pipeline-maven-spy.jar"
-Dorg.jenkinsci.plugins.pipeline.maven.reportsFolder="f:\jenkins\jenkins-slave\workspace\x_maven-plugin-tools_master-XKS4EHY3PSXHGP4DHIXUDAAM6TMAKT3YNFP2XDSSXFM24ZMKWIXQ@tmp\withMaven083d2924"

[windows-jdk7]        Running post-build script: F:\jenkins\jenkins-slave\workspace\x_maven-plugin-tools_master-XKS4EHY3PSXHGP4DHIXUDAAM6TMAKT3YNFP2XDSSXFM24ZMKWIXQ\m\maven-plugin-plugin\target\it\asm-failure\verify.groovy
[windows-jdk7] [INFO] Building: beanshell-simple\pom.xml
[windows-jdk9] [INFO] run post-build script verify.groovy
[windows-jdk9] [INFO]           ant-basic\pom.xml ................................ SUCCESS
(8.2 s)
[windows-jdk9] [INFO] Building: ant-reference-parameter\pom.xml
[linux-jdk9] [INFO] run post-build script verify.groovy
[linux-jdk9] [INFO]           annotation-with-inheritance-reactor/pom.xml ...... FAILED (3.3
s)
[linux-jdk9] [INFO]   The post-build script did not succeed. assert touchFile.isFile()
[linux-jdk9]        |         |
[linux-jdk9]        |         false
[linux-jdk9]        /home/jenkins/jenkins-slave/workspace/x_maven-plugin-tools_master-XKS4EHY3PSXHGP4DHIXUDAAM6TMAKT3YNFP2XDSSXFM24ZMKWIXQ/m/maven-plugin-plugin/target/it/annotation-with-inheritance-reactor/module-mojo/target/touch.txt
[linux-jdk9] [INFO] Building: mplugin-272_java8/pom.xml
[linux-jdk9] Terminated
[windows-jdk7] Sending interrupt signal to process
[windows-jdk9] [INFO]           ant-reference-parameter\pom.xml .................. SUCCESS
(6.5 s)
[windows-jdk9] [INFO] Building: ant-simple-usage\pom.xml
[windows-jdk9] [INFO]           ant-simple-usage\pom.xml ......................... SUCCESS
(3.9 s)
[windows-jdk9] [INFO] Building: ant-since-maven-plugin\pom.xml
[windows-jdk7] After 10s process did not stop
[windows-jdk9] [INFO]           ant-since-maven-plugin\pom.xml ................... SUCCESS
(3.1 s)
[windows-jdk9] [INFO] Building: asm-failure\pom.xml
[windows-jdk7] Cannot contact windows-2012-3: java.lang.InterruptedException
[windows-jdk8] Cannot contact windows-2012-3: java.lang.InterruptedException
[windows-jdk9] [INFO] run post-build script verify.groovy
[windows-jdk9] [INFO]           asm-failure\pom.xml .............................. FAILED
(5.1 s)
[windows-jdk9] [INFO]   The post-build script did not succeed. assert build.contains( "com/ibm/icu/icu4j/2.6.1/icu4j-2.6.1.jar:
ignoring class" )
[windows-jdk9]        |     |
[windows-jdk9]        |     false
[windows-jdk9]        Picked up JAVA_TOOL_OPTIONS: -Dmaven.ext.class.path="f:\jenkins\jenkins-slave\workspace\x_maven-plugin-tools_master-XKS4EHY3PSXHGP4DHIXUDAAM6TMAKT3YNFP2XDSSXFM24ZMKWIXQ@tmp\withMaven7caf9c09\pipeline-maven-spy.jar"
-Dorg.jenkinsci.plugins.pipeline.maven.reportsFolder="f:\jenkins\jenkins-slave\workspace\x_maven-plugin-tools_master-XKS4EHY3PSXHGP4DHIXUDAAM6TMAKT3YNFP2XDSSXFM24ZMKWIXQ@tmp\withMaven7caf9c09"

[windows-jdk9]        [INFO] [jenkins-event-spy] Jenkins Maven Event Spy is disabled
[windows-jdk9]        [INFO] Scanning for projects...
[windows-jdk9]        [INFO] 
[windows-jdk9]        [INFO] ------------------------------------------------------------------------
[windows-jdk9]        [INFO] Building MPLUGIN-328 ignore ASM failures when reading .class
1.0-SNAPSHOT
[windows-jdk9]        [INFO] ------------------------------------------------------------------------
[windows-jdk9]        [INFO] Downloading: file:///f:/jenkins/jenkins-slave/workspace/x_maven-plugin-tools_master-XKS4EHY3PSXHGP4DHIXUDAAM6TMAKT3YNFP2XDSSXFM24ZMKWIXQ/.repository/org/apache/maven/maven-plugin-api/3.0/maven-plugin-api-3.0.pom
[windows-jdk9]        [INFO] Downloaded: file:///f:/jenkins/jenkins-slave/workspace/x_maven-plugin-tools_master-XKS4EHY3PSXHGP4DHIXUDAAM6TMAKT3YNFP2XDSSXFM24ZMKWIXQ/.repository/org/apache/maven/maven-plugin-api/3.0/maven-plugin-api-3.0.pom
(2.3 kB at 38 kB/s)
[windows-jdk9]        [INFO] Downloading: file:///f:/jenkins/jenkins-slave/workspace/x_maven-plugin-tools_master-XKS4EHY3PSXHGP4DHIXUDAAM6TMAKT3YNFP2XDSSXFM24ZMKWIXQ/.repository/org/apache/maven/maven-model/3.0/maven-model-3.0.pom
[windows-jdk9]        [INFO] Downloaded: file:///f:/jenkins/jenkins-slave/workspace/x_maven-plugin-tools_master-XKS4EHY3PSXHGP4DHIXUDAAM6TMAKT3YNFP2XDSSXFM24ZMKWIXQ/.repository/org/apache/maven/maven-model/3.0/maven-model-3.0.pom
(3.9 kB at 324 kB/s)
[windows-jdk9]        [INFO] Downloading: file:///f:/jenkins/jenkins-slave/workspace/x_maven-plugin-tools_master-XKS4EHY3PSXHGP4DHIXUDAAM6TMAKT3YNFP2XDSSXFM24ZMKWIXQ/.repository/org/sonatype/sisu/sisu-inject-plexus/1.4.2/sisu-inject-plexus-1.4.2.pom
[windows-jdk9]        [INFO] Downloaded: file:///f:/jenkins/jenkins-slave/workspace/x_maven-plugin-tools_master-XKS4EHY3PSXHGP4DHIXUDAAM6TMAKT3YNFP2XDSSXFM24ZMKWIXQ/.repository/org/sonatype/sisu/sisu-inject-plexus/1.4.2/sisu-inject-plexus-1.4.2.pom
(5.4 kB at 671 kB/s)
[windows-jdk9]        [INFO] Downloading: file:///f:/jenkins/jenkins-slave/workspace/x_maven-plugin-tools_master-XKS4EHY3PSXHGP4DHIXUDAAM6TMAKT3YNFP2XDSSXFM24ZMKWIXQ/.repository/org/sonatype/sisu/inject/guice-plexus/1.4.2/guice-plexus-1.4.2.pom
[windows-jdk9]        [INFO] Downloaded: file:///f:/jenkins/jenkins-slave/workspace/x_maven-plugin-tools_master-XKS4EHY3PSXHGP4DHIXUDAAM6TMAKT3YNFP2XDSSXFM24ZMKWIXQ/.repository/org/sonatype/sisu/inject/guice-plexus/1.4.2/guice-plexus-1.4.2.pom
(3.1 kB at 284 kB/s)
[windows-jdk9]        [INFO] Downloading: file:///f:/jenkins/jenkins-slave/workspace/x_maven-plugin-tools_master-XKS4EHY3PSXHGP4DHIXUDAAM6TMAKT3YNFP2XDSSXFM24ZMKWIXQ/.repository/org/sonatype/sisu/inject/guice-bean/1.4.2/guice-bean-1.4.2.pom
[windows-jdk9]        [INFO] Downloaded: file:///f:/jenkins/jenkins-slave/workspace/x_maven-plugin-tools_master-XKS4EHY3PSXHGP4DHIXUDAAM6TMAKT3YNFP2XDSSXFM24ZMKWIXQ/.repository/org/sonatype/sisu/inject/guice-bean/1.4.2/guice-bean-1.4.2.pom
(2.6 kB at 217 kB/s)
[windows-jdk9]        [INFO] Downloading: file:///f:/jenkins/jenkins-slave/workspace/x_maven-plugin-tools_master-XKS4EHY3PSXHGP4DHIXUDAAM6TMAKT3YNFP2XDSSXFM24ZMKWIXQ/.repository/org/sonatype/sisu/sisu-inject/1.4.2/sisu-inject-1.4.2.pom
[windows-jdk9]        [INFO] Downloaded: file:///f:/jenkins/jenkins-slave/workspace/x_maven-plugin-tools_master-XKS4EHY3PSXHGP4DHIXUDAAM6TMAKT3YNFP2XDSSXFM24ZMKWIXQ/.repository/org/sonatype/sisu/sisu-inject/1.4.2/sisu-inject-1.4.2.pom
(1.2 kB at 208 kB/s)
[windows-jdk9]        [INFO] Downloading: file:///f:/jenkins/jenkins-slave/workspace/x_maven-plugin-tools_master-XKS4EHY3PSXHGP4DHIXUDAAM6TMAKT3YNFP2XDSSXFM24ZMKWIXQ/.repository/org/sonatype/sisu/sisu-parent/1.4.2/sisu-parent-1.4.2.pom
[windows-jdk9]        [INFO] Downloaded: file:///f:/jenkins/jenkins-slave/workspace/x_maven-plugin-tools_master-XKS4EHY3PSXHGP4DHIXUDAAM6TMAKT3YNFP2XDSSXFM24ZMKWIXQ/.repository/org/sonatype/sisu/sisu-parent/1.4.2/sisu-parent-1.4.2.pom
(7.8 kB at 707 kB/s)
[windows-jdk9]        [INFO] Downloading: file:///f:/jenkins/jenkins-slave/workspace/x_maven-plugin-tools_master-XKS4EHY3PSXHGP4DHIXUDAAM6TMAKT3YNFP2XDSSXFM24ZMKWIXQ/.repository/org/sonatype/forge/forge-parent/6/forge-parent-6.pom
[windows-jdk9]        [INFO] Downloaded: file:///f:/jenkins/jenkins-slave/workspace/x_maven-plugin-tools_master-XKS4EHY3PSXHGP4DHIXUDAAM6TMAKT3YNFP2XDSSXFM24ZMKWIXQ/.repository/org/sonatype/forge/forge-parent/6/forge-parent-6.pom
(11 kB at 1.1 MB/s)
[windows-jdk9]        [INFO] Downloading: file:///f:/jenkins/jenkins-slave/workspace/x_maven-plugin-tools_master-XKS4EHY3PSXHGP4DHIXUDAAM6TMAKT3YNFP2XDSSXFM24ZMKWIXQ/.repository/org/codehaus/plexus/plexus-component-annotations/1.5.4/plexus-component-annotations-1.5.4.pom
[windows-jdk9]        [INFO] Downloading: https://repo.maven.apache.org/maven2/org/codehaus/plexus/plexus-component-annotations/1.5.4/plexus-component-annotations-1.5.4.pom
[windows-jdk9]        [INFO] Downloaded: https://repo.maven.apache.org/maven2/org/codehaus/plexus/plexus-component-annotations/1.5.4/plexus-component-annotations-1.5.4.pom
(815 B at 4.7 kB/s)
[windows-jdk9]        [INFO] Downloading: file:///f:/jenkins/jenkins-slave/workspace/x_maven-plugin-tools_master-XKS4EHY3PSXHGP4DHIXUDAAM6TMAKT3YNFP2XDSSXFM24ZMKWIXQ/.repository/org/codehaus/plexus/plexus-containers/1.5.4/plexus-containers-1.5.4.pom
[windows-jdk9]        [INFO] Downloading: https://repo.maven.apache.org/maven2/org/codehaus/plexus/plexus-containers/1.5.4/plexus-containers-1.5.4.pom
[windows-jdk9]        [INFO] Downloaded: https://repo.maven.apache.org/maven2/org/codehaus/plexus/plexus-containers/1.5.4/plexus-containers-1.5.4.pom
(4.2 kB at 249 kB/s)
[windows-jdk9]        [INFO] Downloading: file:///f:/jenkins/jenkins-slave/workspace/x_maven-plugin-tools_master-XKS4EHY3PSXHGP4DHIXUDAAM6TMAKT3YNFP2XDSSXFM24ZMKWIXQ/.repository/org/codehaus/plexus/plexus/2.0.5/plexus-2.0.5.pom
[windows-jdk9]        [INFO] Downloaded: file:///f:/jenkins/jenkins-slave/workspace/x_maven-plugin-tools_master-XKS4EHY3PSXHGP4DHIXUDAAM6TMAKT3YNFP2XDSSXFM24ZMKWIXQ/.repository/org/codehaus/plexus/plexus/2.0.5/plexus-2.0.5.pom
(17 kB at 1.7 MB/s)
[windows-jdk9]        [INFO] Downloading: file:///f:/jenkins/jenkins-slave/workspace/x_maven-plugin-tools_master-XKS4EHY3PSXHGP4DHIXUDAAM6TMAKT3YNFP2XDSSXFM24ZMKWIXQ/.repository/org/codehaus/plexus/plexus-classworlds/2.2.3/plexus-classworlds-2.2.3.pom
[windows-jdk9]        [INFO] Downloaded: file:///f:/jenkins/jenkins-slave/workspace/x_maven-plugin-tools_master-XKS4EHY3PSXHGP4DHIXUDAAM6TMAKT3YNFP2XDSSXFM24ZMKWIXQ/.repository/org/codehaus/plexus/plexus-classworlds/2.2.3/plexus-classworlds-2.2.3.pom
(4.0 kB at 363 kB/s)
[windows-jdk9]        [INFO] Downloading: file:///f:/jenkins/jenkins-slave/workspace/x_maven-plugin-tools_master-XKS4EHY3PSXHGP4DHIXUDAAM6TMAKT3YNFP2XDSSXFM24ZMKWIXQ/.repository/org/sonatype/sisu/sisu-inject-bean/1.4.2/sisu-inject-bean-1.4.2.pom
[windows-jdk9]        [INFO] Downloaded: file:///f:/jenkins/jenkins-slave/workspace/x_maven-plugin-tools_master-XKS4EHY3PSXHGP4DHIXUDAAM6TMAKT3YNFP2XDSSXFM24ZMKWIXQ/.repository/org/sonatype/sisu/sisu-inject-bean/1.4.2/sisu-inject-bean-1.4.2.pom
(5.5 kB at 546 kB/s)
[windows-jdk9]        [INFO] Downloading: file:///f:/jenkins/jenkins-slave/workspace/x_maven-plugin-tools_master-XKS4EHY3PSXHGP4DHIXUDAAM6TMAKT3YNFP2XDSSXFM24ZMKWIXQ/.repository/org/sonatype/sisu/sisu-guice/2.1.7/sisu-guice-2.1.7.pom
[windows-jdk9]        [INFO] Downloaded: file:///f:/jenkins/jenkins-slave/workspace/x_maven-plugin-tools_master-XKS4EHY3PSXHGP4DHIXUDAAM6TMAKT3YNFP2XDSSXFM24ZMKWIXQ/.repository/org/sonatype/sisu/sisu-guice/2.1.7/sisu-guice-2.1.7.pom
(11 kB at 1.0 MB/s)
[windows-jdk9]        [INFO] Downloading: file:///f:/jenkins/jenkins-slave/workspace/x_maven-plugin-tools_master-XKS4EHY3PSXHGP4DHIXUDAAM6TMAKT3YNFP2XDSSXFM24ZMKWIXQ/.repository/com/ibm/icu/icu4j/2.6.1/icu4j-2.6.1.pom
[windows-jdk9]        [INFO] Downloading: https://repo.maven.apache.org/maven2/com/ibm/icu/icu4j/2.6.1/icu4j-2.6.1.pom
[windows-jdk9]        [INFO] Downloaded: https://repo.maven.apache.org/maven2/com/ibm/icu/icu4j/2.6.1/icu4j-2.6.1.pom
(150 B at 12 kB/s)
[windows-jdk9]        [INFO] Downloading: file:///f:/jenkins/jenkins-slave/workspace/x_maven-plugin-tools_master-XKS4EHY3PSXHGP4DHIXUDAAM6TMAKT3YNFP2XDSSXFM24ZMKWIXQ/.repository/org/apache/maven/maven-artifact/3.0/maven-artifact-3.0.jar
[windows-jdk9]        [INFO] Downloading: file:///f:/jenkins/jenkins-slave/workspace/x_maven-plugin-tools_master-XKS4EHY3PSXHGP4DHIXUDAAM6TMAKT3YNFP2XDSSXFM24ZMKWIXQ/.repository/org/apache/maven/maven-plugin-api/3.0/maven-plugin-api-3.0.jar
[windows-jdk9]        [INFO] Downloading: file:///f:/jenkins/jenkins-slave/workspace/x_maven-plugin-tools_master-XKS4EHY3PSXHGP4DHIXUDAAM6TMAKT3YNFP2XDSSXFM24ZMKWIXQ/.repository/org/sonatype/sisu/sisu-inject-plexus/1.4.2/sisu-inject-plexus-1.4.2.jar
[windows-jdk9]        [INFO] Downloading: file:///f:/jenkins/jenkins-slave/workspace/x_maven-plugin-tools_master-XKS4EHY3PSXHGP4DHIXUDAAM6TMAKT3YNFP2XDSSXFM24ZMKWIXQ/.repository/org/apache/maven/maven-model/3.0/maven-model-3.0.jar
[windows-jdk9]        [INFO] Downloading: file:///f:/jenkins/jenkins-slave/workspace/x_maven-plugin-tools_master-XKS4EHY3PSXHGP4DHIXUDAAM6TMAKT3YNFP2XDSSXFM24ZMKWIXQ/.repository/org/codehaus/plexus/plexus-utils/2.0.4/plexus-utils-2.0.4.jar
[windows-jdk9]        [INFO] Downloaded: file:///f:/jenkins/jenkins-slave/workspace/x_maven-plugin-tools_master-XKS4EHY3PSXHGP4DHIXUDAAM6TMAKT3YNFP2XDSSXFM24ZMKWIXQ/.repository/org/apache/maven/maven-artifact/3.0/maven-artifact-3.0.jar
(52 kB at 2.0 MB/s)
[windows-jdk9]        [INFO] Downloading: file:///f:/jenkins/jenkins-slave/workspace/x_maven-plugin-tools_master-XKS4EHY3PSXHGP4DHIXUDAAM6TMAKT3YNFP2XDSSXFM24ZMKWIXQ/.repository/org/codehaus/plexus/plexus-component-annotations/1.5.4/plexus-component-annotations-1.5.4.jar
[windows-jdk9]        [INFO] Downloading: file:///f:/jenkins/jenkins-slave/workspace/x_maven-plugin-tools_master-XKS4EHY3PSXHGP4DHIXUDAAM6TMAKT3YNFP2XDSSXFM24ZMKWIXQ/.repository/org/codehaus/plexus/plexus-classworlds/2.2.3/plexus-classworlds-2.2.3.jar
[windows-jdk9]        [INFO] Downloaded: file:///f:/jenkins/jenkins-slave/workspace/x_maven-plugin-tools_master-XKS4EHY3PSXHGP4DHIXUDAAM6TMAKT3YNFP2XDSSXFM24ZMKWIXQ/.repository/org/codehaus/plexus/plexus-utils/2.0.4/plexus-utils-2.0.4.jar
(222 kB at 6.7 MB/s)
[windows-jdk9]        [INFO] Downloading: file:///f:/jenkins/jenkins-slave/workspace/x_maven-plugin-tools_master-XKS4EHY3PSXHGP4DHIXUDAAM6TMAKT3YNFP2XDSSXFM24ZMKWIXQ/.repository/org/sonatype/sisu/sisu-inject-bean/1.4.2/sisu-inject-bean-1.4.2.jar
[windows-jdk9]        [INFO] Downloaded: file:///f:/jenkins/jenkins-slave/workspace/x_maven-plugin-tools_master-XKS4EHY3PSXHGP4DHIXUDAAM6TMAKT3YNFP2XDSSXFM24ZMKWIXQ/.repository/org/sonatype/sisu/sisu-inject-plexus/1.4.2/sisu-inject-plexus-1.4.2.jar
(202 kB at 5.5 MB/s)
[windows-jdk9]        [INFO] Downloading: file:///f:/jenkins/jenkins-slave/workspace/x_maven-plugin-tools_master-XKS4EHY3PSXHGP4DHIXUDAAM6TMAKT3YNFP2XDSSXFM24ZMKWIXQ/.repository/org/sonatype/sisu/sisu-guice/2.1.7/sisu-guice-2.1.7-noaop.jar
[windows-jdk9]        [INFO] Downloaded: file:///f:/jenkins/jenkins-slave/workspace/x_maven-plugin-tools_master-XKS4EHY3PSXHGP4DHIXUDAAM6TMAKT3YNFP2XDSSXFM24ZMKWIXQ/.repository/org/apache/maven/maven-model/3.0/maven-model-3.0.jar
(165 kB at 4.1 MB/s)
[windows-jdk9]        [INFO] Downloading: file:///f:/jenkins/jenkins-slave/workspace/x_maven-plugin-tools_master-XKS4EHY3PSXHGP4DHIXUDAAM6TMAKT3YNFP2XDSSXFM24ZMKWIXQ/.repository/com/ibm/icu/icu4j/2.6.1/icu4j-2.6.1.jar
[windows-jdk9]        [INFO] Downloaded: file:///f:/jenkins/jenkins-slave/workspace/x_maven-plugin-tools_master-XKS4EHY3PSXHGP4DHIXUDAAM6TMAKT3YNFP2XDSSXFM24ZMKWIXQ/.repository/org/sonatype/sisu/sisu-inject-bean/1.4.2/sisu-inject-bean-1.4.2.jar
(153 kB at 3.3 MB/s)
[windows-jdk9]        [INFO] Downloaded: file:///f:/jenkins/jenkins-slave/workspace/x_maven-plugin-tools_master-XKS4EHY3PSXHGP4DHIXUDAAM6TMAKT3YNFP2XDSSXFM24ZMKWIXQ/.repository/org/sonatype/sisu/sisu-guice/2.1.7/sisu-guice-2.1.7-noaop.jar
(472 kB at 8.4 MB/s)
[windows-jdk9]        [INFO] Downloaded: file:///f:/jenkins/jenkins-slave/workspace/x_maven-plugin-tools_master-XKS4EHY3PSXHGP4DHIXUDAAM6TMAKT3YNFP2XDSSXFM24ZMKWIXQ/.repository/org/apache/maven/maven-plugin-api/3.0/maven-plugin-api-3.0.jar
(49 kB at 324 kB/s)
[windows-jdk9]        [INFO] Downloaded: file:///f:/jenkins/jenkins-slave/workspace/x_maven-plugin-tools_master-XKS4EHY3PSXHGP4DHIXUDAAM6TMAKT3YNFP2XDSSXFM24ZMKWIXQ/.repository/org/codehaus/plexus/plexus-classworlds/2.2.3/plexus-classworlds-2.2.3.jar
(46 kB at 230 kB/s)
[windows-jdk9]        [INFO] Downloading: https://repo.maven.apache.org/maven2/org/codehaus/plexus/plexus-component-annotations/1.5.4/plexus-component-annotations-1.5.4.jar
[windows-jdk9]        [INFO] Downloading: https://repo.maven.apache.org/maven2/com/ibm/icu/icu4j/2.6.1/icu4j-2.6.1.jar
[windows-jdk9]        [INFO] Downloaded: https://repo.maven.apache.org/maven2/org/codehaus/plexus/plexus-component-annotations/1.5.4/plexus-component-annotations-1.5.4.jar
(4.2 kB at 98 kB/s)
[windows-jdk9]        [INFO] Downloaded: https://repo.maven.apache.org/maven2/com/ibm/icu/icu4j/2.6.1/icu4j-2.6.1.jar
(2.5 MB at 17 MB/s)
[windows-jdk9]        [INFO] 
[windows-jdk9]        [INFO] --- maven-resources-plugin:2.6:resources (default-resources)
@ asm-failure ---
[windows-jdk9]        [INFO] Using 'UTF-8' encoding to copy filtered resources.
[windows-jdk9]        [INFO] skip non existing resourceDirectory F:\jenkins\jenkins-slave\workspace\x_maven-plugin-tools_master-XKS4EHY3PSXHGP4DHIXUDAAM6TMAKT3YNFP2XDSSXFM24ZMKWIXQ\m\maven-plugin-plugin\target\it\asm-failure\src\main\resources
[windows-jdk9]        [INFO] 
[windows-jdk9]        [INFO] --- maven-compiler-plugin:3.1:compile (default-compile) @ asm-failure
---
[windows-jdk9]        [INFO] Changes detected - recompiling the module!
[windows-jdk9]        [INFO] Compiling 1 source file to F:\jenkins\jenkins-slave\workspace\x_maven-plugin-tools_master-XKS4EHY3PSXHGP4DHIXUDAAM6TMAKT3YNFP2XDSSXFM24ZMKWIXQ\m\maven-plugin-plugin\target\it\asm-failure\target\classes
[windows-jdk9]        [INFO] 
[windows-jdk9]        [INFO] --- maven-plugin-plugin:3.5.2-SNAPSHOT:descriptor (default-descriptor)
@ asm-failure ---
[windows-jdk9]        [INFO] Using 'UTF-8' encoding to read mojo source files.
[windows-jdk9]        [INFO] java-javadoc mojo extractor found 0 mojo descriptor.
[windows-jdk9]        [WARNING] Error analyzing class com/ibm/icu/impl/data/LocaleElements_zh__PINYIN.class
in F:\jenkins\jenkins-slave\workspace\x_maven-plugin-tools_master-XKS4EHY3PSXHGP4DHIXUDAAM6TMAKT3YNFP2XDSSXFM24ZMKWIXQ\m\maven-plugin-plugin\target\local-repo\com\ibm\icu\icu4j\2.6.1\icu4j-2.6.1.jar:
ignoring class
[windows-jdk9]        [INFO] java-annotations mojo extractor found 1 mojo descriptor.
[windows-jdk9]        [INFO] 
[windows-jdk9]        [INFO] --- maven-resources-plugin:2.6:testResources (default-testResources)
@ asm-failure ---
[windows-jdk9]        [INFO] Using 'UTF-8' encoding to copy filtered resources.
[windows-jdk9]        [INFO] skip non existing resourceDirectory F:\jenkins\jenkins-slave\workspace\x_maven-plugin-tools_master-XKS4EHY3PSXHGP4DHIXUDAAM6TMAKT3YNFP2XDSSXFM24ZMKWIXQ\m\maven-plugin-plugin\target\it\asm-failure\src\test\resources
[windows-jdk9]        [INFO] 
[windows-jdk9]        [INFO] --- maven-compiler-plugin:3.1:testCompile (default-testCompile)
@ asm-failure ---
[windows-jdk9]        [INFO] No sources to compile
[windows-jdk9]        [INFO] 
[windows-jdk9]        [INFO] --- maven-surefire-plugin:2.12.4:test (default-test) @ asm-failure
---
[windows-jdk9]        [INFO] No tests to run.
[windows-jdk9]        [INFO] 
[windows-jdk9]        [INFO] --- maven-jar-plugin:2.4:jar (default-jar) @ asm-failure ---
[windows-jdk9]        [INFO] Building jar: F:\jenkins\jenkins-slave\workspace\x_maven-plugin-tools_master-XKS4EHY3PSXHGP4DHIXUDAAM6TMAKT3YNFP2XDSSXFM24ZMKWIXQ\m\maven-plugin-plugin\target\it\asm-failure\target\asm-failure-1.0-SNAPSHOT.jar
[windows-jdk9]        [INFO] 
[windows-jdk9]        [INFO] --- maven-plugin-plugin:3.5.2-SNAPSHOT:addPluginArtifactMetadata
(default-addPluginArtifactMetadata) @ asm-failure ---
[windows-jdk9]        [INFO] ------------------------------------------------------------------------
[windows-jdk9]        [INFO] BUILD SUCCESS
[windows-jdk9]        [INFO] ------------------------------------------------------------------------
[windows-jdk9]        [INFO] Total time: 3.482 s
[windows-jdk9]        [INFO] Finished at: 2018-05-05T09:06:58Z
[windows-jdk9]        [INFO] Final Memory: 24M/80M
[windows-jdk9]        [INFO] ------------------------------------------------------------------------
[windows-jdk9]        Running post-build script: F:\jenkins\jenkins-slave\workspace\x_maven-plugin-tools_master-XKS4EHY3PSXHGP4DHIXUDAAM6TMAKT3YNFP2XDSSXFM24ZMKWIXQ\m\maven-plugin-plugin\target\it\asm-failure\verify.groovy
[windows-jdk9] [INFO] Building: beanshell-simple\pom.xml
[windows-jdk8] Sending interrupt signal to process
[windows-jdk8] [INFO] run post-build script verify.groovy
[windows-jdk8] [INFO]           annotation-with-inheritance-from-deps\pom.xml .... SUCCESS
(23.1 s)
[windows-jdk8] [INFO] Building: annotation-with-inheritance-reactor\pom.xml
[windows-jdk8] [INFO] run post-build script verify.groovy
[windows-jdk8] [INFO]           annotation-with-inheritance-reactor\pom.xml ...... FAILED
(6.4 s)
[windows-jdk8] [INFO]   The post-build script did not succeed. assert touchFile.isFile()
[windows-jdk8]        |         |
[windows-jdk8]        |         false
[windows-jdk8]        F:\jenkins\jenkins-slave\workspace\x_maven-plugin-tools_master-XKS4EHY3PSXHGP4DHIXUDAAM6TMAKT3YNFP2XDSSXFM24ZMKWIXQ@2\m\maven-plugin-plugin\target\it\annotation-with-inheritance-reactor\module-mojo\target\touch.txt
[windows-jdk8] [INFO] Building: ant-basic\pom.xml
[windows-jdk9] [INFO] run post-build script verify.groovy
[windows-jdk9] [INFO]           beanshell-simple\pom.xml ......................... SUCCESS
(5.9 s)
[windows-jdk9] [INFO] Building: fix-maven-since-3.x\pom.xml
[windows-jdk9] Sending interrupt signal to process
[windows-jdk8] After 10s process did not stop
[Pipeline] [windows-jdk10] // stage
[windows-jdk9] After 10s process did not stop
[Pipeline] [windows-jdk10] }
[Pipeline] [linux-jdk8] }
[Pipeline] [linux-jdk7] }
[Pipeline] [linux-jdk9] }
[Pipeline] [windows-jdk7] }
[Pipeline] [windows-jdk8] }
[Pipeline] [windows-jdk10] // node
[Pipeline] [linux-jdk8] // dir
[Pipeline] [linux-jdk7] // dir
[Pipeline] [linux-jdk9] // dir
[Pipeline] [windows-jdk7] // dir
[Pipeline] [windows-jdk10] }
[Pipeline] [linux-jdk8] }
[linux-jdk8] [withMaven] One or multiple Maven executions have been ignored by the Jenkins
Pipeline Maven Plugin because they have been interrupted before completion (1). See Pipeline
Maven Plugin FAQ for more details.
[Pipeline] [linux-jdk7] }
[linux-jdk7] [withMaven] One or multiple Maven executions have been ignored by the Jenkins
Pipeline Maven Plugin because they have been interrupted before completion (1). See Pipeline
Maven Plugin FAQ for more details.
[Pipeline] [linux-jdk9] }
[linux-jdk9] [withMaven] One or multiple Maven executions have been ignored by the Jenkins
Pipeline Maven Plugin because they have been interrupted before completion (1). See Pipeline
Maven Plugin FAQ for more details.
[Pipeline] [windows-jdk7] }
[windows-jdk7] [withMaven] One or multiple Maven executions have been ignored by the Jenkins
Pipeline Maven Plugin because they have been interrupted before completion (1). See Pipeline
Maven Plugin FAQ for more details.
[Pipeline] [windows-jdk8] // dir
[Pipeline] [windows-jdk8] }
[windows-jdk8] [withMaven] One or multiple Maven executions have been ignored by the Jenkins
Pipeline Maven Plugin because they have been interrupted before completion (1). See Pipeline
Maven Plugin FAQ for more details.
[Pipeline] [windows-jdk9] }
[Pipeline] [linux-jdk8] // withMaven
[Pipeline] [linux-jdk7] // withMaven
[Pipeline] [linux-jdk9] // withMaven
[Pipeline] [windows-jdk7] // withMaven
[Pipeline] [linux-jdk8] echo
[linux-jdk8] [FAIL FAST] linux-jdk10 had first failure, ignoring script returned exit code
143
[Pipeline] [linux-jdk8] }
[Pipeline] [linux-jdk7] echo
[linux-jdk7] [FAIL FAST] linux-jdk10 had first failure, ignoring script returned exit code
143
[Pipeline] [linux-jdk7] }
[Pipeline] [linux-jdk9] echo
[linux-jdk9] [FAIL FAST] linux-jdk10 had first failure, ignoring script returned exit code
143
[Pipeline] [linux-jdk9] }
[Pipeline] [windows-jdk7] echo
[windows-jdk7] [FAIL FAST] linux-jdk10 had first failure, ignoring null
[Pipeline] [windows-jdk7] }
[Pipeline] [windows-jdk8] // withMaven
[Pipeline] [windows-jdk9] // dir
[Pipeline] [windows-jdk8] echo
[windows-jdk8] [FAIL FAST] linux-jdk10 had first failure, ignoring null
[Pipeline] [windows-jdk8] }
[Pipeline] [windows-jdk9] }
[windows-jdk9] [withMaven] One or multiple Maven executions have been ignored by the Jenkins
Pipeline Maven Plugin because they have been interrupted before completion (1). See Pipeline
Maven Plugin FAQ for more details.
[Pipeline] [linux-jdk8] // stage
[Pipeline] [linux-jdk7] // stage
[Pipeline] [linux-jdk9] // stage
[Pipeline] [windows-jdk7] // stage
[Pipeline] [linux-jdk7] }
[Pipeline] [linux-jdk8] }
[Pipeline] [linux-jdk9] }
[Pipeline] [windows-jdk7] }
[Pipeline] [windows-jdk8] // stage
[Pipeline] [windows-jdk9] // withMaven
[Pipeline] [windows-jdk8] }
[Pipeline] [windows-jdk9] echo
[windows-jdk9] [FAIL FAST] linux-jdk10 had first failure, ignoring null
[Pipeline] [windows-jdk9] }
[Pipeline] [linux-jdk7] // node
[Pipeline] [linux-jdk8] // node
[Pipeline] [linux-jdk9] // node
[Pipeline] [windows-jdk7] // node
[Pipeline] [linux-jdk7] }
[Pipeline] [linux-jdk8] }
[Pipeline] [linux-jdk9] }
[Pipeline] [windows-jdk7] }
[Pipeline] [windows-jdk8] // node
[Pipeline] [windows-jdk9] // stage
[Pipeline] [windows-jdk8] }
[Pipeline] [windows-jdk9] }
[Pipeline] [windows-jdk9] // node
[Pipeline] [windows-jdk9] }
[Pipeline] // parallel
[Pipeline] echo
***** FAST FAILURE *****

Fast failure triggered by linux-jdk10

***** FAST FAILURE *****
[Pipeline] stage
[Pipeline] { (Notifications)
[Pipeline] echo
Build result: FAILURE
[Pipeline] jiraIssueSelector
[Pipeline] jiraComment
Mime
  • Unnamed multipart/mixed (inline, None, 0 bytes)
View raw message