maven-notifications mailing list archives

Site index · List index
Message view « Date » · « Thread »
Top « Date » · « Thread »
From Apache Jenkins Server <jenk...@builds.apache.org>
Subject Build failed in Jenkins: Maven TLP » maven-scm » SCM-797 #1
Date Fri, 04 May 2018 22:39:47 GMT
See https://builds.apache.org/job/maven-box/job/maven-scm/job/SCM-797/1/

No changes.

8 tests failed.
FAILED:  org.apache.maven.scm.provider.git.gitexe.command.checkin.GitCheckInCommandNoBranchTest.testCheckinNoBranch

Error Message:
The check out result success flag was false.

Stack Trace:
junit.framework.AssertionFailedError: The check out result success flag was false.
	at org.apache.maven.scm.provider.git.gitexe.command.checkin.GitCheckInCommandNoBranchTest.checkoutRepo(GitCheckInCommandNoBranchTest.java:93)
	at org.apache.maven.scm.provider.git.gitexe.command.checkin.GitCheckInCommandNoBranchTest.testCheckinNoBranch(GitCheckInCommandNoBranchTest.java:79)


FAILED:  org.apache.maven.scm.provider.git.gitexe.command.checkin.GitCheckInCommandNoBranchTest.testCheckinNoBranch

Error Message:
The check out result success flag was false.

Stack Trace:
junit.framework.AssertionFailedError: The check out result success flag was false.
	at org.apache.maven.scm.provider.git.gitexe.command.checkin.GitCheckInCommandNoBranchTest.checkoutRepo(GitCheckInCommandNoBranchTest.java:93)
	at org.apache.maven.scm.provider.git.gitexe.command.checkin.GitCheckInCommandNoBranchTest.testCheckinNoBranch(GitCheckInCommandNoBranchTest.java:79)


FAILED:  org.apache.maven.scm.provider.git.gitexe.command.checkin.GitCheckInCommandNoBranchTest.testCheckinNoBranch

Error Message:
The check out result success flag was false.

Stack Trace:
junit.framework.AssertionFailedError: The check out result success flag was false.
	at org.apache.maven.scm.provider.git.gitexe.command.checkin.GitCheckInCommandNoBranchTest.checkoutRepo(GitCheckInCommandNoBranchTest.java:93)
	at org.apache.maven.scm.provider.git.gitexe.command.checkin.GitCheckInCommandNoBranchTest.testCheckinNoBranch(GitCheckInCommandNoBranchTest.java:79)


FAILED:  org.apache.maven.scm.provider.git.gitexe.command.checkin.GitCheckInCommandNoBranchTest.testCheckinNoBranch

Error Message:
The check out result success flag was false.

Stack Trace:
junit.framework.AssertionFailedError: The check out result success flag was false.
	at org.apache.maven.scm.provider.git.gitexe.command.checkin.GitCheckInCommandNoBranchTest.checkoutRepo(GitCheckInCommandNoBranchTest.java:93)
	at org.apache.maven.scm.provider.git.gitexe.command.checkin.GitCheckInCommandNoBranchTest.testCheckinNoBranch(GitCheckInCommandNoBranchTest.java:79)


FAILED:  org.apache.maven.scm.provider.git.gitexe.command.checkin.GitCheckInCommandTest.testCheckinAfterRename

Error Message:
The check out result success flag was false.

Stack Trace:
junit.framework.AssertionFailedError: The check out result success flag was false.
	at org.apache.maven.scm.provider.git.gitexe.command.checkin.GitCheckInCommandTest.checkoutRepoInto(GitCheckInCommandTest.java:143)
	at org.apache.maven.scm.provider.git.gitexe.command.checkin.GitCheckInCommandTest.testCheckinAfterRename(GitCheckInCommandTest.java:99)


FAILED:  org.apache.maven.scm.provider.git.gitexe.command.checkin.GitCheckInCommandTest.testCheckinAfterRename

Error Message:
The check out result success flag was false.

Stack Trace:
junit.framework.AssertionFailedError: The check out result success flag was false.
	at org.apache.maven.scm.provider.git.gitexe.command.checkin.GitCheckInCommandTest.checkoutRepoInto(GitCheckInCommandTest.java:143)
	at org.apache.maven.scm.provider.git.gitexe.command.checkin.GitCheckInCommandTest.testCheckinAfterRename(GitCheckInCommandTest.java:99)


FAILED:  org.apache.maven.scm.provider.git.gitexe.command.checkin.GitCheckInCommandTest.testCheckinAfterRename

Error Message:
The check out result success flag was false.

Stack Trace:
junit.framework.AssertionFailedError: The check out result success flag was false.
	at org.apache.maven.scm.provider.git.gitexe.command.checkin.GitCheckInCommandTest.checkoutRepoInto(GitCheckInCommandTest.java:143)
	at org.apache.maven.scm.provider.git.gitexe.command.checkin.GitCheckInCommandTest.testCheckinAfterRename(GitCheckInCommandTest.java:99)


FAILED:  org.apache.maven.scm.provider.git.gitexe.command.checkin.GitCheckInCommandTest.testCheckinAfterRename

Error Message:
The check out result success flag was false.

Stack Trace:
junit.framework.AssertionFailedError: The check out result success flag was false.
	at org.apache.maven.scm.provider.git.gitexe.command.checkin.GitCheckInCommandTest.checkoutRepoInto(GitCheckInCommandTest.java:143)
	at org.apache.maven.scm.provider.git.gitexe.command.checkin.GitCheckInCommandTest.testCheckinAfterRename(GitCheckInCommandTest.java:99)




Build log:
[...truncated 3.61 MB...]
[windows-jdk8] [withMaven] junitPublisher - Archive test results for Maven artifact org.apache.maven.scm:maven-scm-provider-cvstest:1.9.6-SNAPSHOT
generated by maven-surefire-plugin:test (default-test): m\maven-scm-providers\maven-scm-providers-cvs\maven-scm-provider-cvstest\target\surefire-reports\*.xml
[windows-jdk8] Recording test results
[windows-jdk8] None of the test reports contained any result
[windows-jdk8] [withMaven] junitPublisher - Archive test results for Maven artifact org.apache.maven.scm:maven-scm-provider-cvs-commons:1.9.6-SNAPSHOT
generated by maven-surefire-plugin:test (default-test): m\maven-scm-providers\maven-scm-providers-cvs\maven-scm-provider-cvs-commons\target\surefire-reports\*.xml
[windows-jdk8] Recording test results
[windows-jdk8] [withMaven] junitPublisher - Archive test results for Maven artifact org.apache.maven.scm:maven-scm-provider-cvsexe:1.9.6-SNAPSHOT
generated by maven-surefire-plugin:test (default-test): m\maven-scm-providers\maven-scm-providers-cvs\maven-scm-provider-cvsexe\target\surefire-reports\*.xml
[windows-jdk8] Recording test results
[windows-jdk8] [withMaven] junitPublisher - Archive test results for Maven artifact org.apache.maven.scm:maven-scm-provider-cvsjava:1.9.6-SNAPSHOT
generated by maven-surefire-plugin:test (default-test): m\maven-scm-providers\maven-scm-providers-cvs\maven-scm-provider-cvsjava\target\surefire-reports\*.xml
[windows-jdk8] Recording test results
[windows-jdk8] [withMaven] junitPublisher - Archive test results for Maven artifact org.apache.maven.scm:maven-scm-provider-hg:1.9.6-SNAPSHOT
generated by maven-surefire-plugin:test (default-test): m\maven-scm-providers\maven-scm-provider-hg\target\surefire-reports\*.xml
[windows-jdk8] Recording test results
[windows-jdk8] [withMaven] junitPublisher - Archive test results for Maven artifact org.apache.maven.scm:maven-scm-provider-git-commons:1.9.6-SNAPSHOT
generated by maven-surefire-plugin:test (default-test): m\maven-scm-providers\maven-scm-providers-git\maven-scm-provider-git-commons\target\surefire-reports\*.xml
[windows-jdk8] Recording test results
[windows-jdk8] [withMaven] junitPublisher - Archive test results for Maven artifact org.apache.maven.scm:maven-scm-provider-gittest:1.9.6-SNAPSHOT
generated by maven-surefire-plugin:test (default-test): m\maven-scm-providers\maven-scm-providers-git\maven-scm-provider-gittest\target\surefire-reports\*.xml
[windows-jdk8] Recording test results
[windows-jdk8] None of the test reports contained any result
[windows-jdk8] [withMaven] junitPublisher - Archive test results for Maven artifact org.apache.maven.scm:maven-scm-provider-gitexe:1.9.6-SNAPSHOT
generated by maven-surefire-plugin:test (default-test): m\maven-scm-providers\maven-scm-providers-git\maven-scm-provider-gitexe\target\surefire-reports\*.xml
[windows-jdk8] Recording test results
[windows-jdk8] [withMaven] junitPublisher - Archive test results for Maven artifact org.apache.maven.scm:maven-scm-provider-jgit:1.9.6-SNAPSHOT
generated by maven-surefire-plugin:test (default-test): m\maven-scm-providers\maven-scm-providers-git\maven-scm-provider-jgit\target\surefire-reports\*.xml
[windows-jdk8] Recording test results
[windows-jdk8] [withMaven] junitPublisher - Archive test results for Maven artifact org.apache.maven.scm:maven-scm-provider-local:1.9.6-SNAPSHOT
generated by maven-surefire-plugin:test (default-test): m\maven-scm-providers\maven-scm-provider-local\target\surefire-reports\*.xml
[windows-jdk8] Recording test results
[windows-jdk8] [withMaven] junitPublisher - Archive test results for Maven artifact org.apache.maven.scm:maven-scm-provider-perforce:1.9.6-SNAPSHOT
generated by maven-surefire-plugin:test (default-test): m\maven-scm-providers\maven-scm-provider-perforce\target\surefire-reports\*.xml
[windows-jdk8] Recording test results
[windows-jdk8] [withMaven] junitPublisher - Archive test results for Maven artifact org.apache.maven.scm:maven-scm-provider-starteam:1.9.6-SNAPSHOT
generated by maven-surefire-plugin:test (default-test): m\maven-scm-providers\maven-scm-provider-starteam\target\surefire-reports\*.xml
[windows-jdk8] Recording test results
[windows-jdk8] [withMaven] junitPublisher - Archive test results for Maven artifact org.apache.maven.scm:maven-scm-provider-svn-commons:1.9.6-SNAPSHOT
generated by maven-surefire-plugin:test (default-test): m\maven-scm-providers\maven-scm-providers-svn\maven-scm-provider-svn-commons\target\surefire-reports\*.xml
[windows-jdk8] Recording test results
[windows-jdk8] [withMaven] junitPublisher - Archive test results for Maven artifact org.apache.maven.scm:maven-scm-provider-svntest:1.9.6-SNAPSHOT
generated by maven-surefire-plugin:test (default-test): m\maven-scm-providers\maven-scm-providers-svn\maven-scm-provider-svntest\target\surefire-reports\*.xml
[windows-jdk8] Recording test results
[windows-jdk8] None of the test reports contained any result
[windows-jdk8] [withMaven] junitPublisher - Archive test results for Maven artifact org.apache.maven.scm:maven-scm-provider-svnexe:1.9.6-SNAPSHOT
generated by maven-surefire-plugin:test (default-test): m\maven-scm-providers\maven-scm-providers-svn\maven-scm-provider-svnexe\target\surefire-reports\*.xml
[windows-jdk8] Recording test results
[windows-jdk8] [withMaven] junitPublisher - Archive test results for Maven artifact org.apache.maven.scm:maven-scm-provider-synergy:1.9.6-SNAPSHOT
generated by maven-surefire-plugin:test (default-test): m\maven-scm-providers\maven-scm-provider-synergy\target\surefire-reports\*.xml
[windows-jdk8] Recording test results
[windows-jdk8] [withMaven] junitPublisher - Archive test results for Maven artifact org.apache.maven.scm:maven-scm-provider-vss:1.9.6-SNAPSHOT
generated by maven-surefire-plugin:test (default-test): m\maven-scm-providers\maven-scm-provider-vss\target\surefire-reports\*.xml
[windows-jdk8] Recording test results
[windows-jdk8] [withMaven] junitPublisher - Archive test results for Maven artifact org.apache.maven.scm:maven-scm-provider-tfs:1.9.6-SNAPSHOT
generated by maven-surefire-plugin:test (default-test): m\maven-scm-providers\maven-scm-provider-tfs\target\surefire-reports\*.xml
[windows-jdk8] Recording test results
[windows-jdk8] [withMaven] junitPublisher - Archive test results for Maven artifact org.apache.maven.scm:maven-scm-provider-integrity:1.9.6-SNAPSHOT
generated by maven-surefire-plugin:test (default-test): m\maven-scm-providers\maven-scm-provider-integrity\target\surefire-reports\*.xml
[windows-jdk8] Recording test results
[windows-jdk8] [withMaven] junitPublisher - Archive test results for Maven artifact org.apache.maven.scm:maven-scm-provider-jazz:1.9.6-SNAPSHOT
generated by maven-surefire-plugin:test (default-test): m\maven-scm-providers\maven-scm-provider-jazz\target\surefire-reports\*.xml
[windows-jdk8] Recording test results
[windows-jdk8] [withMaven] junitPublisher - Archive test results for Maven artifact org.apache.maven.scm:maven-scm-client:1.9.6-SNAPSHOT
generated by maven-surefire-plugin:test (default-test): m\maven-scm-client\target\surefire-reports\*.xml
[windows-jdk8] Recording test results
[windows-jdk8] None of the test reports contained any result
[windows-jdk8] [withMaven] junitPublisher - Archive test results for Maven artifact org.apache.maven.plugins:maven-scm-plugin:1.9.6-SNAPSHOT
generated by maven-surefire-plugin:test (default-test): m\maven-scm-plugin\target\surefire-reports\*.xml
[windows-jdk8] Recording test results
[windows-jdk8] ERROR: [withMaven] junitPublisher - Silently ignore exception archiving JUnit
results for Maven artifact MavenArtifact{org.apache.maven.plugins:maven-scm-plugin::1.9.6-SNAPSHOT(version:
1.9.6-SNAPSHOT, snapshot:false) } generated by PluginInvocation{org.apache.maven.plugins:maven-surefire-plugin:2.19.1@test
 default-test}: java.lang.RuntimeException: Failed to serialize hudson.tasks.junit.TestResult#suites
for class hudson.tasks.junit.TestResult
[windows-jdk8] ERROR: [withMaven] WARNING Exception processing the logs generated by the Jenkins
Maven Event Spy f:\jenkins\jenkins-slave\workspace\maven-box_maven-scm_SCM-797-TSNF7ZXLGM4LUVYJCJU2O25GA4EZKSADD3776FMZEGJH3QG3LZLQ@tmp\withMaven6dd68420\maven-spy-20180504-221652-488980769254938291814.log,
ignore file.  Please report a bug associated for the component 'pipeline-maven-plugin' at
https://issues.jenkins-ci.org 
[windows-jdk8] java.lang.InterruptedException
[windows-jdk8] 	at java.lang.Object.wait(Native Method)
[windows-jdk8] 	at hudson.remoting.Request.call(Request.java:167)
[windows-jdk8] 	at hudson.remoting.Channel.call(Channel.java:907)
[windows-jdk8] 	at hudson.FilePath.act(FilePath.java:986)
[windows-jdk8] 	at hudson.FilePath.act(FilePath.java:975)
[windows-jdk8] 	at hudson.FilePath.exists(FilePath.java:1440)
[windows-jdk8] 	at org.jenkinsci.plugins.pipeline.maven.MavenSpyLogProcessor.processMavenSpyLogs(MavenSpyLogProcessor.java:105)
[windows-jdk8] 	at org.jenkinsci.plugins.pipeline.maven.WithMavenStepExecution$WorkspaceCleanupCallback.finished(WithMavenStepExecution.java:1015)
[windows-jdk8] 	at org.jenkinsci.plugins.workflow.steps.BodyExecutionCallback$TailCall.onSuccess(BodyExecutionCallback.java:114)
[windows-jdk8] 	at org.jenkinsci.plugins.workflow.cps.CpsBodyExecution$SuccessAdapter.receive(CpsBodyExecution.java:368)
[windows-jdk8] 	at com.cloudbees.groovy.cps.Outcome.resumeFrom(Outcome.java:73)
[windows-jdk8] 	at com.cloudbees.groovy.cps.Continuable$1.call(Continuable.java:166)
[windows-jdk8] 	at com.cloudbees.groovy.cps.Continuable$1.call(Continuable.java:163)
[windows-jdk8] 	at org.codehaus.groovy.runtime.GroovyCategorySupport$ThreadCategoryInfo.use(GroovyCategorySupport.java:122)
[windows-jdk8] 	at org.codehaus.groovy.runtime.GroovyCategorySupport.use(GroovyCategorySupport.java:261)
[windows-jdk8] 	at com.cloudbees.groovy.cps.Continuable.run0(Continuable.java:163)
[windows-jdk8] 	at org.jenkinsci.plugins.workflow.cps.SandboxContinuable.access$001(SandboxContinuable.java:19)
[windows-jdk8] 	at org.jenkinsci.plugins.workflow.cps.SandboxContinuable$1.call(SandboxContinuable.java:35)
[windows-jdk8] 	at org.jenkinsci.plugins.workflow.cps.SandboxContinuable$1.call(SandboxContinuable.java:32)
[windows-jdk8] 	at org.jenkinsci.plugins.scriptsecurity.sandbox.groovy.GroovySandbox.runInSandbox(GroovySandbox.java:108)
[windows-jdk8] 	at org.jenkinsci.plugins.workflow.cps.SandboxContinuable.run0(SandboxContinuable.java:32)
[windows-jdk8] 	at org.jenkinsci.plugins.workflow.cps.CpsThread.runNextChunk(CpsThread.java:174)
[windows-jdk8] 	at org.jenkinsci.plugins.workflow.cps.CpsThreadGroup.run(CpsThreadGroup.java:331)
[windows-jdk8] 	at org.jenkinsci.plugins.workflow.cps.CpsThreadGroup.access$200(CpsThreadGroup.java:82)
[windows-jdk8] 	at org.jenkinsci.plugins.workflow.cps.CpsThreadGroup$2.call(CpsThreadGroup.java:243)
[windows-jdk8] 	at org.jenkinsci.plugins.workflow.cps.CpsThreadGroup$2.call(CpsThreadGroup.java:231)
[windows-jdk8] 	at org.jenkinsci.plugins.workflow.cps.CpsVmExecutorService$2.call(CpsVmExecutorService.java:64)
[windows-jdk8] 	at java.util.concurrent.FutureTask.run(FutureTask.java:266)
[windows-jdk8] 	at hudson.remoting.SingleLaneExecutorService$1.run(SingleLaneExecutorService.java:112)
[windows-jdk8] 	at jenkins.util.ContextResettingExecutorService$1.run(ContextResettingExecutorService.java:28)
[windows-jdk8] 	at java.util.concurrent.Executors$RunnableAdapter.call(Executors.java:511)
[windows-jdk8] 	at java.util.concurrent.FutureTask.run(FutureTask.java:266)
[windows-jdk8] 	at java.util.concurrent.ThreadPoolExecutor.runWorker(ThreadPoolExecutor.java:1149)
[windows-jdk8] 	at java.util.concurrent.ThreadPoolExecutor$Worker.run(ThreadPoolExecutor.java:624)
[windows-jdk8] 	at java.lang.Thread.run(Thread.java:748)
[Pipeline] [windows-jdk10] }
[windows-jdk10] [withMaven] junitPublisher - Archive test results for Maven artifact org.apache.maven.scm:maven-scm-api:1.9.6-SNAPSHOT
generated by maven-surefire-plugin:test (default-test): m\maven-scm-api\target\surefire-reports\*.xml
[windows-jdk10] Recording test results
[windows-jdk10] [withMaven] junitPublisher - Archive test results for Maven artifact org.apache.maven.scm:maven-scm-manager-plexus:1.9.6-SNAPSHOT
generated by maven-surefire-plugin:test (default-test): m\maven-scm-managers\maven-scm-manager-plexus\target\surefire-reports\*.xml
[windows-jdk10] Recording test results
[windows-jdk10] None of the test reports contained any result
[windows-jdk10] [withMaven] junitPublisher - Archive test results for Maven artifact org.apache.maven.scm:maven-scm-test:1.9.6-SNAPSHOT
generated by maven-surefire-plugin:test (default-test): m\maven-scm-test\target\surefire-reports\*.xml
[windows-jdk10] Recording test results
[windows-jdk10] [withMaven] junitPublisher - Archive test results for Maven artifact org.apache.maven.scm:maven-scm-provider-accurev:1.9.6-SNAPSHOT
generated by maven-surefire-plugin:test (default-test): m\maven-scm-providers\maven-scm-provider-accurev\target\surefire-reports\*.xml
[windows-jdk10] Recording test results
[windows-jdk10] [withMaven] junitPublisher - Archive test results for Maven artifact org.apache.maven.scm:maven-scm-provider-bazaar:1.9.6-SNAPSHOT
generated by maven-surefire-plugin:test (default-test): m\maven-scm-providers\maven-scm-provider-bazaar\target\surefire-reports\*.xml
[windows-jdk10] Recording test results
[windows-jdk10] [withMaven] junitPublisher - Archive test results for Maven artifact org.apache.maven.scm:maven-scm-provider-clearcase:1.9.6-SNAPSHOT
generated by maven-surefire-plugin:test (default-test): m\maven-scm-providers\maven-scm-provider-clearcase\target\surefire-reports\*.xml
[windows-jdk10] Recording test results
[windows-jdk10] [withMaven] junitPublisher - Archive test results for Maven artifact org.apache.maven.scm:maven-scm-provider-cvstest:1.9.6-SNAPSHOT
generated by maven-surefire-plugin:test (default-test): m\maven-scm-providers\maven-scm-providers-cvs\maven-scm-provider-cvstest\target\surefire-reports\*.xml
[windows-jdk10] Recording test results
[windows-jdk10] None of the test reports contained any result
[windows-jdk10] [withMaven] junitPublisher - Archive test results for Maven artifact org.apache.maven.scm:maven-scm-provider-cvs-commons:1.9.6-SNAPSHOT
generated by maven-surefire-plugin:test (default-test): m\maven-scm-providers\maven-scm-providers-cvs\maven-scm-provider-cvs-commons\target\surefire-reports\*.xml
[windows-jdk10] Recording test results
[windows-jdk10] [withMaven] junitPublisher - Archive test results for Maven artifact org.apache.maven.scm:maven-scm-provider-cvsexe:1.9.6-SNAPSHOT
generated by maven-surefire-plugin:test (default-test): m\maven-scm-providers\maven-scm-providers-cvs\maven-scm-provider-cvsexe\target\surefire-reports\*.xml
[windows-jdk10] Recording test results
[windows-jdk10] [withMaven] junitPublisher - Archive test results for Maven artifact org.apache.maven.scm:maven-scm-provider-cvsjava:1.9.6-SNAPSHOT
generated by maven-surefire-plugin:test (default-test): m\maven-scm-providers\maven-scm-providers-cvs\maven-scm-provider-cvsjava\target\surefire-reports\*.xml
[windows-jdk10] Recording test results
[windows-jdk10] [withMaven] junitPublisher - Archive test results for Maven artifact org.apache.maven.scm:maven-scm-provider-hg:1.9.6-SNAPSHOT
generated by maven-surefire-plugin:test (default-test): m\maven-scm-providers\maven-scm-provider-hg\target\surefire-reports\*.xml
[windows-jdk10] Recording test results
[windows-jdk10] [withMaven] junitPublisher - Archive test results for Maven artifact org.apache.maven.scm:maven-scm-provider-git-commons:1.9.6-SNAPSHOT
generated by maven-surefire-plugin:test (default-test): m\maven-scm-providers\maven-scm-providers-git\maven-scm-provider-git-commons\target\surefire-reports\*.xml
[windows-jdk10] Recording test results
[windows-jdk10] [withMaven] junitPublisher - Archive test results for Maven artifact org.apache.maven.scm:maven-scm-provider-gittest:1.9.6-SNAPSHOT
generated by maven-surefire-plugin:test (default-test): m\maven-scm-providers\maven-scm-providers-git\maven-scm-provider-gittest\target\surefire-reports\*.xml
[windows-jdk10] Recording test results
[windows-jdk10] None of the test reports contained any result
[windows-jdk10] [withMaven] junitPublisher - Archive test results for Maven artifact org.apache.maven.scm:maven-scm-provider-gitexe:1.9.6-SNAPSHOT
generated by maven-surefire-plugin:test (default-test): m\maven-scm-providers\maven-scm-providers-git\maven-scm-provider-gitexe\target\surefire-reports\*.xml
[windows-jdk10] Recording test results
[windows-jdk10] [withMaven] junitPublisher - Archive test results for Maven artifact org.apache.maven.scm:maven-scm-provider-jgit:1.9.6-SNAPSHOT
generated by maven-surefire-plugin:test (default-test): m\maven-scm-providers\maven-scm-providers-git\maven-scm-provider-jgit\target\surefire-reports\*.xml
[windows-jdk10] Recording test results
[windows-jdk10] [withMaven] junitPublisher - Archive test results for Maven artifact org.apache.maven.scm:maven-scm-provider-local:1.9.6-SNAPSHOT
generated by maven-surefire-plugin:test (default-test): m\maven-scm-providers\maven-scm-provider-local\target\surefire-reports\*.xml
[windows-jdk10] Recording test results
[windows-jdk10] [withMaven] junitPublisher - Archive test results for Maven artifact org.apache.maven.scm:maven-scm-provider-perforce:1.9.6-SNAPSHOT
generated by maven-surefire-plugin:test (default-test): m\maven-scm-providers\maven-scm-provider-perforce\target\surefire-reports\*.xml
[windows-jdk10] Recording test results
[windows-jdk10] [withMaven] junitPublisher - Archive test results for Maven artifact org.apache.maven.scm:maven-scm-provider-starteam:1.9.6-SNAPSHOT
generated by maven-surefire-plugin:test (default-test): m\maven-scm-providers\maven-scm-provider-starteam\target\surefire-reports\*.xml
[windows-jdk10] Recording test results
[windows-jdk10] [withMaven] junitPublisher - Archive test results for Maven artifact org.apache.maven.scm:maven-scm-provider-svn-commons:1.9.6-SNAPSHOT
generated by maven-surefire-plugin:test (default-test): m\maven-scm-providers\maven-scm-providers-svn\maven-scm-provider-svn-commons\target\surefire-reports\*.xml
[windows-jdk10] Recording test results
[windows-jdk10] [withMaven] junitPublisher - Archive test results for Maven artifact org.apache.maven.scm:maven-scm-provider-svntest:1.9.6-SNAPSHOT
generated by maven-surefire-plugin:test (default-test): m\maven-scm-providers\maven-scm-providers-svn\maven-scm-provider-svntest\target\surefire-reports\*.xml
[windows-jdk10] Recording test results
[windows-jdk10] None of the test reports contained any result
[windows-jdk10] [withMaven] junitPublisher - Archive test results for Maven artifact org.apache.maven.scm:maven-scm-provider-svnexe:1.9.6-SNAPSHOT
generated by maven-surefire-plugin:test (default-test): m\maven-scm-providers\maven-scm-providers-svn\maven-scm-provider-svnexe\target\surefire-reports\*.xml
[windows-jdk10] Recording test results
[windows-jdk10] [withMaven] junitPublisher - Archive test results for Maven artifact org.apache.maven.scm:maven-scm-provider-synergy:1.9.6-SNAPSHOT
generated by maven-surefire-plugin:test (default-test): m\maven-scm-providers\maven-scm-provider-synergy\target\surefire-reports\*.xml
[windows-jdk10] Recording test results
[windows-jdk10] [withMaven] junitPublisher - Archive test results for Maven artifact org.apache.maven.scm:maven-scm-provider-vss:1.9.6-SNAPSHOT
generated by maven-surefire-plugin:test (default-test): m\maven-scm-providers\maven-scm-provider-vss\target\surefire-reports\*.xml
[windows-jdk10] Recording test results
[windows-jdk10] [withMaven] junitPublisher - Archive test results for Maven artifact org.apache.maven.scm:maven-scm-provider-tfs:1.9.6-SNAPSHOT
generated by maven-surefire-plugin:test (default-test): m\maven-scm-providers\maven-scm-provider-tfs\target\surefire-reports\*.xml
[windows-jdk10] Recording test results
[windows-jdk10] [withMaven] junitPublisher - Archive test results for Maven artifact org.apache.maven.scm:maven-scm-provider-integrity:1.9.6-SNAPSHOT
generated by maven-surefire-plugin:test (default-test): m\maven-scm-providers\maven-scm-provider-integrity\target\surefire-reports\*.xml
[windows-jdk10] Recording test results
[windows-jdk10] [withMaven] junitPublisher - Archive test results for Maven artifact org.apache.maven.scm:maven-scm-provider-jazz:1.9.6-SNAPSHOT
generated by maven-surefire-plugin:test (default-test): m\maven-scm-providers\maven-scm-provider-jazz\target\surefire-reports\*.xml
[windows-jdk10] Recording test results
[windows-jdk10] [withMaven] junitPublisher - Archive test results for Maven artifact org.apache.maven.scm:maven-scm-client:1.9.6-SNAPSHOT
generated by maven-surefire-plugin:test (default-test): m\maven-scm-client\target\surefire-reports\*.xml
[windows-jdk10] Recording test results
[windows-jdk10] None of the test reports contained any result
[Pipeline] [windows-jdk7] // node
[Pipeline] [windows-jdk9] // withMaven
[Pipeline] [windows-jdk8] // withMaven
[Pipeline] [linux-jdk7] {
[Pipeline] [linux-jdk8] {
[Pipeline] [windows-jdk10] // withMaven
[Pipeline] [windows-jdk7] }
[Pipeline] [windows-jdk9] }
[Pipeline] [windows-jdk8] }
[Pipeline] [windows-jdk10] echo
[windows-jdk10] [FAIL FAST] This is the first failure and likely root cause
[Pipeline] [windows-jdk10] }
[Pipeline] [linux-jdk7] stage
[Pipeline] [linux-jdk7] { (Checkout linux-jdk7)
[Pipeline] [linux-jdk8] stage
[Pipeline] [linux-jdk8] { (Checkout linux-jdk8)
[Pipeline] [linux-jdk7] dir
[linux-jdk7] Running in /home/jenkins/jenkins-slave/workspace/maven-box_maven-scm_SCM-797-TSNF7ZXLGM4LUVYJCJU2O25GA4EZKSADD3776FMZEGJH3QG3LZLQ/m
[Pipeline] [linux-jdk7] {
[Pipeline] [linux-jdk8] dir
[linux-jdk8] Running in /home/jenkins/jenkins-slave/workspace/maven-box_maven-scm_SCM-797-TSNF7ZXLGM4LUVYJCJU2O25GA4EZKSADD3776FMZEGJH3QG3LZLQ/m
[Pipeline] [linux-jdk8] {
[Pipeline] [linux-jdk7] checkout
[Pipeline] [linux-jdk8] checkout
[Pipeline] [windows-jdk9] // stage
[linux-jdk7] Cloning the remote Git repository
[linux-jdk7] Cloning with configured refspecs honoured and without tags
[Pipeline] [windows-jdk8] // stage
[linux-jdk7] Cloning repository https://gitbox.apache.org/repos/asf/maven-scm.git
[linux-jdk7]  > git init /home/jenkins/jenkins-slave/workspace/maven-box_maven-scm_SCM-797-TSNF7ZXLGM4LUVYJCJU2O25GA4EZKSADD3776FMZEGJH3QG3LZLQ/m
# timeout=10
[linux-jdk7] Fetching upstream changes from https://gitbox.apache.org/repos/asf/maven-scm.git
[linux-jdk7]  > git --version # timeout=10
[linux-jdk7]  > git fetch --no-tags --progress https://gitbox.apache.org/repos/asf/maven-scm.git
+refs/heads/*:refs/remotes/origin/*
[Pipeline] [windows-jdk10] // stage
[Pipeline] [windows-jdk8] }
[Pipeline] [windows-jdk9] }
[Pipeline] [windows-jdk10] }
[Pipeline] [windows-jdk8] // node
[linux-jdk7]  > git config remote.origin.url https://gitbox.apache.org/repos/asf/maven-scm.git
# timeout=10
[linux-jdk7]  > git config --add remote.origin.fetch +refs/heads/*:refs/remotes/origin/*
# timeout=10
[linux-jdk8] Cloning the remote Git repository
[linux-jdk8] Cloning with configured refspecs honoured and without tags
[Pipeline] [windows-jdk9] // node
[Pipeline] [windows-jdk10] // node
[linux-jdk7]  > git config remote.origin.url https://gitbox.apache.org/repos/asf/maven-scm.git
# timeout=10
[linux-jdk7] Fetching without tags
[linux-jdk7] Fetching upstream changes from https://gitbox.apache.org/repos/asf/maven-scm.git
[linux-jdk7]  > git fetch --no-tags --progress https://gitbox.apache.org/repos/asf/maven-scm.git
+refs/heads/*:refs/remotes/origin/*
[Pipeline] [windows-jdk8] }
[Pipeline] [windows-jdk9] }
[Pipeline] [windows-jdk10] }
[linux-jdk7] Checking out Revision 6545613312f66be2f3155cab77ccc7d910e7d791 (SCM-797)
[windows-jdk10] Failed in branch windows-jdk10
[linux-jdk7]  > git config core.sparsecheckout # timeout=10
[linux-jdk7]  > git checkout -f 6545613312f66be2f3155cab77ccc7d910e7d791
[Pipeline] [linux-jdk9] // node
[Pipeline] [linux-jdk10] // node
[Pipeline] [linux-jdk9] }
[linux-jdk9] Failed in branch linux-jdk9
[Pipeline] [linux-jdk10] }
[linux-jdk10] Failed in branch linux-jdk10
[Pipeline] [linux-jdk7] }
[Pipeline] [linux-jdk8] }
[Pipeline] [linux-jdk7] // dir
[Pipeline] [linux-jdk8] // dir
[Pipeline] [linux-jdk7] echo
[linux-jdk7] [FAIL FAST] windows-jdk10 had first failure, ignoring null
[Pipeline] [linux-jdk7] }
[Pipeline] [linux-jdk8] echo
[linux-jdk8] [FAIL FAST] windows-jdk10 had first failure, ignoring null
[Pipeline] [linux-jdk8] }
[Pipeline] [linux-jdk7] // stage
[Pipeline] [linux-jdk8] // stage
[Pipeline] [linux-jdk7] stage
[Pipeline] [linux-jdk7] { (Build linux-jdk7)
[Pipeline] [linux-jdk8] stage
[Pipeline] [linux-jdk8] { (Build linux-jdk8)
[Pipeline] [linux-jdk7] echo
[linux-jdk7] [FAIL FAST] windows-jdk10 has failed. Skipping linux-jdk7.
[Pipeline] [linux-jdk7] }
[Pipeline] [linux-jdk8] echo
[linux-jdk8] [FAIL FAST] windows-jdk10 has failed. Skipping linux-jdk8.
[Pipeline] [linux-jdk8] }
[Pipeline] [linux-jdk7] // stage
[Pipeline] [linux-jdk8] // stage
[Pipeline] [linux-jdk7] }
[Pipeline] [linux-jdk8] }
[Pipeline] [linux-jdk7] // node
[Pipeline] [linux-jdk8] // node
[Pipeline] [linux-jdk7] }
[Pipeline] [linux-jdk8] }
[Pipeline] // parallel
[Pipeline] echo
***** FAST FAILURE *****

Fast failure triggered by windows-jdk10

***** FAST FAILURE *****
[Pipeline] stage
[Pipeline] { (Notifications)
[Pipeline] echo
Build result: FAILURE
[Pipeline] jiraIssueSelector
Mime
  • Unnamed multipart/mixed (inline, None, 0 bytes)
View raw message