maven-notifications mailing list archives

Site index · List index
Message view « Date » · « Thread »
Top « Date » · « Thread »
From Apache Jenkins Server <jenk...@builds.apache.org>
Subject Build failed in Jenkins: Maven TLP » maven-toolchains-plugin » master #8
Date Tue, 08 May 2018 19:30:37 GMT
See https://builds.apache.org/job/maven-box/job/maven-toolchains-plugin/job/master/8/

Changes:

* Add Java 11-ea
* auto deploy if we are currently on master branch
* revert as it seems to fail on jenkins asf
* revert this one as well
* [MTOOLCHAINS-23] Require Java 7
* [MTOOLCHAINS-23] Require Java 7
* [MTOOLCHAINS-23] Require Java 7
* [MTOOLCHAINS-23] Require Java 7

No tests ran.

Build log:
[...truncated 1.02 MB...]
[windows-jdk8] [INFO] Downloading: https://repo.maven.apache.org/maven2/org/apache/maven/doxia/doxia-tools/3/doxia-tools-3.pom
[windows-jdk8] [INFO] Downloaded: https://repo.maven.apache.org/maven2/org/apache/maven/doxia/doxia-tools/3/doxia-tools-3.pom
(9.9 kB at 764 kB/s)
[windows-jdk8] [INFO] Downloading: https://repo.maven.apache.org/maven2/org/codehaus/plexus/plexus-resources/1.1.0/plexus-resources-1.1.0.pom
[windows-jdk8] [INFO] Downloaded: https://repo.maven.apache.org/maven2/org/codehaus/plexus/plexus-resources/1.1.0/plexus-resources-1.1.0.pom
(3.2 kB at 454 kB/s)
[windows-jdk8] [INFO] Downloading: https://repo.maven.apache.org/maven2/com/puppycrawl/tools/checkstyle/6.18/checkstyle-6.18.pom
[windows-jdk8] [INFO] Downloaded: https://repo.maven.apache.org/maven2/com/puppycrawl/tools/checkstyle/6.18/checkstyle-6.18.pom
(71 kB at 3.6 MB/s)
[windows-jdk8] [INFO] Downloading: https://repo.maven.apache.org/maven2/antlr/antlr/2.7.7/antlr-2.7.7.pom
[windows-jdk8] [INFO] Downloaded: https://repo.maven.apache.org/maven2/antlr/antlr/2.7.7/antlr-2.7.7.pom
(632 B at 45 kB/s)
[windows-jdk8] [INFO] Downloading: https://repo.maven.apache.org/maven2/org/antlr/antlr4-runtime/4.5.3/antlr4-runtime-4.5.3.pom
[windows-jdk8] [INFO] Downloaded: https://repo.maven.apache.org/maven2/org/antlr/antlr4-runtime/4.5.3/antlr4-runtime-4.5.3.pom
(2.3 kB at 330 kB/s)
[windows-jdk8] [INFO] Downloading: https://repo.maven.apache.org/maven2/org/antlr/antlr4-master/4.5.3/antlr4-master-4.5.3.pom
[windows-jdk8] [INFO] Downloaded: https://repo.maven.apache.org/maven2/org/antlr/antlr4-master/4.5.3/antlr4-master-4.5.3.pom
(3.7 kB at 460 kB/s)
[windows-jdk8] [INFO] Downloading: https://repo.maven.apache.org/maven2/commons-beanutils/commons-beanutils/1.9.2/commons-beanutils-1.9.2.pom
[windows-jdk8] [INFO] Downloaded: https://repo.maven.apache.org/maven2/commons-beanutils/commons-beanutils/1.9.2/commons-beanutils-1.9.2.pom
(14 kB at 1.4 MB/s)
[windows-jdk8] [INFO] Downloading: https://repo.maven.apache.org/maven2/org/apache/commons/commons-parent/33/commons-parent-33.pom
[windows-jdk8] [INFO] Downloaded: https://repo.maven.apache.org/maven2/org/apache/commons/commons-parent/33/commons-parent-33.pom
(53 kB at 3.3 MB/s)
[windows-jdk8] [INFO] Downloading: https://repo.maven.apache.org/maven2/commons-cli/commons-cli/1.3.1/commons-cli-1.3.1.pom
[windows-jdk8] [INFO] Downloaded: https://repo.maven.apache.org/maven2/commons-cli/commons-cli/1.3.1/commons-cli-1.3.1.pom
(10 kB at 866 kB/s)
[windows-jdk8] [INFO] Downloading: https://repo.maven.apache.org/maven2/com/google/guava/guava/19.0/guava-19.0.pom
[windows-jdk8] [INFO] Downloaded: https://repo.maven.apache.org/maven2/com/google/guava/guava/19.0/guava-19.0.pom
(6.8 kB at 970 kB/s)
[windows-jdk8] [INFO] Downloading: https://repo.maven.apache.org/maven2/com/google/guava/guava-parent/19.0/guava-parent-19.0.pom
[windows-jdk8] [INFO] Downloaded: https://repo.maven.apache.org/maven2/com/google/guava/guava-parent/19.0/guava-parent-19.0.pom
(9.9 kB at 898 kB/s)
[windows-jdk8] [INFO] Downloading: https://repo.maven.apache.org/maven2/org/sonatype/oss/oss-parent/7/oss-parent-7.pom
[windows-jdk8] [INFO] Downloaded: https://repo.maven.apache.org/maven2/org/sonatype/oss/oss-parent/7/oss-parent-7.pom
(4.8 kB at 268 kB/s)
[windows-jdk8] [INFO] Downloading: https://repo.maven.apache.org/maven2/commons-logging/commons-logging/1.0.4/commons-logging-1.0.4.jar
[windows-jdk8] [INFO] Downloading: https://repo.maven.apache.org/maven2/commons-digester/commons-digester/1.6/commons-digester-1.6.jar
[windows-jdk8] [INFO] Downloading: https://repo.maven.apache.org/maven2/org/apache/maven/shared/maven-shared-resources/2/maven-shared-resources-2.jar
[windows-jdk8] [INFO] Downloading: https://repo.maven.apache.org/maven2/org/apache/maven/doxia/doxia-core/1.2/doxia-core-1.2.jar
[windows-jdk8] [INFO] Downloading: https://repo.maven.apache.org/maven2/org/apache/maven/doxia/doxia-integration-tools/1.6/doxia-integration-tools-1.6.jar
[windows-jdk8] [INFO] Downloaded: https://repo.maven.apache.org/maven2/commons-logging/commons-logging/1.0.4/commons-logging-1.0.4.jar
(38 kB at 1.1 MB/s)
[windows-jdk8] [INFO] Downloading: https://repo.maven.apache.org/maven2/commons-io/commons-io/1.4/commons-io-1.4.jar
[windows-jdk8] [INFO] Downloaded: https://repo.maven.apache.org/maven2/commons-digester/commons-digester/1.6/commons-digester-1.6.jar
(168 kB at 3.4 MB/s)
[windows-jdk8] [INFO] Downloading: https://repo.maven.apache.org/maven2/org/codehaus/plexus/plexus-resources/1.1.0/plexus-resources-1.1.0.jar
[windows-jdk8] [INFO] Downloaded: https://repo.maven.apache.org/maven2/commons-io/commons-io/1.4/commons-io-1.4.jar
(109 kB at 1.7 MB/s)
[windows-jdk8] [INFO] Downloading: https://repo.maven.apache.org/maven2/com/puppycrawl/tools/checkstyle/6.18/checkstyle-6.18.jar
[windows-jdk8] [INFO] Downloaded: https://repo.maven.apache.org/maven2/com/puppycrawl/tools/checkstyle/6.18/checkstyle-6.18.jar
(1.2 MB at 9.7 MB/s)
[windows-jdk8] [INFO] Downloading: https://repo.maven.apache.org/maven2/antlr/antlr/2.7.7/antlr-2.7.7.jar
[windows-jdk8] [INFO] Downloaded: https://repo.maven.apache.org/maven2/org/apache/maven/doxia/doxia-core/1.2/doxia-core-1.2.jar
(154 kB at 912 kB/s)
[windows-jdk8] [INFO] Downloading: https://repo.maven.apache.org/maven2/org/antlr/antlr4-runtime/4.5.3/antlr4-runtime-4.5.3.jar
[windows-jdk8] [INFO] Downloaded: https://repo.maven.apache.org/maven2/antlr/antlr/2.7.7/antlr-2.7.7.jar
(445 kB at 2.6 MB/s)
[windows-jdk8] [INFO] Downloading: https://repo.maven.apache.org/maven2/commons-beanutils/commons-beanutils/1.9.2/commons-beanutils-1.9.2.jar
[windows-jdk8] [INFO] Downloaded: https://repo.maven.apache.org/maven2/org/apache/maven/doxia/doxia-integration-tools/1.6/doxia-integration-tools-1.6.jar
(45 kB at 213 kB/s)
[windows-jdk8] [INFO] Downloading: https://repo.maven.apache.org/maven2/commons-cli/commons-cli/1.3.1/commons-cli-1.3.1.jar
[windows-jdk8] [INFO] Downloaded: https://repo.maven.apache.org/maven2/org/codehaus/plexus/plexus-resources/1.1.0/plexus-resources-1.1.0.jar
(23 kB at 105 kB/s)
[windows-jdk8] [INFO] Downloading: https://repo.maven.apache.org/maven2/com/google/guava/guava/19.0/guava-19.0.jar
[windows-jdk8] [INFO] Downloaded: https://repo.maven.apache.org/maven2/org/apache/maven/shared/maven-shared-resources/2/maven-shared-resources-2.jar
(13 kB at 59 kB/s)
[windows-jdk8] [INFO] Downloading: https://repo.maven.apache.org/maven2/commons-lang/commons-lang/2.1/commons-lang-2.1.jar
[windows-jdk8] [INFO] Downloaded: https://repo.maven.apache.org/maven2/commons-cli/commons-cli/1.3.1/commons-cli-1.3.1.jar
(53 kB at 227 kB/s)
[windows-jdk8] [INFO] Downloaded: https://repo.maven.apache.org/maven2/commons-lang/commons-lang/2.1/commons-lang-2.1.jar
(208 kB at 869 kB/s)
[windows-jdk8] [INFO] Downloaded: https://repo.maven.apache.org/maven2/org/antlr/antlr4-runtime/4.5.3/antlr4-runtime-4.5.3.jar
(302 kB at 1.2 MB/s)
[windows-jdk8] [INFO] Downloaded: https://repo.maven.apache.org/maven2/commons-beanutils/commons-beanutils/1.9.2/commons-beanutils-1.9.2.jar
(234 kB at 876 kB/s)
[windows-jdk9] [INFO] Downloading: https://repo.maven.apache.org/maven2/org/antlr/antlr4-runtime/4.5.3/antlr4-runtime-4.5.3.pom
[windows-jdk9] [INFO] Downloaded: https://repo.maven.apache.org/maven2/org/antlr/antlr4-runtime/4.5.3/antlr4-runtime-4.5.3.pom
(2.3 kB at 192 kB/s)
[windows-jdk9] [INFO] Downloading: https://repo.maven.apache.org/maven2/org/antlr/antlr4-master/4.5.3/antlr4-master-4.5.3.pom
[windows-jdk9] [INFO] Downloaded: https://repo.maven.apache.org/maven2/org/antlr/antlr4-master/4.5.3/antlr4-master-4.5.3.pom
(3.7 kB at 263 kB/s)
[windows-jdk9] [INFO] Downloading: https://repo.maven.apache.org/maven2/commons-beanutils/commons-beanutils/1.9.2/commons-beanutils-1.9.2.pom
[windows-jdk9] [INFO] Downloaded: https://repo.maven.apache.org/maven2/commons-beanutils/commons-beanutils/1.9.2/commons-beanutils-1.9.2.pom
(14 kB at 1.1 MB/s)
[windows-jdk9] [INFO] Downloading: https://repo.maven.apache.org/maven2/org/apache/commons/commons-parent/33/commons-parent-33.pom
[windows-jdk9] [INFO] Downloaded: https://repo.maven.apache.org/maven2/org/apache/commons/commons-parent/33/commons-parent-33.pom
(53 kB at 3.8 MB/s)
[windows-jdk9] [INFO] Downloading: https://repo.maven.apache.org/maven2/commons-cli/commons-cli/1.3.1/commons-cli-1.3.1.pom
[windows-jdk9] [INFO] Downloaded: https://repo.maven.apache.org/maven2/commons-cli/commons-cli/1.3.1/commons-cli-1.3.1.pom
(10 kB at 799 kB/s)
[windows-jdk9] [INFO] Downloading: https://repo.maven.apache.org/maven2/com/google/guava/guava/19.0/guava-19.0.pom
[windows-jdk9] [INFO] Downloaded: https://repo.maven.apache.org/maven2/com/google/guava/guava/19.0/guava-19.0.pom
(6.8 kB at 522 kB/s)
[windows-jdk9] [INFO] Downloading: https://repo.maven.apache.org/maven2/com/google/guava/guava-parent/19.0/guava-parent-19.0.pom
[windows-jdk9] [INFO] Downloaded: https://repo.maven.apache.org/maven2/com/google/guava/guava-parent/19.0/guava-parent-19.0.pom
(9.9 kB at 520 kB/s)
[windows-jdk9] [INFO] Downloading: https://repo.maven.apache.org/maven2/org/sonatype/oss/oss-parent/7/oss-parent-7.pom
[windows-jdk9] [INFO] Downloaded: https://repo.maven.apache.org/maven2/org/sonatype/oss/oss-parent/7/oss-parent-7.pom
(4.8 kB at 284 kB/s)
[windows-jdk9] [INFO] Downloading: https://repo.maven.apache.org/maven2/javax/xml/bind/jaxb-api/2.3.0/jaxb-api-2.3.0.pom
[windows-jdk9] [INFO] Downloaded: https://repo.maven.apache.org/maven2/javax/xml/bind/jaxb-api/2.3.0/jaxb-api-2.3.0.pom
(23 kB at 884 kB/s)
[windows-jdk9] [INFO] Downloading: https://repo.maven.apache.org/maven2/javax/xml/bind/jaxb-api-parent/2.3.0/jaxb-api-parent-2.3.0.pom
[windows-jdk9] [INFO] Downloaded: https://repo.maven.apache.org/maven2/javax/xml/bind/jaxb-api-parent/2.3.0/jaxb-api-parent-2.3.0.pom
(5.6 kB at 235 kB/s)
[windows-jdk9] [INFO] Downloading: https://repo.maven.apache.org/maven2/net/java/jvnet-parent/5/jvnet-parent-5.pom
[windows-jdk9] [INFO] Downloaded: https://repo.maven.apache.org/maven2/net/java/jvnet-parent/5/jvnet-parent-5.pom
(8.9 kB at 127 kB/s)
[windows-jdk9] [INFO] Downloading: https://repo.maven.apache.org/maven2/org/apache/maven/doxia/doxia-core/1.2/doxia-core-1.2.jar
[windows-jdk9] [INFO] Downloading: https://repo.maven.apache.org/maven2/org/apache/maven/shared/maven-shared-resources/2/maven-shared-resources-2.jar
[windows-jdk9] [INFO] Downloading: https://repo.maven.apache.org/maven2/org/apache/maven/doxia/doxia-integration-tools/1.6/doxia-integration-tools-1.6.jar
[windows-jdk9] [INFO] Downloading: https://repo.maven.apache.org/maven2/commons-digester/commons-digester/1.6/commons-digester-1.6.jar
[windows-jdk9] [INFO] Downloading: https://repo.maven.apache.org/maven2/commons-logging/commons-logging/1.0.4/commons-logging-1.0.4.jar
[windows-jdk8] [INFO] Downloaded: https://repo.maven.apache.org/maven2/com/google/guava/guava/19.0/guava-19.0.jar
(2.3 MB at 6.2 MB/s)
[windows-jdk9] [INFO] Downloaded: https://repo.maven.apache.org/maven2/org/apache/maven/doxia/doxia-core/1.2/doxia-core-1.2.jar
(154 kB at 1.3 MB/s)
[windows-jdk9] [INFO] Downloading: https://repo.maven.apache.org/maven2/commons-io/commons-io/1.4/commons-io-1.4.jar
[windows-jdk9] [INFO] Downloaded: https://repo.maven.apache.org/maven2/commons-logging/commons-logging/1.0.4/commons-logging-1.0.4.jar
(38 kB at 302 kB/s)
[windows-jdk9] [INFO] Downloading: https://repo.maven.apache.org/maven2/org/codehaus/plexus/plexus-resources/1.1.0/plexus-resources-1.1.0.jar
[windows-jdk9] [INFO] Downloaded: https://repo.maven.apache.org/maven2/commons-io/commons-io/1.4/commons-io-1.4.jar
(109 kB at 808 kB/s)
[windows-jdk9] [INFO] Downloading: https://repo.maven.apache.org/maven2/com/puppycrawl/tools/checkstyle/6.18/checkstyle-6.18.jar
[windows-jdk9] [INFO] Downloaded: https://repo.maven.apache.org/maven2/com/puppycrawl/tools/checkstyle/6.18/checkstyle-6.18.jar
(1.2 MB at 5.8 MB/s)
[windows-jdk9] [INFO] Downloading: https://repo.maven.apache.org/maven2/antlr/antlr/2.7.7/antlr-2.7.7.jar
[windows-jdk9] [INFO] Downloaded: https://repo.maven.apache.org/maven2/antlr/antlr/2.7.7/antlr-2.7.7.jar
(445 kB at 2.0 MB/s)
[windows-jdk9] [INFO] Downloading: https://repo.maven.apache.org/maven2/org/antlr/antlr4-runtime/4.5.3/antlr4-runtime-4.5.3.jar
[windows-jdk9] [INFO] Downloaded: https://repo.maven.apache.org/maven2/org/antlr/antlr4-runtime/4.5.3/antlr4-runtime-4.5.3.jar
(302 kB at 1.2 MB/s)
[windows-jdk9] [INFO] Downloading: https://repo.maven.apache.org/maven2/commons-beanutils/commons-beanutils/1.9.2/commons-beanutils-1.9.2.jar
[windows-jdk9] [INFO] Downloaded: https://repo.maven.apache.org/maven2/org/codehaus/plexus/plexus-resources/1.1.0/plexus-resources-1.1.0.jar
(23 kB at 94 kB/s)
[windows-jdk9] [INFO] Downloading: https://repo.maven.apache.org/maven2/commons-cli/commons-cli/1.3.1/commons-cli-1.3.1.jar
[windows-jdk9] [INFO] Downloaded: https://repo.maven.apache.org/maven2/org/apache/maven/shared/maven-shared-resources/2/maven-shared-resources-2.jar
(13 kB at 53 kB/s)
[windows-jdk9] [INFO] Downloading: https://repo.maven.apache.org/maven2/com/google/guava/guava/19.0/guava-19.0.jar
[windows-jdk9] [INFO] Downloaded: https://repo.maven.apache.org/maven2/commons-cli/commons-cli/1.3.1/commons-cli-1.3.1.jar
(53 kB at 202 kB/s)
[windows-jdk9] [INFO] Downloading: https://repo.maven.apache.org/maven2/commons-lang/commons-lang/2.1/commons-lang-2.1.jar
[windows-jdk9] [INFO] Downloaded: https://repo.maven.apache.org/maven2/commons-lang/commons-lang/2.1/commons-lang-2.1.jar
(208 kB at 761 kB/s)
[windows-jdk9] [INFO] Downloading: https://repo.maven.apache.org/maven2/javax/xml/bind/jaxb-api/2.3.0/jaxb-api-2.3.0.jar
[windows-jdk9] [INFO] Downloaded: https://repo.maven.apache.org/maven2/commons-beanutils/commons-beanutils/1.9.2/commons-beanutils-1.9.2.jar
(234 kB at 818 kB/s)
[windows-jdk9] [INFO] Downloaded: https://repo.maven.apache.org/maven2/commons-digester/commons-digester/1.6/commons-digester-1.6.jar
(168 kB at 577 kB/s)
[windows-jdk9] [INFO] Downloaded: https://repo.maven.apache.org/maven2/com/google/guava/guava/19.0/guava-19.0.jar
(2.3 MB at 7.6 MB/s)
[windows-jdk9] [INFO] Downloaded: https://repo.maven.apache.org/maven2/javax/xml/bind/jaxb-api/2.3.0/jaxb-api-2.3.0.jar
(126 kB at 409 kB/s)
[windows-jdk9] [INFO] Downloaded: https://repo.maven.apache.org/maven2/org/apache/maven/doxia/doxia-integration-tools/1.6/doxia-integration-tools-1.6.jar
(45 kB at 142 kB/s)
[windows-jdk8] [INFO] 
[windows-jdk8] [INFO] --- maven-invoker-plugin:3.0.1:verify (integration-test) @ maven-toolchains-plugin
---
[windows-jdk8] [INFO] -------------------------------------------------
[windows-jdk8] [INFO] Build Summary:
[windows-jdk8] [INFO]   Passed: 3, Failed: 0, Errors: 0, Skipped: 0
[windows-jdk8] [INFO] -------------------------------------------------
[windows-jdk8] [INFO] ------------------------------------------------------------------------
[windows-jdk8] [INFO] BUILD SUCCESS
[windows-jdk8] [INFO] ------------------------------------------------------------------------
[windows-jdk8] [INFO] Total time: 01:20 min
[windows-jdk8] [INFO] Finished at: 2018-05-08T19:04:37Z
[windows-jdk8] [INFO] Final Memory: 49M/803M
[windows-jdk8] [INFO] ------------------------------------------------------------------------
[windows-jdk8] [INFO] [jenkins-event-spy] Generated F:\jenkins\jenkins-slave\workspace\en-toolchains-plugin_master-JSJRH7N7WHA5OITGTMSQVCI6AVNUPHTOLBYXKJXWNGGNGCYHSF5A@tmp\withMavenb433628f\maven-spy-20180508-190316-2466510990666404842230.log
[windows-jdk8] Picked up JAVA_TOOL_OPTIONS: -Dmaven.ext.class.path="f:\jenkins\jenkins-slave\workspace\en-toolchains-plugin_master-JSJRH7N7WHA5OITGTMSQVCI6AVNUPHTOLBYXKJXWNGGNGCYHSF5A@tmp\withMavenb433628f\pipeline-maven-spy.jar"
-Dorg.jenkinsci.plugins.pipeline.maven.reportsFolder="f:\jenkins\jenkins-slave\workspace\en-toolchains-plugin_master-JSJRH7N7WHA5OITGTMSQVCI6AVNUPHTOLBYXKJXWNGGNGCYHSF5A@tmp\withMavenb433628f"

[Pipeline] [windows-jdk8] }
[Pipeline] [windows-jdk8] // dir
[windows-jdk9] [INFO] 
[windows-jdk9] [INFO] --- maven-invoker-plugin:3.0.1:verify (integration-test) @ maven-toolchains-plugin
---
[windows-jdk9] [INFO] -------------------------------------------------
[windows-jdk9] [INFO] Build Summary:
[windows-jdk9] [INFO]   Passed: 3, Failed: 0, Errors: 0, Skipped: 0
[windows-jdk9] [INFO] -------------------------------------------------
[windows-jdk9] [INFO] ------------------------------------------------------------------------
[windows-jdk9] [INFO] BUILD SUCCESS
[windows-jdk9] [INFO] ------------------------------------------------------------------------
[windows-jdk9] [INFO] Total time: 01:18 min
[windows-jdk9] [INFO] Finished at: 2018-05-08T19:04:37Z
[windows-jdk9] [INFO] Final Memory: 47M/156M
[windows-jdk9] [INFO] ------------------------------------------------------------------------
[windows-jdk9] [INFO] [jenkins-event-spy] Generated F:\jenkins\jenkins-slave\workspace\en-toolchains-plugin_master-JSJRH7N7WHA5OITGTMSQVCI6AVNUPHTOLBYXKJXWNGGNGCYHSF5A@2@tmp\withMavenf3a71bac\maven-spy-20180508-190319-744030516166187443411.log
[Pipeline] [windows-jdk8] }
[windows-jdk8] [withMaven] junitPublisher - Archive test results for Maven artifact org.apache.maven.plugins:maven-toolchains-plugin:3.0.0-SNAPSHOT
generated by maven-surefire-plugin:test (default-test): m\target\surefire-reports\*.xml
[windows-jdk8] Recording test results
[windows-jdk8] None of the test reports contained any result
[Pipeline] [windows-jdk8] // withMaven
[Pipeline] [windows-jdk8] }
[Pipeline] [windows-jdk9] }
[Pipeline] [windows-jdk8] // stage
[Pipeline] [windows-jdk9] // dir
[Pipeline] [windows-jdk8] }
[Pipeline] [windows-jdk9] }
[windows-jdk9] [withMaven] junitPublisher - Archive test results for Maven artifact org.apache.maven.plugins:maven-toolchains-plugin:3.0.0-SNAPSHOT
generated by maven-surefire-plugin:test (default-test): m\target\surefire-reports\*.xml
[windows-jdk9] Recording test results
[windows-jdk9] None of the test reports contained any result
[Pipeline] [windows-jdk8] // node
[Pipeline] [windows-jdk9] // withMaven
[Pipeline] [windows-jdk8] }
[Pipeline] [windows-jdk9] }
[Pipeline] [windows-jdk9] // stage
[Pipeline] [windows-jdk9] }
[Pipeline] [windows-jdk9] // node
[Pipeline] [windows-jdk9] }
[linux-jdk7] Running on H26 in /home/jenkins/jenkins-slave/workspace/en-toolchains-plugin_master-JSJRH7N7WHA5OITGTMSQVCI6AVNUPHTOLBYXKJXWNGGNGCYHSF5A
[Pipeline] [linux-jdk7] {
[Pipeline] [linux-jdk7] stage
[Pipeline] [linux-jdk7] { (Checkout linux-jdk7)
[Pipeline] [linux-jdk7] dir
[linux-jdk7] Running in /home/jenkins/jenkins-slave/workspace/en-toolchains-plugin_master-JSJRH7N7WHA5OITGTMSQVCI6AVNUPHTOLBYXKJXWNGGNGCYHSF5A/m
[Pipeline] [linux-jdk7] {
[Pipeline] [linux-jdk7] checkout
[linux-jdk7] Cloning the remote Git repository
[linux-jdk7] Cloning with configured refspecs honoured and without tags
[linux-jdk7] Cloning repository https://gitbox.apache.org/repos/asf/maven-toolchains-plugin.git
[linux-jdk7]  > git init /home/jenkins/jenkins-slave/workspace/en-toolchains-plugin_master-JSJRH7N7WHA5OITGTMSQVCI6AVNUPHTOLBYXKJXWNGGNGCYHSF5A/m
# timeout=10
[linux-jdk7] Fetching upstream changes from https://gitbox.apache.org/repos/asf/maven-toolchains-plugin.git
[linux-jdk7]  > git --version # timeout=10
[linux-jdk7]  > git fetch --no-tags --progress https://gitbox.apache.org/repos/asf/maven-toolchains-plugin.git
+refs/heads/*:refs/remotes/origin/*
[linux-jdk7]  > git config remote.origin.url https://gitbox.apache.org/repos/asf/maven-toolchains-plugin.git
# timeout=10
[linux-jdk7]  > git config --add remote.origin.fetch +refs/heads/*:refs/remotes/origin/*
# timeout=10
[linux-jdk7]  > git config remote.origin.url https://gitbox.apache.org/repos/asf/maven-toolchains-plugin.git
# timeout=10
[linux-jdk7] Fetching without tags
[linux-jdk7] Fetching upstream changes from https://gitbox.apache.org/repos/asf/maven-toolchains-plugin.git
[linux-jdk7]  > git fetch --no-tags --progress https://gitbox.apache.org/repos/asf/maven-toolchains-plugin.git
+refs/heads/*:refs/remotes/origin/*
[linux-jdk7] Checking out Revision 3b3c2f6f5e829f3fc7f638fcfd09589b941a0626 (master)
[linux-jdk7]  > git config core.sparsecheckout # timeout=10
[linux-jdk7]  > git checkout -f 3b3c2f6f5e829f3fc7f638fcfd09589b941a0626
[linux-jdk7] Commit message: "[MTOOLCHAINS-23] Require Java 7"
[linux-jdk7] Cleaning workspace
[linux-jdk7]  > git rev-parse --verify HEAD # timeout=10
[linux-jdk7] Resetting working tree
[linux-jdk7]  > git reset --hard # timeout=10
[linux-jdk7]  > git clean -fdx # timeout=10
[Pipeline] [linux-jdk7] }
[Pipeline] [linux-jdk7] // dir
[Pipeline] [linux-jdk7] }
[Pipeline] [linux-jdk7] // stage
[Pipeline] [linux-jdk7] stage
[Pipeline] [linux-jdk7] { (Build linux-jdk7)
[Pipeline] [linux-jdk7] withMaven
[linux-jdk7] [withMaven] Options: [org.jenkinsci.plugins.pipeline.maven.publishers.GeneratedArtifactsPublisher[disabled=false],
org.jenkinsci.plugins.pipeline.maven.publishers.JunitTestsPublisher[disabled=false], org.jenkinsci.plugins.pipeline.maven.publishers.FindbugsAnalysisPublisher[disabled=false],
org.jenkinsci.plugins.pipeline.maven.publishers.TasksScannerPublisher[disabled=false], org.jenkinsci.plugins.pipeline.maven.publishers.DependenciesFingerprintPublisher[disabled=false,
scopes=[compile, provided, runtime], versions={snapshot:true, release:false}], org.jenkinsci.plugins.pipeline.maven.publishers.InvokerRunsPublisher[disabled=false],
org.jenkinsci.plugins.pipeline.maven.publishers.PipelineGraphPublisher[disabled=false, scopes=[compile,
provided, runtime], versions={snapshot:true, release:false}, skipDownstreamTriggers=false,
lifecycleThreshold=deploy, ignoreUpstreamTriggers=false]]
[linux-jdk7] [withMaven] Available options: 
[linux-jdk7] [withMaven] using JDK installation JDK 1.7 (latest)
[linux-jdk7] [withMaven] using Maven installation 'Maven 3.5.2'
[Pipeline] [linux-jdk7] {
[Pipeline] [linux-jdk7] dir
[linux-jdk7] Running in /home/jenkins/jenkins-slave/workspace/en-toolchains-plugin_master-JSJRH7N7WHA5OITGTMSQVCI6AVNUPHTOLBYXKJXWNGGNGCYHSF5A/m
[Pipeline] [linux-jdk7] {
[Pipeline] [linux-jdk7] isUnix
[Pipeline] [linux-jdk7] sh
[linux-jdk7] [m] Running shell script
[linux-jdk7] + mvn -P+run-its -Dmaven.test.failure.ignore=true -Dfindbugs.failOnError=false
clean verify
[linux-jdk7] ----- withMaven Wrapper script -----
[linux-jdk7] Picked up JAVA_TOOL_OPTIONS: -Dmaven.ext.class.path="/home/jenkins/jenkins-slave/workspace/en-toolchains-plugin_master-JSJRH7N7WHA5OITGTMSQVCI6AVNUPHTOLBYXKJXWNGGNGCYHSF5A@tmp/withMaven7d611c35/pipeline-maven-spy.jar"
-Dorg.jenkinsci.plugins.pipeline.maven.reportsFolder="/home/jenkins/jenkins-slave/workspace/en-toolchains-plugin_master-JSJRH7N7WHA5OITGTMSQVCI6AVNUPHTOLBYXKJXWNGGNGCYHSF5A@tmp/withMaven7d611c35"

[linux-jdk7] #
[linux-jdk7] # There is insufficient memory for the Java Runtime Environment to continue.
[linux-jdk7] # Cannot create GC thread. Out of system resources.
[linux-jdk7] # An error report file with more information is saved as:
[linux-jdk7] # /home/jenkins/jenkins-slave/workspace/en-toolchains-plugin_master-JSJRH7N7WHA5OITGTMSQVCI6AVNUPHTOLBYXKJXWNGGNGCYHSF5A/m/hs_err_pid25410.log
[Pipeline] [linux-jdk7] }
[Pipeline] [linux-jdk7] // dir
[Pipeline] [linux-jdk7] }
[Pipeline] [linux-jdk7] // withMaven
[Pipeline] [linux-jdk7] echo
[linux-jdk7] [FAIL FAST] This is the first failure and likely root cause
[Pipeline] [linux-jdk7] }
[Pipeline] [linux-jdk7] // stage
[Pipeline] [linux-jdk7] }
[Pipeline] [linux-jdk7] // node
[Pipeline] [linux-jdk7] }
[linux-jdk7] Failed in branch linux-jdk7
[linux-jdk8] Running on H26 in /home/jenkins/jenkins-slave/workspace/en-toolchains-plugin_master-JSJRH7N7WHA5OITGTMSQVCI6AVNUPHTOLBYXKJXWNGGNGCYHSF5A
[Pipeline] [linux-jdk8] // node
[Pipeline] [linux-jdk9] // node
[Pipeline] [linux-jdk10] // node
[Pipeline] [linux-jdk8] }
[linux-jdk8] Failed in branch linux-jdk8
[Pipeline] [linux-jdk9] }
[linux-jdk9] Failed in branch linux-jdk9
[Pipeline] [linux-jdk10] }
[linux-jdk10] Failed in branch linux-jdk10
[Pipeline] // parallel
[Pipeline] echo
***** FAST FAILURE *****

Fast failure triggered by linux-jdk7

***** FAST FAILURE *****
[Pipeline] stage
[Pipeline] { (Notifications)
[Pipeline] echo
Build result: FAILURE
[Pipeline] jiraIssueSelector
[Pipeline] jiraComment
[Pipeline] emailext
Mime
  • Unnamed multipart/mixed (inline, None, 0 bytes)
View raw message