maven-notifications mailing list archives

Site index · List index
Message view « Date » · « Thread »
Top « Date » · « Thread »
From Apache Jenkins Server <jenk...@builds.apache.org>
Subject Build unstable in Jenkins: Maven TLP » maven » MNG-6386 #3
Date Thu, 03 May 2018 00:10:40 GMT
See https://builds.apache.org/job/maven-box/job/maven/job/MNG-6386/3/

No changes.

2 tests failed.
FAILED:  org.apache.maven.it.MavenITmng6386BaseUriPropertyTest.testitMNG6386UnicodeChars

Error Message:
Resource not found: /mng-6386-это по-русский

Stack Trace:
java.lang.IllegalArgumentException: Resource not found: /mng-6386-это по-русский
	at org.apache.maven.it.MavenITmng6386BaseUriPropertyTest.testitMNG6386UnicodeChars(MavenITmng6386BaseUriPropertyTest.java:64)


FAILED:  org.apache.maven.it.MavenITmng6386BaseUriPropertyTest.testitMNG6386UnicodeChars

Error Message:
Resource not found: /mng-6386-это по-русский

Stack Trace:
java.lang.IllegalArgumentException: Resource not found: /mng-6386-это по-русский
	at org.apache.maven.it.MavenITmng6386BaseUriPropertyTest.testitMNG6386UnicodeChars(MavenITmng6386BaseUriPropertyTest.java:64)




Build log:
[...truncated 6.50 MB...]
[linuxJava8] None of the test reports contained any result
[linuxJava8] [withMaven] junitPublisher - Archive test results for Maven artifact org.apache.maven.its.plugins:maven-it-plugin-extension-consumer:2.1-SNAPSHOT
generated by maven-surefire-plugin:test (default-test): core-it-support/core-it-plugins/maven-it-plugin-extension-consumer/target/surefire-reports/*.xml
[linuxJava8] Recording test results
[linuxJava8] None of the test reports contained any result
[linuxJava8] [withMaven] junitPublisher - Archive test results for Maven artifact org.apache.maven.its.plugins:maven-it-plugin-extension-provider:2.1-SNAPSHOT
generated by maven-surefire-plugin:test (default-test): core-it-support/core-it-plugins/maven-it-plugin-extension-provider/target/surefire-reports/*.xml
[linuxJava8] Recording test results
[linuxJava8] None of the test reports contained any result
[linuxJava8] [withMaven] junitPublisher - Archive test results for Maven artifact org.apache.maven.its.plugins:maven-it-plugin-fork:2.1-SNAPSHOT
generated by maven-surefire-plugin:test (default-test): core-it-support/core-it-plugins/maven-it-plugin-fork/target/surefire-reports/*.xml
[linuxJava8] Recording test results
[linuxJava8] None of the test reports contained any result
[linuxJava8] [withMaven] junitPublisher - Archive test results for Maven artifact org.apache.maven.its.plugins:maven-it-plugin-invalid-descriptor:2.1-SNAPSHOT
generated by maven-surefire-plugin:test (default-test): core-it-support/core-it-plugins/maven-it-plugin-invalid-descriptor/target/surefire-reports/*.xml
[linuxJava8] Recording test results
[linuxJava8] None of the test reports contained any result
[linuxJava8] [withMaven] junitPublisher - Archive test results for Maven artifact org.apache.maven.its.plugins:maven-it-plugin-log-file:2.1-SNAPSHOT
generated by maven-surefire-plugin:test (default-test): core-it-support/core-it-plugins/maven-it-plugin-log-file/target/surefire-reports/*.xml
[linuxJava8] Recording test results
[linuxJava8] None of the test reports contained any result
[linuxJava8] [withMaven] junitPublisher - Archive test results for Maven artifact org.apache.maven.its:maven-it-helper:2.1-SNAPSHOT
generated by maven-surefire-plugin:test (default-test): core-it-support/maven-it-helper/target/surefire-reports/*.xml
[linuxJava8] Recording test results
[linuxJava8] FATAL: Failed to save the JUnit test result
[linuxJava8] java.io.IOException: com.thoughtworks.xstream.io.StreamException:  : null
[linuxJava8] 	at hudson.XmlFile.write(XmlFile.java:188)
[linuxJava8] 	at hudson.tasks.junit.TestResultAction.setResult(TestResultAction.java:117)
[linuxJava8] 	at hudson.tasks.junit.TestResultAction.mergeResult(TestResultAction.java:270)
[linuxJava8] 	at hudson.tasks.junit.JUnitResultArchiver.parseAndAttach(JUnitResultArchiver.java:178)
[linuxJava8] 	at hudson.tasks.junit.JUnitResultArchiver.perform(JUnitResultArchiver.java:153)
[linuxJava8] 	at org.jenkinsci.plugins.pipeline.maven.publishers.JunitTestsPublisher.executeReporter(JunitTestsPublisher.java:270)
[linuxJava8] 	at org.jenkinsci.plugins.pipeline.maven.publishers.JunitTestsPublisher.process(JunitTestsPublisher.java:182)
[linuxJava8] 	at org.jenkinsci.plugins.pipeline.maven.MavenSpyLogProcessor.processMavenSpyLogs(MavenSpyLogProcessor.java:114)
[linuxJava8] 	at org.jenkinsci.plugins.pipeline.maven.WithMavenStepExecution$WorkspaceCleanupCallback.finished(WithMavenStepExecution.java:1015)
[linuxJava8] 	at org.jenkinsci.plugins.workflow.steps.BodyExecutionCallback$TailCall.onSuccess(BodyExecutionCallback.java:114)
[linuxJava8] 	at org.jenkinsci.plugins.workflow.cps.CpsBodyExecution$SuccessAdapter.receive(CpsBodyExecution.java:368)
[linuxJava8] 	at com.cloudbees.groovy.cps.Outcome.resumeFrom(Outcome.java:73)
[linuxJava8] 	at com.cloudbees.groovy.cps.Continuable$1.call(Continuable.java:166)
[linuxJava8] 	at com.cloudbees.groovy.cps.Continuable$1.call(Continuable.java:163)
[linuxJava8] 	at org.codehaus.groovy.runtime.GroovyCategorySupport$ThreadCategoryInfo.use(GroovyCategorySupport.java:122)
[linuxJava8] 	at org.codehaus.groovy.runtime.GroovyCategorySupport.use(GroovyCategorySupport.java:261)
[linuxJava8] 	at com.cloudbees.groovy.cps.Continuable.run0(Continuable.java:163)
[linuxJava8] 	at org.jenkinsci.plugins.workflow.cps.SandboxContinuable.access$001(SandboxContinuable.java:19)
[linuxJava8] 	at org.jenkinsci.plugins.workflow.cps.SandboxContinuable$1.call(SandboxContinuable.java:35)
[linuxJava8] 	at org.jenkinsci.plugins.workflow.cps.SandboxContinuable$1.call(SandboxContinuable.java:32)
[linuxJava8] 	at org.jenkinsci.plugins.scriptsecurity.sandbox.groovy.GroovySandbox.runInSandbox(GroovySandbox.java:108)
[linuxJava8] 	at org.jenkinsci.plugins.workflow.cps.SandboxContinuable.run0(SandboxContinuable.java:32)
[linuxJava8] 	at org.jenkinsci.plugins.workflow.cps.CpsThread.runNextChunk(CpsThread.java:174)
[linuxJava8] 	at org.jenkinsci.plugins.workflow.cps.CpsThreadGroup.run(CpsThreadGroup.java:331)
[linuxJava8] 	at org.jenkinsci.plugins.workflow.cps.CpsThreadGroup.access$200(CpsThreadGroup.java:82)
[linuxJava8] 	at org.jenkinsci.plugins.workflow.cps.CpsThreadGroup$2.call(CpsThreadGroup.java:243)
[linuxJava8] 	at org.jenkinsci.plugins.workflow.cps.CpsThreadGroup$2.call(CpsThreadGroup.java:231)
[linuxJava8] 	at org.jenkinsci.plugins.workflow.cps.CpsVmExecutorService$2.call(CpsVmExecutorService.java:64)
[linuxJava8] 	at java.util.concurrent.FutureTask.run(FutureTask.java:266)
[linuxJava8] 	at hudson.remoting.SingleLaneExecutorService$1.run(SingleLaneExecutorService.java:112)
[linuxJava8] 	at jenkins.util.ContextResettingExecutorService$1.run(ContextResettingExecutorService.java:28)
[linuxJava8] 	at java.util.concurrent.Executors$RunnableAdapter.call(Executors.java:511)
[linuxJava8] 	at java.util.concurrent.FutureTask.run(FutureTask.java:266)
[linuxJava8] 	at java.util.concurrent.ThreadPoolExecutor.runWorker(ThreadPoolExecutor.java:1149)
[linuxJava8] 	at java.util.concurrent.ThreadPoolExecutor$Worker.run(ThreadPoolExecutor.java:624)
[linuxJava8] 	at java.lang.Thread.run(Thread.java:748)
[linuxJava8] Caused by: com.thoughtworks.xstream.io.StreamException:  : null
[linuxJava8] 	at com.thoughtworks.xstream.core.util.QuickWriter.flush(QuickWriter.java:77)
[linuxJava8] 	at com.thoughtworks.xstream.io.xml.PrettyPrintWriter.endNode(PrettyPrintWriter.java:322)
[linuxJava8] 	at com.thoughtworks.xstream.io.WriterWrapper.endNode(WriterWrapper.java:37)
[linuxJava8] 	at com.thoughtworks.xstream.io.path.PathTrackingWriter.endNode(PathTrackingWriter.java:48)
[linuxJava8] 	at com.thoughtworks.xstream.core.TreeMarshaller.start(TreeMarshaller.java:83)
[linuxJava8] 	at com.thoughtworks.xstream.core.AbstractTreeMarshallingStrategy.marshal(AbstractTreeMarshallingStrategy.java:37)
[linuxJava8] 	at com.thoughtworks.xstream.XStream.marshal(XStream.java:1026)
[linuxJava8] 	at com.thoughtworks.xstream.XStream.marshal(XStream.java:1015)
[linuxJava8] 	at com.thoughtworks.xstream.XStream.toXML(XStream.java:988)
[linuxJava8] 	at hudson.XmlFile.write(XmlFile.java:181)
[linuxJava8] 	... 35 more
[linuxJava8] Caused by: java.nio.channels.ClosedByInterruptException
[linuxJava8] 	at java.nio.channels.spi.AbstractInterruptibleChannel.end(AbstractInterruptibleChannel.java:202)
[linuxJava8] 	at sun.nio.ch.FileChannelImpl.write(FileChannelImpl.java:216)
[linuxJava8] 	at java.nio.channels.Channels.writeFullyImpl(Channels.java:78)
[linuxJava8] 	at java.nio.channels.Channels.writeFully(Channels.java:101)
[linuxJava8] 	at java.nio.channels.Channels.access$000(Channels.java:61)
[linuxJava8] 	at java.nio.channels.Channels$1.write(Channels.java:174)
[linuxJava8] 	at sun.nio.cs.StreamEncoder.writeBytes(StreamEncoder.java:221)
[linuxJava8] 	at sun.nio.cs.StreamEncoder.implFlushBuffer(StreamEncoder.java:291)
[linuxJava8] 	at sun.nio.cs.StreamEncoder.implFlush(StreamEncoder.java:295)
[linuxJava8] 	at sun.nio.cs.StreamEncoder.flush(StreamEncoder.java:141)
[linuxJava8] 	at java.io.OutputStreamWriter.flush(OutputStreamWriter.java:229)
[linuxJava8] 	at java.io.BufferedWriter.flush(BufferedWriter.java:254)
[linuxJava8] 	at hudson.util.AtomicFileWriter.flush(AtomicFileWriter.java:97)
[linuxJava8] 	at com.thoughtworks.xstream.core.util.QuickWriter.flush(QuickWriter.java:75)
[linuxJava8] 	... 44 more
[linuxJava8] ERROR: [withMaven] junitPublisher - Silently ignore exception archiving JUnit
results for Maven artifact MavenArtifact{org.apache.maven.its:maven-it-helper::2.1-SNAPSHOT(version:
2.1-SNAPSHOT, snapshot:false) } generated by PluginInvocation{org.apache.maven.plugins:maven-surefire-plugin:2.20.1@test
 default-test}: java.lang.InterruptedException
[linuxJava8] [withMaven] junitPublisher - Archive test results for Maven artifact org.apache.maven.its.plugins:maven-it-plugin-model-interpolation:2.1-SNAPSHOT
generated by maven-surefire-plugin:test (default-test): core-it-support/core-it-plugins/maven-it-plugin-model-interpolation/target/surefire-reports/*.xml
[linuxJava8] Recording test results
[linuxJava8] ERROR: [withMaven] junitPublisher - Silently ignore exception archiving JUnit
results for Maven artifact MavenArtifact{org.apache.maven.its.plugins:maven-it-plugin-model-interpolation::2.1-SNAPSHOT(version:
2.1-SNAPSHOT, snapshot:false) } generated by PluginInvocation{org.apache.maven.plugins:maven-surefire-plugin:2.20.1@test
 default-test}: java.lang.RuntimeException: Failed to serialize hudson.tasks.junit.TestResult#suites
for class hudson.tasks.junit.TestResult
[linuxJava8] [withMaven] junitPublisher - Archive test results for Maven artifact org.apache.maven.its.plugins:maven-it-plugin-no-default-comp:2.1-SNAPSHOT
generated by maven-surefire-plugin:test (default-test): core-it-support/core-it-plugins/maven-it-plugin-no-default-comp/target/surefire-reports/*.xml
[linuxJava8] Recording test results
[linuxJava8] None of the test reports contained any result
[linuxJava8] [withMaven] junitPublisher - Archive test results for Maven artifact org.apache.maven.its.plugins:maven-it-plugin-no-project:2.1-SNAPSHOT
generated by maven-surefire-plugin:test (default-test): core-it-support/core-it-plugins/maven-it-plugin-no-project/target/surefire-reports/*.xml
[linuxJava8] Recording test results
[linuxJava8] ERROR: [withMaven] junitPublisher - Silently ignore exception archiving JUnit
results for Maven artifact MavenArtifact{org.apache.maven.its.plugins:maven-it-plugin-no-project::2.1-SNAPSHOT(version:
2.1-SNAPSHOT, snapshot:false) } generated by PluginInvocation{org.apache.maven.plugins:maven-surefire-plugin:2.20.1@test
 default-test}: java.lang.InterruptedException
[linuxJava8] [withMaven] junitPublisher - Archive test results for Maven artifact org.apache.maven.its.plugins:maven-it-plugin-online:2.1-SNAPSHOT
generated by maven-surefire-plugin:test (default-test): core-it-support/core-it-plugins/maven-it-plugin-online/target/surefire-reports/*.xml
[linuxJava8] Recording test results
[linuxJava8] None of the test reports contained any result
[linuxJava8] [withMaven] junitPublisher - Archive test results for Maven artifact org.apache.maven.its.plugins:maven-it-plugin-optional-mojos:2.1-SNAPSHOT
generated by maven-surefire-plugin:test (default-test): core-it-support/core-it-plugins/maven-it-plugin-optional-mojos/target/surefire-reports/*.xml
[linuxJava8] Recording test results
[linuxJava8] ERROR: [withMaven] junitPublisher - Silently ignore exception archiving JUnit
results for Maven artifact MavenArtifact{org.apache.maven.its.plugins:maven-it-plugin-optional-mojos::2.1-SNAPSHOT(version:
2.1-SNAPSHOT, snapshot:false) } generated by PluginInvocation{org.apache.maven.plugins:maven-surefire-plugin:2.20.1@test
 default-test}: java.lang.RuntimeException: Failed to serialize hudson.tasks.junit.TestResult#suites
for class hudson.tasks.junit.TestResult
[linuxJava8] [withMaven] junitPublisher - Archive test results for Maven artifact org.apache.maven.its.plugins:maven-it-plugin-packaging:2.1-SNAPSHOT
generated by maven-surefire-plugin:test (default-test): core-it-support/core-it-plugins/maven-it-plugin-packaging/target/surefire-reports/*.xml
[linuxJava8] Recording test results
[linuxJava8] None of the test reports contained any result
[linuxJava8] [withMaven] junitPublisher - Archive test results for Maven artifact org.apache.maven.its.plugins:maven-it-plugin-parameter-implementation:2.1-SNAPSHOT
generated by maven-surefire-plugin:test (default-test): core-it-support/core-it-plugins/maven-it-plugin-parameter-implementation/target/surefire-reports/*.xml
[linuxJava8] Recording test results
[linuxJava8] ERROR: [withMaven] junitPublisher - Silently ignore exception archiving JUnit
results for Maven artifact MavenArtifact{org.apache.maven.its.plugins:maven-it-plugin-parameter-implementation::2.1-SNAPSHOT(version:
2.1-SNAPSHOT, snapshot:false) } generated by PluginInvocation{org.apache.maven.plugins:maven-surefire-plugin:2.20.1@test
 default-test}: java.lang.RuntimeException: Failed to serialize hudson.tasks.junit.TestResult#suites
for class hudson.tasks.junit.TestResult
[linuxJava8] [withMaven] junitPublisher - Archive test results for Maven artifact org.apache.maven.its.plugins:maven-it-plugin-plugin-dependency:2.1-SNAPSHOT
generated by maven-surefire-plugin:test (default-test): core-it-support/core-it-plugins/maven-it-plugin-plugin-dependency/target/surefire-reports/*.xml
[linuxJava8] Recording test results
[linuxJava8] None of the test reports contained any result
[linuxJava8] [withMaven] junitPublisher - Archive test results for Maven artifact org.apache.maven.its.plugins:maven-it-plugin-project:2.1-SNAPSHOT
generated by maven-surefire-plugin:test (default-test): core-it-support/core-it-plugins/maven-it-plugin-project/target/surefire-reports/*.xml
[linuxJava8] Recording test results
[linuxJava8] ERROR: [withMaven] junitPublisher - Silently ignore exception archiving JUnit
results for Maven artifact MavenArtifact{org.apache.maven.its.plugins:maven-it-plugin-project::2.1-SNAPSHOT(version:
2.1-SNAPSHOT, snapshot:false) } generated by PluginInvocation{org.apache.maven.plugins:maven-surefire-plugin:2.20.1@test
 default-test}: java.lang.RuntimeException: Failed to serialize hudson.tasks.junit.TestResult#suites
for class hudson.tasks.junit.TestResult
[linuxJava8] [withMaven] junitPublisher - Archive test results for Maven artifact org.apache.maven.its.plugins:maven-it-plugin-project-interpolation:2.1-SNAPSHOT
generated by maven-surefire-plugin:test (default-test): core-it-support/core-it-plugins/maven-it-plugin-project-interpolation/target/surefire-reports/*.xml
[linuxJava8] Recording test results
[linuxJava8] None of the test reports contained any result
[linuxJava8] [withMaven] junitPublisher - Archive test results for Maven artifact org.apache.maven.its.plugins:maven-it-plugin-setter:2.1-SNAPSHOT
generated by maven-surefire-plugin:test (default-test): core-it-support/core-it-plugins/maven-it-plugin-setter/target/surefire-reports/*.xml
[linuxJava8] Recording test results
[linuxJava8] ERROR: [withMaven] junitPublisher - Silently ignore exception archiving JUnit
results for Maven artifact MavenArtifact{org.apache.maven.its.plugins:maven-it-plugin-setter::2.1-SNAPSHOT(version:
2.1-SNAPSHOT, snapshot:false) } generated by PluginInvocation{org.apache.maven.plugins:maven-surefire-plugin:2.20.1@test
 default-test}: java.lang.RuntimeException: Failed to serialize hudson.tasks.junit.TestResult#suites
for class hudson.tasks.junit.TestResult
[linuxJava8] [withMaven] junitPublisher - Archive test results for Maven artifact org.apache.maven.its.plugins:maven-it-plugin-singleton-component:2.1-SNAPSHOT
generated by maven-surefire-plugin:test (default-test): core-it-support/core-it-plugins/maven-it-plugin-singleton-component/target/surefire-reports/*.xml
[linuxJava8] Recording test results
[linuxJava8] None of the test reports contained any result
[linuxJava8] [withMaven] junitPublisher - Archive test results for Maven artifact org.apache.maven.its.plugins:maven-it-plugin-site:2.1-SNAPSHOT
generated by maven-surefire-plugin:test (default-test): core-it-support/core-it-plugins/maven-it-plugin-site/target/surefire-reports/*.xml
[linuxJava8] Recording test results
[linuxJava8] ERROR: [withMaven] junitPublisher - Silently ignore exception archiving JUnit
results for Maven artifact MavenArtifact{org.apache.maven.its.plugins:maven-it-plugin-site::2.1-SNAPSHOT(version:
2.1-SNAPSHOT, snapshot:false) } generated by PluginInvocation{org.apache.maven.plugins:maven-surefire-plugin:2.20.1@test
 default-test}: java.lang.RuntimeException: Failed to serialize hudson.tasks.junit.TestResult#suites
for class hudson.tasks.junit.TestResult
[linuxJava8] [withMaven] junitPublisher - Archive test results for Maven artifact org.apache.maven.its.plugins:maven-it-plugin-toolchain:2.1-SNAPSHOT
generated by maven-surefire-plugin:test (default-test): core-it-support/core-it-plugins/maven-it-plugin-toolchain/target/surefire-reports/*.xml
[linuxJava8] Recording test results
[linuxJava8] None of the test reports contained any result
[linuxJava8] [withMaven] junitPublisher - Archive test results for Maven artifact org.apache.maven.its.plugins:maven-it-plugin-touch:2.1-SNAPSHOT
generated by maven-surefire-plugin:test (default-test): core-it-support/core-it-plugins/maven-it-plugin-touch/target/surefire-reports/*.xml
[linuxJava8] Recording test results
[linuxJava8] ERROR: [withMaven] junitPublisher - Silently ignore exception archiving JUnit
results for Maven artifact MavenArtifact{org.apache.maven.its.plugins:maven-it-plugin-touch::2.1-SNAPSHOT(version:
2.1-SNAPSHOT, snapshot:false) } generated by PluginInvocation{org.apache.maven.plugins:maven-surefire-plugin:2.20.1@test
 default-test}: java.lang.RuntimeException: Failed to serialize hudson.tasks.junit.TestResult#suites
for class hudson.tasks.junit.TestResult
[linuxJava8] [withMaven] junitPublisher - Archive test results for Maven artifact org.apache.maven.its.plugins:maven-it-plugin-uses-properties:2.1-SNAPSHOT
generated by maven-surefire-plugin:test (default-test): core-it-support/core-it-plugins/maven-it-plugin-uses-properties/target/surefire-reports/*.xml
[linuxJava8] Recording test results
[linuxJava8] None of the test reports contained any result
[linuxJava8] [withMaven] junitPublisher - Archive test results for Maven artifact org.apache.maven.its.plugins:maven-it-plugin-uses-wagon:2.1-SNAPSHOT
generated by maven-surefire-plugin:test (default-test): core-it-support/core-it-plugins/maven-it-plugin-uses-wagon/target/surefire-reports/*.xml
[linuxJava8] Recording test results
[linuxJava8] ERROR: [withMaven] junitPublisher - Silently ignore exception archiving JUnit
results for Maven artifact MavenArtifact{org.apache.maven.its.plugins:maven-it-plugin-uses-wagon::2.1-SNAPSHOT(version:
2.1-SNAPSHOT, snapshot:false) } generated by PluginInvocation{org.apache.maven.plugins:maven-surefire-plugin:2.20.1@test
 default-test}: java.lang.RuntimeException: Failed to serialize hudson.tasks.junit.TestResult#suites
for class hudson.tasks.junit.TestResult
[linuxJava8] [withMaven] junitPublisher - Archive test results for Maven artifact org.apache.maven.its.plugins:maven-it-plugin-all:2.1-SNAPSHOT
generated by maven-surefire-plugin:test (default-test): core-it-support/core-it-plugins/maven-it-plugin-all/target/surefire-reports/*.xml
[linuxJava8] Recording test results
[linuxJava8] None of the test reports contained any result
[linuxJava8] [withMaven] junitPublisher - Archive test results for Maven artifact org.apache.maven.its.plugins:maven-it-plugin-plexus-utils-11:2.1-SNAPSHOT
generated by maven-surefire-plugin:test (default-test): core-it-support/core-it-plugins/maven-it-plugin-plexus-utils-11/target/surefire-reports/*.xml
[linuxJava8] Recording test results
[linuxJava8] ERROR: [withMaven] junitPublisher - Silently ignore exception archiving JUnit
results for Maven artifact MavenArtifact{org.apache.maven.its.plugins:maven-it-plugin-plexus-utils-11::2.1-SNAPSHOT(version:
2.1-SNAPSHOT, snapshot:false) } generated by PluginInvocation{org.apache.maven.plugins:maven-surefire-plugin:2.20.1@test
 default-test}: java.lang.RuntimeException: Failed to serialize hudson.tasks.junit.TestResult#suites
for class hudson.tasks.junit.TestResult
[linuxJava8] [withMaven] junitPublisher - Archive test results for Maven artifact org.apache.maven.its.plugins:maven-it-plugin-plexus-utils-new:2.1-SNAPSHOT
generated by maven-surefire-plugin:test (default-test): core-it-support/core-it-plugins/maven-it-plugin-plexus-utils-new/target/surefire-reports/*.xml
[linuxJava8] Recording test results
[linuxJava8] None of the test reports contained any result
[linuxJava8] [withMaven] junitPublisher - Archive test results for Maven artifact org.apache.maven.its.plugins:maven-it-plugin-plexus-component-api:2.1-SNAPSHOT
generated by maven-surefire-plugin:test (default-test): core-it-support/core-it-plugins/maven-it-plugin-plexus-component-api/target/surefire-reports/*.xml
[linuxJava8] Recording test results
[linuxJava8] None of the test reports contained any result
[linuxJava8] [withMaven] junitPublisher - Archive test results for Maven artifact org.apache.maven.its.plugins:maven-it-plugin-log4j:2.1-SNAPSHOT
generated by maven-surefire-plugin:test (default-test): core-it-support/core-it-plugins/maven-it-plugin-log4j/target/surefire-reports/*.xml
[linuxJava8] Recording test results
[linuxJava8] ERROR: [withMaven] junitPublisher - Silently ignore exception archiving JUnit
results for Maven artifact MavenArtifact{org.apache.maven.its.plugins:maven-it-plugin-log4j::2.1-SNAPSHOT(version:
2.1-SNAPSHOT, snapshot:false) } generated by PluginInvocation{org.apache.maven.plugins:maven-surefire-plugin:2.20.1@test
 default-test}: java.lang.RuntimeException: Failed to serialize hudson.tasks.junit.TestResult#suites
for class hudson.tasks.junit.TestResult
[linuxJava8] [withMaven] junitPublisher - Archive test results for Maven artifact org.apache.maven.its.plugins:maven-it-plugin-extension1:2.1-SNAPSHOT
generated by maven-surefire-plugin:test (default-test): core-it-support/core-it-plugins/maven-it-plugin-extension1/target/surefire-reports/*.xml
[linuxJava8] Recording test results
[linuxJava8] None of the test reports contained any result
[linuxJava8] [withMaven] junitPublisher - Archive test results for Maven artifact org.apache.maven.its.plugins:maven-it-plugin-extension2:2.1-SNAPSHOT
generated by maven-surefire-plugin:test (default-test): core-it-support/core-it-plugins/maven-it-plugin-extension2/target/surefire-reports/*.xml
[linuxJava8] Recording test results
[linuxJava8] None of the test reports contained any result
[linuxJava8] [withMaven] junitPublisher - Archive test results for Maven artifact org.apache.maven.its.plugins:maven-it-plugin-plexus-lifecycle:2.1-SNAPSHOT
generated by maven-surefire-plugin:test (default-test): core-it-support/core-it-plugins/maven-it-plugin-plexus-lifecycle/target/surefire-reports/*.xml
[linuxJava8] Recording test results
[linuxJava8] ERROR: [withMaven] junitPublisher - Silently ignore exception archiving JUnit
results for Maven artifact MavenArtifact{org.apache.maven.its.plugins:maven-it-plugin-plexus-lifecycle::2.1-SNAPSHOT(version:
2.1-SNAPSHOT, snapshot:false) } generated by PluginInvocation{org.apache.maven.plugins:maven-surefire-plugin:2.20.1@test
 default-test}: java.lang.RuntimeException: Failed to serialize hudson.tasks.junit.TestResult#suites
for class hudson.tasks.junit.TestResult
[linuxJava8] [withMaven] junitPublisher - Archive test results for Maven artifact org.apache.maven.its.plugins:maven-it-plugin-settings:2.1-SNAPSHOT
generated by maven-surefire-plugin:test (default-test): core-it-support/core-it-plugins/maven-it-plugin-settings/target/surefire-reports/*.xml
[linuxJava8] Recording test results
[linuxJava8] None of the test reports contained any result
[linuxJava8] [withMaven] junitPublisher - Archive test results for Maven artifact org.apache.maven.its.plugins:mng-5805-pkg-type-mojo-configuration-extension:2.1-SNAPSHOT
generated by maven-surefire-plugin:test (default-test): core-it-support/core-it-plugins/mng5805-extension/target/surefire-reports/*.xml
[linuxJava8] Recording test results
[linuxJava8] ERROR: [withMaven] junitPublisher - Silently ignore exception archiving JUnit
results for Maven artifact MavenArtifact{org.apache.maven.its.plugins:mng-5805-pkg-type-mojo-configuration-extension::2.1-SNAPSHOT(version:
2.1-SNAPSHOT, snapshot:false) } generated by PluginInvocation{org.apache.maven.plugins:maven-surefire-plugin:2.20.1@test
 default-test}: java.lang.RuntimeException: Failed to serialize hudson.tasks.junit.TestResult#suites
for class hudson.tasks.junit.TestResult
[linuxJava8] [withMaven] junitPublisher - Archive test results for Maven artifact org.apache.maven.its.plugins:mng-5805-pkg-type-mojo-configuration-extension2:2.1-SNAPSHOT
generated by maven-surefire-plugin:test (default-test): core-it-support/core-it-plugins/mng5805-extension2/target/surefire-reports/*.xml
[linuxJava8] Recording test results
[linuxJava8] ERROR: [withMaven] junitPublisher - Silently ignore exception archiving JUnit
results for Maven artifact MavenArtifact{org.apache.maven.its.plugins:mng-5805-pkg-type-mojo-configuration-extension2::2.1-SNAPSHOT(version:
2.1-SNAPSHOT, snapshot:false) } generated by PluginInvocation{org.apache.maven.plugins:maven-surefire-plugin:2.20.1@test
 default-test}: java.lang.RuntimeException: Failed to serialize hudson.tasks.junit.TestResult#suites
for class hudson.tasks.junit.TestResult
[linuxJava8] [withMaven] junitPublisher - Archive test results for Maven artifact org.apache.maven.its.plugins:mng-5805-pkg-type-mojo-configuration-plugin:2.1-SNAPSHOT
generated by maven-surefire-plugin:test (default-test): core-it-support/core-it-plugins/mng5805-plugin/target/surefire-reports/*.xml
[linuxJava8] Recording test results
[linuxJava8] ERROR: [withMaven] junitPublisher - Silently ignore exception archiving JUnit
results for Maven artifact MavenArtifact{org.apache.maven.its.plugins:mng-5805-pkg-type-mojo-configuration-plugin::2.1-SNAPSHOT(version:
2.1-SNAPSHOT, snapshot:false) } generated by PluginInvocation{org.apache.maven.plugins:maven-surefire-plugin:2.20.1@test
 default-test}: java.lang.RuntimeException: Failed to serialize hudson.tasks.junit.TestResult#suites
for class hudson.tasks.junit.TestResult
[linuxJava8] [withMaven] junitPublisher - Archive test results for Maven artifact org.apache.maven.its.plugins:mng-5805-pkg-type-mojo-configuration-plugin-dep:2.1-SNAPSHOT
generated by maven-surefire-plugin:test (default-test): core-it-support/core-it-plugins/mng5805-plugin-dep/target/surefire-reports/*.xml
[linuxJava8] Recording test results
[linuxJava8] ERROR: [withMaven] junitPublisher - Silently ignore exception archiving JUnit
results for Maven artifact MavenArtifact{org.apache.maven.its.plugins:mng-5805-pkg-type-mojo-configuration-plugin-dep::2.1-SNAPSHOT(version:
2.1-SNAPSHOT, snapshot:false) } generated by PluginInvocation{org.apache.maven.plugins:maven-surefire-plugin:2.20.1@test
 default-test}: java.lang.RuntimeException: Failed to serialize hudson.tasks.junit.TestResult#suites
for class hudson.tasks.junit.TestResult
[linuxJava8] [withMaven] junitPublisher - Archive test results for Maven artifact org.apache.maven.its.plugins:mng-5958-pkg-type-extension:2.1-SNAPSHOT
generated by maven-surefire-plugin:test (default-test): core-it-support/core-it-plugins/mng5958-extension/target/surefire-reports/*.xml
[linuxJava8] Recording test results
[linuxJava8] None of the test reports contained any result
[linuxJava8] [withMaven] junitPublisher - Archive test results for Maven artifact org.apache.maven.its:core-it-toolchain:2.1-SNAPSHOT
generated by maven-surefire-plugin:test (default-test): core-it-support/core-it-toolchain/target/surefire-reports/*.xml
[linuxJava8] Recording test results
[linuxJava8] ERROR: [withMaven] junitPublisher - Silently ignore exception archiving JUnit
results for Maven artifact MavenArtifact{org.apache.maven.its:core-it-toolchain::2.1-SNAPSHOT(version:
2.1-SNAPSHOT, snapshot:false) } generated by PluginInvocation{org.apache.maven.plugins:maven-surefire-plugin:2.20.1@test
 default-test}: java.lang.RuntimeException: Failed to serialize hudson.tasks.junit.TestResult#suites
for class hudson.tasks.junit.TestResult
[linuxJava8] [withMaven] junitPublisher - Archive test results for Maven artifact org.apache.maven.its:core-it-wagon:2.1-SNAPSHOT
generated by maven-surefire-plugin:test (default-test): core-it-support/core-it-wagon/target/surefire-reports/*.xml
[linuxJava8] Recording test results
[linuxJava8] ERROR: [withMaven] junitPublisher - Silently ignore exception archiving JUnit
results for Maven artifact MavenArtifact{org.apache.maven.its:core-it-wagon::2.1-SNAPSHOT(version:
2.1-SNAPSHOT, snapshot:false) } generated by PluginInvocation{org.apache.maven.plugins:maven-surefire-plugin:2.20.1@test
 default-test}: java.lang.RuntimeException: Failed to serialize hudson.tasks.junit.TestResult#suites
for class hudson.tasks.junit.TestResult
[linuxJava8] [withMaven] junitPublisher - Archive test results for Maven artifact org.apache.maven.its:core-it-extension:2.1-SNAPSHOT
generated by maven-surefire-plugin:test (default-test): core-it-support/core-it-extension/target/surefire-reports/*.xml
[linuxJava8] Recording test results
[linuxJava8] None of the test reports contained any result
[linuxJava8] [withMaven] junitPublisher - Archive test results for Maven artifact org.apache.maven.its:core-it-suite:2.1-SNAPSHOT
generated by maven-surefire-plugin:test (default-test): core-it-suite/target/surefire-reports/*.xml
[linuxJava8] Recording test results
[linuxJava8] ERROR: [withMaven] junitPublisher - Silently ignore exception archiving JUnit
results for Maven artifact MavenArtifact{org.apache.maven.its:core-it-suite::2.1-SNAPSHOT(version:
2.1-SNAPSHOT, snapshot:false) } generated by PluginInvocation{org.apache.maven.plugins:maven-surefire-plugin:2.20.1@test
 default-test}: java.lang.RuntimeException: Failed to serialize hudson.tasks.junit.TestResult#suites
for class hudson.tasks.junit.TestResult
[linuxJava8] ERROR: [withMaven] WARNING Exception processing the logs generated by the Jenkins
Maven Event Spy /home/jenkins/jenkins-slave/workspace/maven-box_maven_MNG-6386-LLX2LHIUAZ6VGRI3GUJ4WEAJPQUEJ2QQDYWXUIGOMQPZI7AFSMBA/test@tmp/withMaven817df848/maven-spy-20180502-235229-442003103205436463192.log,
ignore file.  Please report a bug associated for the component 'pipeline-maven-plugin' at
https://issues.jenkins-ci.org 
[linuxJava8] java.lang.InterruptedException
[linuxJava8] 	at java.lang.Object.wait(Native Method)
[linuxJava8] 	at hudson.remoting.Request.call(Request.java:167)
[linuxJava8] 	at hudson.remoting.Channel.call(Channel.java:907)
[linuxJava8] 	at hudson.FilePath.act(FilePath.java:986)
[linuxJava8] 	at hudson.FilePath.act(FilePath.java:975)
[linuxJava8] 	at hudson.FilePath.exists(FilePath.java:1440)
[linuxJava8] 	at org.jenkinsci.plugins.pipeline.maven.MavenSpyLogProcessor.processMavenSpyLogs(MavenSpyLogProcessor.java:105)
[linuxJava8] 	at org.jenkinsci.plugins.pipeline.maven.WithMavenStepExecution$WorkspaceCleanupCallback.finished(WithMavenStepExecution.java:1015)
[linuxJava8] 	at org.jenkinsci.plugins.workflow.steps.BodyExecutionCallback$TailCall.onSuccess(BodyExecutionCallback.java:114)
[linuxJava8] 	at org.jenkinsci.plugins.workflow.cps.CpsBodyExecution$SuccessAdapter.receive(CpsBodyExecution.java:368)
[linuxJava8] 	at com.cloudbees.groovy.cps.Outcome.resumeFrom(Outcome.java:73)
[linuxJava8] 	at com.cloudbees.groovy.cps.Continuable$1.call(Continuable.java:166)
[linuxJava8] 	at com.cloudbees.groovy.cps.Continuable$1.call(Continuable.java:163)
[linuxJava8] 	at org.codehaus.groovy.runtime.GroovyCategorySupport$ThreadCategoryInfo.use(GroovyCategorySupport.java:122)
[linuxJava8] 	at org.codehaus.groovy.runtime.GroovyCategorySupport.use(GroovyCategorySupport.java:261)
[linuxJava8] 	at com.cloudbees.groovy.cps.Continuable.run0(Continuable.java:163)
[linuxJava8] 	at org.jenkinsci.plugins.workflow.cps.SandboxContinuable.access$001(SandboxContinuable.java:19)
[linuxJava8] 	at org.jenkinsci.plugins.workflow.cps.SandboxContinuable$1.call(SandboxContinuable.java:35)
[linuxJava8] 	at org.jenkinsci.plugins.workflow.cps.SandboxContinuable$1.call(SandboxContinuable.java:32)
[linuxJava8] 	at org.jenkinsci.plugins.scriptsecurity.sandbox.groovy.GroovySandbox.runInSandbox(GroovySandbox.java:108)
[linuxJava8] 	at org.jenkinsci.plugins.workflow.cps.SandboxContinuable.run0(SandboxContinuable.java:32)
[linuxJava8] 	at org.jenkinsci.plugins.workflow.cps.CpsThread.runNextChunk(CpsThread.java:174)
[linuxJava8] 	at org.jenkinsci.plugins.workflow.cps.CpsThreadGroup.run(CpsThreadGroup.java:331)
[linuxJava8] 	at org.jenkinsci.plugins.workflow.cps.CpsThreadGroup.access$200(CpsThreadGroup.java:82)
[linuxJava8] 	at org.jenkinsci.plugins.workflow.cps.CpsThreadGroup$2.call(CpsThreadGroup.java:243)
[linuxJava8] 	at org.jenkinsci.plugins.workflow.cps.CpsThreadGroup$2.call(CpsThreadGroup.java:231)
[linuxJava8] 	at org.jenkinsci.plugins.workflow.cps.CpsVmExecutorService$2.call(CpsVmExecutorService.java:64)
[linuxJava8] 	at java.util.concurrent.FutureTask.run(FutureTask.java:266)
[linuxJava8] 	at hudson.remoting.SingleLaneExecutorService$1.run(SingleLaneExecutorService.java:112)
[linuxJava8] 	at jenkins.util.ContextResettingExecutorService$1.run(ContextResettingExecutorService.java:28)
[linuxJava8] 	at java.util.concurrent.Executors$RunnableAdapter.call(Executors.java:511)
[linuxJava8] 	at java.util.concurrent.FutureTask.run(FutureTask.java:266)
[linuxJava8] 	at java.util.concurrent.ThreadPoolExecutor.runWorker(ThreadPoolExecutor.java:1149)
[linuxJava8] 	at java.util.concurrent.ThreadPoolExecutor$Worker.run(ThreadPoolExecutor.java:624)
[linuxJava8] 	at java.lang.Thread.run(Thread.java:748)
[Pipeline] [linuxJava8] // withMaven
[Pipeline] [linuxJava7] }
[Pipeline] [linuxJava8] deleteDir
[Pipeline] [linuxJava7] // dir
[Pipeline] [linuxJava7] }
[Pipeline] [linuxJava7] // stage
[Pipeline] [linuxJava7] }
[Pipeline] [linuxJava8] }
[Pipeline] [linuxJava7] // node
[Pipeline] [linuxJava8] // dir
[Pipeline] [linuxJava7] }
[Pipeline] [linuxJava8] }
[Pipeline] [linuxJava8] // stage
[Pipeline] [linuxJava8] }
[Pipeline] [linuxJava8] // node
[Pipeline] [linuxJava8] }
[Pipeline] // parallel
[Pipeline] stage
[Pipeline] { (Notifications)
[Pipeline] echo
Build result: UNSTABLE
[Pipeline] jiraIssueSelector
Mime
  • Unnamed multipart/mixed (inline, None, 0 bytes)
View raw message