maven-notifications mailing list archives

Site index · List index
Message view « Date » · « Thread »
Top « Date » · « Thread »
From Apache Jenkins Server <jenk...@builds.apache.org>
Subject Build failed in Jenkins: Maven TLP » maven-plugin-tools » master #29
Date Sun, 20 May 2018 14:23:44 GMT
See https://builds.apache.org/job/maven-box/job/maven-plugin-tools/job/master/29/

Changes:

* [maven-release-plugin] prepare release maven-plugin-tools-3.5.2
* [maven-release-plugin] prepare release maven-plugin-tools-3.5.2
* [maven-release-plugin] prepare release maven-plugin-tools-3.5.2
* [maven-release-plugin] prepare release maven-plugin-tools-3.5.2
* [maven-release-plugin] prepare release maven-plugin-tools-3.5.2
* [maven-release-plugin] prepare release maven-plugin-tools-3.5.2
* [maven-release-plugin] prepare release maven-plugin-tools-3.5.2
* [maven-release-plugin] prepare release maven-plugin-tools-3.5.2

All tests passed

Build log:
[...truncated 2.23 MB...]
[linux-jdk9] [INFO] Changes detected - recompiling the module!
[linux-jdk9] [INFO] Compiling 1 source file to /home/jenkins/jenkins-slave/workspace/x_maven-plugin-tools_master-XKS4EHY3PSXHGP4DHIXUDAAM6TMAKT3YNFP2XDSSXFM24ZMKWIXQ@2/m/maven-script/maven-plugin-tools-ant/target/test-classes
[linux-jdk9] [INFO] /home/jenkins/jenkins-slave/workspace/x_maven-plugin-tools_master-XKS4EHY3PSXHGP4DHIXUDAAM6TMAKT3YNFP2XDSSXFM24ZMKWIXQ@2/m/maven-script/maven-plugin-tools-ant/src/test/java/org/apache/maven/tools/plugin/extractor/ant/AntMojoDescriptorExtractorTest.java:
/home/jenkins/jenkins-slave/workspace/x_maven-plugin-tools_master-XKS4EHY3PSXHGP4DHIXUDAAM6TMAKT3YNFP2XDSSXFM24ZMKWIXQ@2/m/maven-script/maven-plugin-tools-ant/src/test/java/org/apache/maven/tools/plugin/extractor/ant/AntMojoDescriptorExtractorTest.java
uses unchecked or unsafe operations.
[linux-jdk9] [INFO] /home/jenkins/jenkins-slave/workspace/x_maven-plugin-tools_master-XKS4EHY3PSXHGP4DHIXUDAAM6TMAKT3YNFP2XDSSXFM24ZMKWIXQ@2/m/maven-script/maven-plugin-tools-ant/src/test/java/org/apache/maven/tools/plugin/extractor/ant/AntMojoDescriptorExtractorTest.java:
Recompile with -Xlint:unchecked for details.
[linux-jdk9] [INFO] 
[linux-jdk9] [INFO] --- plexus-component-metadata:1.7:generate-test-metadata (default) @ maven-plugin-tools-ant
---
[linux-jdk9] [INFO] 
[linux-jdk9] [INFO] --- maven-surefire-plugin:2.21.0:test (default-test) @ maven-plugin-tools-ant
---
[linux-jdk9] [INFO] 
[linux-jdk9] [INFO] -------------------------------------------------------
[linux-jdk9] [INFO]  T E S T S
[linux-jdk9] [INFO] -------------------------------------------------------
[linux-jdk9] [INFO] 
[linux-jdk9] [INFO] Results:
[linux-jdk9] [INFO] 
[linux-jdk9] [INFO] Tests run: 0, Failures: 0, Errors: 0, Skipped: 0
[linux-jdk9] [INFO] 
[linux-jdk9] [ERROR] There are test failures.
[linux-jdk9] 
[linux-jdk9] Please refer to /home/jenkins/jenkins-slave/workspace/x_maven-plugin-tools_master-XKS4EHY3PSXHGP4DHIXUDAAM6TMAKT3YNFP2XDSSXFM24ZMKWIXQ@2/m/maven-script/maven-plugin-tools-ant/target/surefire-reports
for the individual test results.
[linux-jdk9] Please refer to dump files (if any exist) [date]-jvmRun[N].dump, [date].dumpstream
and [date]-jvmRun[N].dumpstream.
[linux-jdk9] The forked VM terminated without properly saying goodbye. VM crash or System.exit
called?
[linux-jdk9] Command was /bin/sh -c cd /home/jenkins/jenkins-slave/workspace/x_maven-plugin-tools_master-XKS4EHY3PSXHGP4DHIXUDAAM6TMAKT3YNFP2XDSSXFM24ZMKWIXQ@2/m/maven-script/maven-plugin-tools-ant
&& /usr/local/asfpackages/java/jdk-9.0.1/bin/java -jar /home/jenkins/jenkins-slave/workspace/x_maven-plugin-tools_master-XKS4EHY3PSXHGP4DHIXUDAAM6TMAKT3YNFP2XDSSXFM24ZMKWIXQ@2/m/maven-script/maven-plugin-tools-ant/target/surefire/surefirebooter3247491842827307521.jar
/home/jenkins/jenkins-slave/workspace/x_maven-plugin-tools_master-XKS4EHY3PSXHGP4DHIXUDAAM6TMAKT3YNFP2XDSSXFM24ZMKWIXQ@2/m/maven-script/maven-plugin-tools-ant/target/surefire
2018-05-20T14-22-59_603-jvmRun1 surefire9253209333237704028tmp surefire_514216358677243102152tmp
[linux-jdk9] Error occurred in starting fork, check output in log
[linux-jdk9] Process Exit Code: 143
[linux-jdk9] org.apache.maven.surefire.booter.SurefireBooterForkException: The forked VM terminated
without properly saying goodbye. VM crash or System.exit called?
[linux-jdk9] Command was /bin/sh -c cd /home/jenkins/jenkins-slave/workspace/x_maven-plugin-tools_master-XKS4EHY3PSXHGP4DHIXUDAAM6TMAKT3YNFP2XDSSXFM24ZMKWIXQ@2/m/maven-script/maven-plugin-tools-ant
&& /usr/local/asfpackages/java/jdk-9.0.1/bin/java -jar /home/jenkins/jenkins-slave/workspace/x_maven-plugin-tools_master-XKS4EHY3PSXHGP4DHIXUDAAM6TMAKT3YNFP2XDSSXFM24ZMKWIXQ@2/m/maven-script/maven-plugin-tools-ant/target/surefire/surefirebooter3247491842827307521.jar
/home/jenkins/jenkins-slave/workspace/x_maven-plugin-tools_master-XKS4EHY3PSXHGP4DHIXUDAAM6TMAKT3YNFP2XDSSXFM24ZMKWIXQ@2/m/maven-script/maven-plugin-tools-ant/target/surefire
2018-05-20T14-22-59_603-jvmRun1 surefire9253209333237704028tmp surefire_514216358677243102152tmp
[linux-jdk9] Error occurred in starting fork, check output in log
[linux-jdk9] Process Exit Code: 143
[linux-jdk9] 	at org.apache.maven.plugin.surefire.booterclient.ForkStarter.fork(ForkStarter.java:671)
[linux-jdk9] 	at org.apache.maven.plugin.surefire.booterclient.ForkStarter.fork(ForkStarter.java:533)
[linux-jdk9] 	at org.apache.maven.plugin.surefire.booterclient.ForkStarter.run(ForkStarter.java:278)
[linux-jdk9] 	at org.apache.maven.plugin.surefire.booterclient.ForkStarter.run(ForkStarter.java:244)
[linux-jdk9] 	at org.apache.maven.plugin.surefire.AbstractSurefireMojo.executeProvider(AbstractSurefireMojo.java:1149)
[linux-jdk9] 	at org.apache.maven.plugin.surefire.AbstractSurefireMojo.executeAfterPreconditionsChecked(AbstractSurefireMojo.java:978)
[linux-jdk9] 	at org.apache.maven.plugin.surefire.AbstractSurefireMojo.execute(AbstractSurefireMojo.java:854)
[linux-jdk9] 	at org.apache.maven.plugin.DefaultBuildPluginManager.executeMojo(DefaultBuildPluginManager.java:134)
[linux-jdk9] 	at org.apache.maven.lifecycle.internal.MojoExecutor.execute(MojoExecutor.java:208)
[linux-jdk9] 	at org.apache.maven.lifecycle.internal.MojoExecutor.execute(MojoExecutor.java:154)
[linux-jdk9] 	at org.apache.maven.lifecycle.internal.MojoExecutor.execute(MojoExecutor.java:146)
[linux-jdk9] 	at org.apache.maven.lifecycle.internal.LifecycleModuleBuilder.buildProject(LifecycleModuleBuilder.java:117)
[linux-jdk9] 	at org.apache.maven.lifecycle.internal.LifecycleModuleBuilder.buildProject(LifecycleModuleBuilder.java:81)
[linux-jdk9] 	at org.apache.maven.lifecycle.internal.builder.singlethreaded.SingleThreadedBuilder.build(SingleThreadedBuilder.java:51)
[linux-jdk9] 	at org.apache.maven.lifecycle.internal.LifecycleStarter.execute(LifecycleStarter.java:128)
[linux-jdk9] 	at org.apache.maven.DefaultMaven.doExecute(DefaultMaven.java:309)
[linux-jdk9] 	at org.apache.maven.DefaultMaven.doExecute(DefaultMaven.java:194)
[linux-jdk9] 	at org.apache.maven.DefaultMaven.execute(DefaultMaven.java:107)
[linux-jdk9] 	at org.apache.maven.cli.MavenCli.execute(MavenCli.java:955)
[linux-jdk9] 	at org.apache.maven.cli.MavenCli.doMain(MavenCli.java:290)
[linux-jdk9] 	at org.apache.maven.cli.MavenCli.main(MavenCli.java:194)
[linux-jdk9] 	at java.base/jdk.internal.reflect.NativeMethodAccessorImpl.invoke0(Native Method)
[linux-jdk9] 	at java.base/jdk.internal.reflect.NativeMethodAccessorImpl.invoke(NativeMethodAccessorImpl.java:62)
[linux-jdk9] 	at java.base/jdk.internal.reflect.DelegatingMethodAccessorImpl.invoke(DelegatingMethodAccessorImpl.java:43)
[linux-jdk9] 	at java.base/java.lang.reflect.Method.invoke(Method.java:564)
[linux-jdk9] 	at org.codehaus.plexus.classworlds.launcher.Launcher.launchEnhanced(Launcher.java:289)
[linux-jdk9] 	at org.codehaus.plexus.classworlds.launcher.Launcher.launch(Launcher.java:229)
[linux-jdk9] 	at org.codehaus.plexus.classworlds.launcher.Launcher.mainWithExitCode(Launcher.java:415)
[linux-jdk9] 	at org.codehaus.plexus.classworlds.launcher.Launcher.main(Launcher.java:356)
[linux-jdk9] 
[linux-jdk9] [INFO] 
[linux-jdk9] [INFO] --- maven-jar-plugin:3.0.2:jar (default-jar) @ maven-plugin-tools-ant
---
[linux-jdk9] [INFO] Building jar: /home/jenkins/jenkins-slave/workspace/x_maven-plugin-tools_master-XKS4EHY3PSXHGP4DHIXUDAAM6TMAKT3YNFP2XDSSXFM24ZMKWIXQ@2/m/maven-script/maven-plugin-tools-ant/target/maven-plugin-tools-ant-3.5.2.jar
[linux-jdk9] [INFO] 
[linux-jdk9] [INFO] --- maven-site-plugin:3.7.1:attach-descriptor (attach-descriptor) @ maven-plugin-tools-ant
---
[linux-jdk9] [INFO] Skipping because packaging 'jar' is not pom.
[linux-jdk9] [INFO] 
[linux-jdk9] [INFO] --- maven-checkstyle-plugin:3.0.0:check (checkstyle-check) @ maven-plugin-tools-ant
---
[linux-jdk9] [INFO] There is 1 error reported by Checkstyle 6.18 with config/maven_checks.xml
ruleset.
[linux-jdk9] [INFO] Ignored 1 error, 0 violation remaining.
[linux-jdk9] [INFO] 
[linux-jdk9] [INFO] ------------------------------------------------------------------------
[linux-jdk9] [INFO] Building Maven Ant Mojo Support 3.5.2
[linux-jdk9] [INFO] ------------------------------------------------------------------------
[linux-jdk9] [INFO] Downloading from central: https://repo.maven.apache.org/maven2/org/apache/ant/ant/1.7.1/ant-1.7.1.pom
[linux-jdk9] [INFO] Downloaded from central: https://repo.maven.apache.org/maven2/org/apache/ant/ant/1.7.1/ant-1.7.1.pom
(9.8 kB at 651 kB/s)
[linux-jdk9] [INFO] Downloading from central: https://repo.maven.apache.org/maven2/org/apache/ant/ant-parent/1.7.1/ant-parent-1.7.1.pom
[linux-jdk9] [INFO] Downloaded from central: https://repo.maven.apache.org/maven2/org/apache/ant/ant-parent/1.7.1/ant-parent-1.7.1.pom
(4.4 kB at 337 kB/s)
[linux-jdk9] [INFO] Downloading from central: https://repo.maven.apache.org/maven2/org/apache/ant/ant-launcher/1.7.1/ant-launcher-1.7.1.pom
[linux-jdk9] [INFO] Downloaded from central: https://repo.maven.apache.org/maven2/org/apache/ant/ant-launcher/1.7.1/ant-launcher-1.7.1.pom
(2.4 kB at 170 kB/s)
[linux-jdk9] [INFO] Downloading from central: https://repo.maven.apache.org/maven2/org/codehaus/plexus/plexus-ant-factory/1.0-alpha-2.1/plexus-ant-factory-1.0-alpha-2.1.pom
[linux-jdk9] [INFO] Downloaded from central: https://repo.maven.apache.org/maven2/org/codehaus/plexus/plexus-ant-factory/1.0-alpha-2.1/plexus-ant-factory-1.0-alpha-2.1.pom
(1.5 kB at 134 kB/s)
[linux-jdk9] [INFO] Downloading from central: https://repo.maven.apache.org/maven2/org/codehaus/plexus/plexus-component-factories/1.0-alpha-8/plexus-component-factories-1.0-alpha-8.pom
[linux-jdk9] [INFO] Downloaded from central: https://repo.maven.apache.org/maven2/org/codehaus/plexus/plexus-component-factories/1.0-alpha-8/plexus-component-factories-1.0-alpha-8.pom
(878 B at 49 kB/s)
[linux-jdk9] Terminated
[windows-jdk8] [INFO] 
[windows-jdk8] [INFO] --- maven-surefire-plugin:2.21.0:test (default-test) @ maven-script-ant
---
[windows-jdk8] [INFO] 
[windows-jdk8] [INFO] -------------------------------------------------------
[windows-jdk8] [INFO]  T E S T S
[windows-jdk8] [INFO] -------------------------------------------------------
[windows-jdk8] [INFO] Running org.apache.maven.script.ant.AntMojoWrapperTest
[windows-jdk8] 
[windows-jdk8] 
[windows-jdk8] Running: test20StylePlugin
[windows-jdk8] 
[windows-jdk8] 
[windows-jdk8] 
[windows-jdk8] test:
[windows-jdk8] Warning: Reference maven.plugin.classpath has not been set at runtime, but
was found during
[windows-jdk8] build file parsing, attempting to resolve. Future versions of Ant may support
[windows-jdk8]  referencing ids defined in non-executed targets.
[windows-jdk8] 
[windows-jdk8] init-cp:
[windows-jdk8]      [echo] plugin classpath is: F:\jenkins\jenkins-slave\workspace\x_maven-plugin-tools_master-XKS4EHY3PSXHGP4DHIXUDAAM6TMAKT3YNFP2XDSSXFM24ZMKWIXQ\m\maven-script\maven-script-ant\path-is-missing
[windows-jdk8] 
[windows-jdk8] 
[windows-jdk8] test20StylePlugin executed; verifying...
[windows-jdk8] 
[windows-jdk8] 
[windows-jdk8] 
[windows-jdk8] 
[windows-jdk8] Running: test2xStylePlugin
[windows-jdk8] 
[windows-jdk8] 
[windows-jdk8] 
[windows-jdk8] test:
[windows-jdk8] 
[windows-jdk8] init-cp:
[windows-jdk8]      [echo] plugin classpath is: C:\Users\jenkins\AppData\Local\Temp\1\AntMojoWrapperTest.7223023170382495978.test.jar
[windows-jdk8] 
[windows-jdk8] 
[windows-jdk8] test2xStylePlugin executed; verifying...
[windows-jdk8] 
[windows-jdk8] 
[windows-jdk8] [INFO] Tests run: 2, Failures: 0, Errors: 0, Skipped: 0, Time elapsed: 0.784
s - in org.apache.maven.script.ant.AntMojoWrapperTest
[windows-jdk8] [INFO] 
[windows-jdk8] [INFO] Results:
[windows-jdk8] [INFO] 
[windows-jdk8] [INFO] Tests run: 2, Failures: 0, Errors: 0, Skipped: 0
[windows-jdk8] [INFO] 
[windows-jdk8] [INFO] 
[windows-jdk8] [INFO] --- maven-jar-plugin:3.0.2:jar (default-jar) @ maven-script-ant ---
[windows-jdk8] [INFO] Building jar: F:\jenkins\jenkins-slave\workspace\x_maven-plugin-tools_master-XKS4EHY3PSXHGP4DHIXUDAAM6TMAKT3YNFP2XDSSXFM24ZMKWIXQ\m\maven-script\maven-script-ant\target\maven-script-ant-3.5.2.jar
[windows-jdk8] [INFO] 
[windows-jdk8] [INFO] --- maven-site-plugin:3.7.1:attach-descriptor (attach-descriptor) @
maven-script-ant ---
[windows-jdk8] [INFO] Skipping because packaging 'jar' is not pom.
[windows-jdk8] [INFO] 
[windows-jdk8] [INFO] --- maven-checkstyle-plugin:3.0.0:check (checkstyle-check) @ maven-script-ant
---
[windows-jdk9] Sending interrupt signal to process
[windows-jdk8] Sending interrupt signal to process
[windows-jdk9] [INFO] Installing f:\jenkins\jenkins-slave\workspace\x_maven-plugin-tools_master-XKS4EHY3PSXHGP4DHIXUDAAM6TMAKT3YNFP2XDSSXFM24ZMKWIXQ@2\m\pom.xml
to F:\jenkins\jenkins-slave\workspace\x_maven-plugin-tools_master-XKS4EHY3PSXHGP4DHIXUDAAM6TMAKT3YNFP2XDSSXFM24ZMKWIXQ@2\m\maven-plugin-plugin\target\local-repo\org\apache\maven\plugin-tools\maven-plugin-tools\3.5.2\maven-plugin-tools-3.5.2.pom
[windows-jdk9] [INFO] Installing f:\jenkins\jenkins-slave\workspace\x_maven-plugin-tools_master-XKS4EHY3PSXHGP4DHIXUDAAM6TMAKT3YNFP2XDSSXFM24ZMKWIXQ@2\m\target\maven-plugin-tools-3.5.2-site.xml
to F:\jenkins\jenkins-slave\workspace\x_maven-plugin-tools_master-XKS4EHY3PSXHGP4DHIXUDAAM6TMAKT3YNFP2XDSSXFM24ZMKWIXQ@2\m\maven-plugin-plugin\target\local-repo\org\apache\maven\plugin-tools\maven-plugin-tools\3.5.2\maven-plugin-tools-3.5.2-site.xml
[windows-jdk9] [INFO] Installing F:\jenkins\jenkins-slave\workspace\x_maven-plugin-tools_master-XKS4EHY3PSXHGP4DHIXUDAAM6TMAKT3YNFP2XDSSXFM24ZMKWIXQ@2\m\maven-plugin-tools-api\pom.xml
to F:\jenkins\jenkins-slave\workspace\x_maven-plugin-tools_master-XKS4EHY3PSXHGP4DHIXUDAAM6TMAKT3YNFP2XDSSXFM24ZMKWIXQ@2\m\maven-plugin-plugin\target\local-repo\org\apache\maven\plugin-tools\maven-plugin-tools-api\3.5.2\maven-plugin-tools-api-3.5.2.pom
[windows-jdk9] [INFO] Installing F:\jenkins\jenkins-slave\workspace\x_maven-plugin-tools_master-XKS4EHY3PSXHGP4DHIXUDAAM6TMAKT3YNFP2XDSSXFM24ZMKWIXQ@2\m\maven-plugin-tools-api\target\maven-plugin-tools-api-3.5.2.jar
to F:\jenkins\jenkins-slave\workspace\x_maven-plugin-tools_master-XKS4EHY3PSXHGP4DHIXUDAAM6TMAKT3YNFP2XDSSXFM24ZMKWIXQ@2\m\maven-plugin-plugin\target\local-repo\org\apache\maven\plugin-tools\maven-plugin-tools-api\3.5.2\maven-plugin-tools-api-3.5.2.jar
[windows-jdk9] [INFO] Installing F:\jenkins\jenkins-slave\workspace\x_maven-plugin-tools_master-XKS4EHY3PSXHGP4DHIXUDAAM6TMAKT3YNFP2XDSSXFM24ZMKWIXQ@2\m\maven-plugin-tools-generators\pom.xml
to F:\jenkins\jenkins-slave\workspace\x_maven-plugin-tools_master-XKS4EHY3PSXHGP4DHIXUDAAM6TMAKT3YNFP2XDSSXFM24ZMKWIXQ@2\m\maven-plugin-plugin\target\local-repo\org\apache\maven\plugin-tools\maven-plugin-tools-generators\3.5.2\maven-plugin-tools-generators-3.5.2.pom
[windows-jdk9] [INFO] Installing F:\jenkins\jenkins-slave\workspace\x_maven-plugin-tools_master-XKS4EHY3PSXHGP4DHIXUDAAM6TMAKT3YNFP2XDSSXFM24ZMKWIXQ@2\m\maven-plugin-tools-generators\target\maven-plugin-tools-generators-3.5.2.jar
to F:\jenkins\jenkins-slave\workspace\x_maven-plugin-tools_master-XKS4EHY3PSXHGP4DHIXUDAAM6TMAKT3YNFP2XDSSXFM24ZMKWIXQ@2\m\maven-plugin-plugin\target\local-repo\org\apache\maven\plugin-tools\maven-plugin-tools-generators\3.5.2\maven-plugin-tools-generators-3.5.2.jar
[windows-jdk9] [INFO] Installing F:\jenkins\jenkins-slave\workspace\x_maven-plugin-tools_master-XKS4EHY3PSXHGP4DHIXUDAAM6TMAKT3YNFP2XDSSXFM24ZMKWIXQ@2\m\maven-plugin-tools-java\pom.xml
to F:\jenkins\jenkins-slave\workspace\x_maven-plugin-tools_master-XKS4EHY3PSXHGP4DHIXUDAAM6TMAKT3YNFP2XDSSXFM24ZMKWIXQ@2\m\maven-plugin-plugin\target\local-repo\org\apache\maven\plugin-tools\maven-plugin-tools-java\3.5.2\maven-plugin-tools-java-3.5.2.pom
[windows-jdk9] [INFO] Installing F:\jenkins\jenkins-slave\workspace\x_maven-plugin-tools_master-XKS4EHY3PSXHGP4DHIXUDAAM6TMAKT3YNFP2XDSSXFM24ZMKWIXQ@2\m\maven-plugin-tools-java\target\maven-plugin-tools-java-3.5.2.jar
to F:\jenkins\jenkins-slave\workspace\x_maven-plugin-tools_master-XKS4EHY3PSXHGP4DHIXUDAAM6TMAKT3YNFP2XDSSXFM24ZMKWIXQ@2\m\maven-plugin-plugin\target\local-repo\org\apache\maven\plugin-tools\maven-plugin-tools-java\3.5.2\maven-plugin-tools-java-3.5.2.jar
[windows-jdk9] [INFO] Installing F:\jenkins\jenkins-slave\workspace\x_maven-plugin-tools_master-XKS4EHY3PSXHGP4DHIXUDAAM6TMAKT3YNFP2XDSSXFM24ZMKWIXQ@2\m\maven-plugin-annotations\pom.xml
to F:\jenkins\jenkins-slave\workspace\x_maven-plugin-tools_master-XKS4EHY3PSXHGP4DHIXUDAAM6TMAKT3YNFP2XDSSXFM24ZMKWIXQ@2\m\maven-plugin-plugin\target\local-repo\org\apache\maven\plugin-tools\maven-plugin-annotations\3.5.2\maven-plugin-annotations-3.5.2.pom
[windows-jdk9] [INFO] Installing F:\jenkins\jenkins-slave\workspace\x_maven-plugin-tools_master-XKS4EHY3PSXHGP4DHIXUDAAM6TMAKT3YNFP2XDSSXFM24ZMKWIXQ@2\m\maven-plugin-annotations\target\maven-plugin-annotations-3.5.2.jar
to F:\jenkins\jenkins-slave\workspace\x_maven-plugin-tools_master-XKS4EHY3PSXHGP4DHIXUDAAM6TMAKT3YNFP2XDSSXFM24ZMKWIXQ@2\m\maven-plugin-plugin\target\local-repo\org\apache\maven\plugin-tools\maven-plugin-annotations\3.5.2\maven-plugin-annotations-3.5.2.jar
[windows-jdk9] [INFO] Installing F:\jenkins\jenkins-slave\workspace\x_maven-plugin-tools_master-XKS4EHY3PSXHGP4DHIXUDAAM6TMAKT3YNFP2XDSSXFM24ZMKWIXQ@2\m\maven-plugin-tools-annotations\pom.xml
to F:\jenkins\jenkins-slave\workspace\x_maven-plugin-tools_master-XKS4EHY3PSXHGP4DHIXUDAAM6TMAKT3YNFP2XDSSXFM24ZMKWIXQ@2\m\maven-plugin-plugin\target\local-repo\org\apache\maven\plugin-tools\maven-plugin-tools-annotations\3.5.2\maven-plugin-tools-annotations-3.5.2.pom
[windows-jdk9] [INFO] Installing F:\jenkins\jenkins-slave\workspace\x_maven-plugin-tools_master-XKS4EHY3PSXHGP4DHIXUDAAM6TMAKT3YNFP2XDSSXFM24ZMKWIXQ@2\m\maven-plugin-tools-annotations\target\maven-plugin-tools-annotations-3.5.2.jar
to F:\jenkins\jenkins-slave\workspace\x_maven-plugin-tools_master-XKS4EHY3PSXHGP4DHIXUDAAM6TMAKT3YNFP2XDSSXFM24ZMKWIXQ@2\m\maven-plugin-plugin\target\local-repo\org\apache\maven\plugin-tools\maven-plugin-tools-annotations\3.5.2\maven-plugin-tools-annotations-3.5.2.jar
[windows-jdk9] [INFO] Installing F:\jenkins\jenkins-slave\workspace\x_maven-plugin-tools_master-XKS4EHY3PSXHGP4DHIXUDAAM6TMAKT3YNFP2XDSSXFM24ZMKWIXQ@2\m\maven-plugin-tools-annotations\target\maven-plugin-tools-annotations-3.5.2-tests.jar
to F:\jenkins\jenkins-slave\workspace\x_maven-plugin-tools_master-XKS4EHY3PSXHGP4DHIXUDAAM6TMAKT3YNFP2XDSSXFM24ZMKWIXQ@2\m\maven-plugin-plugin\target\local-repo\org\apache\maven\plugin-tools\maven-plugin-tools-annotations\3.5.2\maven-plugin-tools-annotations-3.5.2-tests.jar
[windows-jdk9] [INFO] Installing F:\jenkins\jenkins-slave\workspace\x_maven-plugin-tools_master-XKS4EHY3PSXHGP4DHIXUDAAM6TMAKT3YNFP2XDSSXFM24ZMKWIXQ@2\m\maven-plugin-tools-annotations\target\maven-plugin-tools-annotations-3.5.2-test-sources.jar
to F:\jenkins\jenkins-slave\workspace\x_maven-plugin-tools_master-XKS4EHY3PSXHGP4DHIXUDAAM6TMAKT3YNFP2XDSSXFM24ZMKWIXQ@2\m\maven-plugin-plugin\target\local-repo\org\apache\maven\plugin-tools\maven-plugin-tools-annotations\3.5.2\maven-plugin-tools-annotations-3.5.2-test-sources.jar
[windows-jdk9] [INFO] Installing F:\jenkins\jenkins-slave\workspace\x_maven-plugin-tools_master-XKS4EHY3PSXHGP4DHIXUDAAM6TMAKT3YNFP2XDSSXFM24ZMKWIXQ@2\m\maven-plugin-tools-javadoc\pom.xml
to F:\jenkins\jenkins-slave\workspace\x_maven-plugin-tools_master-XKS4EHY3PSXHGP4DHIXUDAAM6TMAKT3YNFP2XDSSXFM24ZMKWIXQ@2\m\maven-plugin-plugin\target\local-repo\org\apache\maven\plugin-tools\maven-plugin-tools-javadoc\3.5.2\maven-plugin-tools-javadoc-3.5.2.pom
[windows-jdk9] [INFO] Installing F:\jenkins\jenkins-slave\workspace\x_maven-plugin-tools_master-XKS4EHY3PSXHGP4DHIXUDAAM6TMAKT3YNFP2XDSSXFM24ZMKWIXQ@2\m\maven-plugin-tools-javadoc\target\maven-plugin-tools-javadoc-3.5.2.jar
to F:\jenkins\jenkins-slave\workspace\x_maven-plugin-tools_master-XKS4EHY3PSXHGP4DHIXUDAAM6TMAKT3YNFP2XDSSXFM24ZMKWIXQ@2\m\maven-plugin-plugin\target\local-repo\org\apache\maven\plugin-tools\maven-plugin-tools-javadoc\3.5.2\maven-plugin-tools-javadoc-3.5.2.jar
[windows-jdk9] [INFO] Installing F:\jenkins\jenkins-slave\workspace\x_maven-plugin-tools_master-XKS4EHY3PSXHGP4DHIXUDAAM6TMAKT3YNFP2XDSSXFM24ZMKWIXQ@2\m\maven-script\pom.xml
to F:\jenkins\jenkins-slave\workspace\x_maven-plugin-tools_master-XKS4EHY3PSXHGP4DHIXUDAAM6TMAKT3YNFP2XDSSXFM24ZMKWIXQ@2\m\maven-plugin-plugin\target\local-repo\org\apache\maven\plugin-tools\maven-script\3.5.2\maven-script-3.5.2.pom
[windows-jdk9] [INFO] Installing F:\jenkins\jenkins-slave\workspace\x_maven-plugin-tools_master-XKS4EHY3PSXHGP4DHIXUDAAM6TMAKT3YNFP2XDSSXFM24ZMKWIXQ@2\m\maven-script\target\maven-script-3.5.2-site.xml
to F:\jenkins\jenkins-slave\workspace\x_maven-plugin-tools_master-XKS4EHY3PSXHGP4DHIXUDAAM6TMAKT3YNFP2XDSSXFM24ZMKWIXQ@2\m\maven-plugin-plugin\target\local-repo\org\apache\maven\plugin-tools\maven-script\3.5.2\maven-script-3.5.2-site.xml
[windows-jdk9] [INFO] Installing F:\jenkins\jenkins-slave\workspace\x_maven-plugin-tools_master-XKS4EHY3PSXHGP4DHIXUDAAM6TMAKT3YNFP2XDSSXFM24ZMKWIXQ@2\m\maven-script\maven-plugin-tools-model\pom.xml
to F:\jenkins\jenkins-slave\workspace\x_maven-plugin-tools_master-XKS4EHY3PSXHGP4DHIXUDAAM6TMAKT3YNFP2XDSSXFM24ZMKWIXQ@2\m\maven-plugin-plugin\target\local-repo\org\apache\maven\plugin-tools\maven-plugin-tools-model\3.5.2\maven-plugin-tools-model-3.5.2.pom
[windows-jdk9] [INFO] Installing F:\jenkins\jenkins-slave\workspace\x_maven-plugin-tools_master-XKS4EHY3PSXHGP4DHIXUDAAM6TMAKT3YNFP2XDSSXFM24ZMKWIXQ@2\m\maven-script\maven-plugin-tools-model\target\maven-plugin-tools-model-3.5.2.jar
to F:\jenkins\jenkins-slave\workspace\x_maven-plugin-tools_master-XKS4EHY3PSXHGP4DHIXUDAAM6TMAKT3YNFP2XDSSXFM24ZMKWIXQ@2\m\maven-plugin-plugin\target\local-repo\org\apache\maven\plugin-tools\maven-plugin-tools-model\3.5.2\maven-plugin-tools-model-3.5.2.jar
[windows-jdk9] [INFO] Installing F:\jenkins\jenkins-slave\workspace\x_maven-plugin-tools_master-XKS4EHY3PSXHGP4DHIXUDAAM6TMAKT3YNFP2XDSSXFM24ZMKWIXQ@2\m\maven-script\maven-plugin-tools-ant\pom.xml
to F:\jenkins\jenkins-slave\workspace\x_maven-plugin-tools_master-XKS4EHY3PSXHGP4DHIXUDAAM6TMAKT3YNFP2XDSSXFM24ZMKWIXQ@2\m\maven-plugin-plugin\target\local-repo\org\apache\maven\plugin-tools\maven-plugin-tools-ant\3.5.2\maven-plugin-tools-ant-3.5.2.pom
[windows-jdk9] [INFO] Installing F:\jenkins\jenkins-slave\workspace\x_maven-plugin-tools_master-XKS4EHY3PSXHGP4DHIXUDAAM6TMAKT3YNFP2XDSSXFM24ZMKWIXQ@2\m\maven-script\maven-plugin-tools-ant\target\maven-plugin-tools-ant-3.5.2.jar
to F:\jenkins\jenkins-slave\workspace\x_maven-plugin-tools_master-XKS4EHY3PSXHGP4DHIXUDAAM6TMAKT3YNFP2XDSSXFM24ZMKWIXQ@2\m\maven-plugin-plugin\target\local-repo\org\apache\maven\plugin-tools\maven-plugin-tools-ant\3.5.2\maven-plugin-tools-ant-3.5.2.jar
[windows-jdk9] [INFO] Installing F:\jenkins\jenkins-slave\workspace\x_maven-plugin-tools_master-XKS4EHY3PSXHGP4DHIXUDAAM6TMAKT3YNFP2XDSSXFM24ZMKWIXQ@2\m\maven-script\maven-script-ant\pom.xml
to F:\jenkins\jenkins-slave\workspace\x_maven-plugin-tools_master-XKS4EHY3PSXHGP4DHIXUDAAM6TMAKT3YNFP2XDSSXFM24ZMKWIXQ@2\m\maven-plugin-plugin\target\local-repo\org\apache\maven\plugin-tools\maven-script-ant\3.5.2\maven-script-ant-3.5.2.pom
[Pipeline] [windows-jdk10] // node
[Pipeline] [windows-jdk10] }
[Pipeline] [linux-jdk7] }
[Pipeline] [linux-jdk9] }
[Pipeline] [linux-jdk8] }
[Pipeline] [windows-jdk9] }
[Pipeline] [linux-jdk7] // dir
[Pipeline] [linux-jdk9] // dir
[Pipeline] [linux-jdk8] // dir
[Pipeline] [linux-jdk7] }
[linux-jdk7] [withMaven] One or multiple Maven executions have been ignored by the Jenkins
Pipeline Maven Plugin because they have been interrupted before completion (1). See Pipeline
Maven Plugin FAQ for more details.
[Pipeline] [linux-jdk9] }
[linux-jdk9] [withMaven] One or multiple Maven executions have been ignored by the Jenkins
Pipeline Maven Plugin because they have been interrupted before completion (1). See Pipeline
Maven Plugin FAQ for more details.
[Pipeline] [linux-jdk8] }
[linux-jdk8] [withMaven] One or multiple Maven executions have been ignored by the Jenkins
Pipeline Maven Plugin because they have been interrupted before completion (1). See Pipeline
Maven Plugin FAQ for more details.
[Pipeline] [windows-jdk9] // dir
[Pipeline] [windows-jdk9] }
[windows-jdk9] [withMaven] One or multiple Maven executions have been ignored by the Jenkins
Pipeline Maven Plugin because they have been interrupted before completion (1). See Pipeline
Maven Plugin FAQ for more details.
[Pipeline] [linux-jdk7] // withMaven
[Pipeline] [linux-jdk9] // withMaven
[Pipeline] [linux-jdk8] // withMaven
[Pipeline] [linux-jdk7] echo
[linux-jdk7] [FAIL FAST] linux-jdk10 had first failure, ignoring script returned exit code
143
[Pipeline] [linux-jdk7] }
[Pipeline] [linux-jdk9] echo
[linux-jdk9] [FAIL FAST] linux-jdk10 had first failure, ignoring script returned exit code
143
[Pipeline] [linux-jdk9] }
[Pipeline] [linux-jdk8] echo
[linux-jdk8] [FAIL FAST] linux-jdk10 had first failure, ignoring script returned exit code
143
[Pipeline] [linux-jdk8] }
[Pipeline] [windows-jdk9] // withMaven
[Pipeline] [windows-jdk9] }
[Pipeline] [linux-jdk7] // stage
[Pipeline] [linux-jdk9] // stage
[Pipeline] [linux-jdk8] // stage
[Pipeline] [linux-jdk7] }
[Pipeline] [linux-jdk8] }
[Pipeline] [linux-jdk9] }
[Pipeline] [windows-jdk9] // stage
[Pipeline] [windows-jdk9] }
[Pipeline] [linux-jdk7] // node
[Pipeline] [linux-jdk8] // node
[Pipeline] [linux-jdk9] // node
[Pipeline] [linux-jdk7] }
[Pipeline] [linux-jdk8] }
[Pipeline] [linux-jdk9] }
[Pipeline] [windows-jdk9] // node
[Pipeline] [windows-jdk9] }
[windows-jdk7] After 10s process did not stop
[Pipeline] [windows-jdk7] }
[Pipeline] [windows-jdk7] // dir
[Pipeline] [windows-jdk7] }
[windows-jdk7] [withMaven] One or multiple Maven executions have been ignored by the Jenkins
Pipeline Maven Plugin because they have been interrupted before completion (1). See Pipeline
Maven Plugin FAQ for more details.
[Pipeline] [windows-jdk7] // withMaven
[Pipeline] [windows-jdk7] echo
[windows-jdk7] [FAIL FAST] linux-jdk10 had first failure, ignoring null
[Pipeline] [windows-jdk7] }
[Pipeline] [windows-jdk7] // stage
[Pipeline] [windows-jdk7] }
[Pipeline] [windows-jdk7] // node
[Pipeline] [windows-jdk7] }
[windows-jdk8] After 10s process did not stop
[Pipeline] [windows-jdk8] }
[Pipeline] [windows-jdk8] // dir
[Pipeline] [windows-jdk8] }
[windows-jdk8] [withMaven] One or multiple Maven executions have been ignored by the Jenkins
Pipeline Maven Plugin because they have been interrupted before completion (1). See Pipeline
Maven Plugin FAQ for more details.
[Pipeline] [windows-jdk8] // withMaven
[Pipeline] [windows-jdk8] echo
[windows-jdk8] [FAIL FAST] linux-jdk10 had first failure, ignoring null
[Pipeline] [windows-jdk8] }
[Pipeline] [windows-jdk8] // stage
[Pipeline] [windows-jdk8] }
[Pipeline] [windows-jdk8] // node
[Pipeline] [windows-jdk8] }
[Pipeline] // parallel
[Pipeline] echo
***** FAST FAILURE *****

Fast failure triggered by linux-jdk10

***** FAST FAILURE *****
[Pipeline] stage
[Pipeline] { (Notifications)
[Pipeline] echo
Build result: FAILURE
[Pipeline] jiraIssueSelector
Mime
  • Unnamed multipart/mixed (inline, None, 0 bytes)
View raw message