maven-notifications mailing list archives

Site index · List index
Message view « Date » · « Thread »
Top « Date » · « Thread »
From Apache Jenkins Server <jenk...@builds.apache.org>
Subject Build unstable in Jenkins: Maven TLP » maven-archetype » master #7
Date Mon, 18 Jun 2018 22:10:41 GMT
See https://builds.apache.org/job/maven-box/job/maven-archetype/job/master/7/

Changes:

* [INFRA-16467] move components documentation out of CMS space
* [INFRA-16467] move components documentation out of CMS space
* [INFRA-16467] move components documentation out of CMS space
* [INFRA-16467] move components documentation out of CMS space
* [INFRA-16467] move components documentation out of CMS space
* [INFRA-16467] move components documentation out of CMS space
* [INFRA-16467] move components documentation out of CMS space
* [INFRA-16467] move components documentation out of CMS space

28 tests failed.
FAILED:  org.apache.maven.archetype.creator.DefaultArchetypeCreatorIT.testIncludeFileWithNoExtension

Error Message:
Invoker process ended with result different than 0!

Stack Trace:
java.lang.Exception: Invoker process ended with result different than 0!
	at org.apache.maven.archetype.creator.DefaultArchetypeCreatorIT.createFilesetArchetype(DefaultArchetypeCreatorIT.java:136)
	at org.apache.maven.archetype.creator.DefaultArchetypeCreatorIT.testIncludeFileWithNoExtension(DefaultArchetypeCreatorIT.java:189)


FAILED:  org.apache.maven.archetype.creator.DefaultArchetypeCreatorIT.testSystemPropertiesAreIncluded

Error Message:
Invoker process ended with result different than 0!

Stack Trace:
java.lang.Exception: Invoker process ended with result different than 0!
	at org.apache.maven.archetype.creator.DefaultArchetypeCreatorIT.createFilesetArchetype(DefaultArchetypeCreatorIT.java:136)
	at org.apache.maven.archetype.creator.DefaultArchetypeCreatorIT.testSystemPropertiesAreIncluded(DefaultArchetypeCreatorIT.java:200)


FAILED:  org.apache.maven.archetype.creator.DefaultArchetypeCreatorIT.testCreateFilesetArchetype1

Error Message:
Invoker process ended with result different than 0!

Stack Trace:
java.lang.Exception: Invoker process ended with result different than 0!
	at org.apache.maven.archetype.creator.DefaultArchetypeCreatorIT.createFilesetArchetype(DefaultArchetypeCreatorIT.java:136)
	at org.apache.maven.archetype.creator.DefaultArchetypeCreatorIT.testCreateFilesetArchetype1(DefaultArchetypeCreatorIT.java:211)


FAILED:  org.apache.maven.archetype.creator.DefaultArchetypeCreatorIT.testCreateFilesetArchetype2

Error Message:
Invoker process ended with result different than 0!

Stack Trace:
java.lang.Exception: Invoker process ended with result different than 0!
	at org.apache.maven.archetype.creator.DefaultArchetypeCreatorIT.createFilesetArchetype(DefaultArchetypeCreatorIT.java:136)
	at org.apache.maven.archetype.creator.DefaultArchetypeCreatorIT.testCreateFilesetArchetype2(DefaultArchetypeCreatorIT.java:225)


FAILED:  org.apache.maven.archetype.creator.DefaultArchetypeCreatorIT.testCreateFilesetArchetype3

Error Message:
Invoker process ended with result different than 0!

Stack Trace:
java.lang.Exception: Invoker process ended with result different than 0!
	at org.apache.maven.archetype.creator.DefaultArchetypeCreatorIT.createFilesetArchetype(DefaultArchetypeCreatorIT.java:136)
	at org.apache.maven.archetype.creator.DefaultArchetypeCreatorIT.testCreateFilesetArchetype3(DefaultArchetypeCreatorIT.java:233)


FAILED:  org.apache.maven.archetype.creator.DefaultArchetypeCreatorIT.testCreateFilesetArchetype4

Error Message:
Invoker process ended with result different than 0!

Stack Trace:
java.lang.Exception: Invoker process ended with result different than 0!
	at org.apache.maven.archetype.creator.DefaultArchetypeCreatorIT.createFilesetArchetype(DefaultArchetypeCreatorIT.java:136)
	at org.apache.maven.archetype.creator.DefaultArchetypeCreatorIT.testCreateFilesetArchetype4(DefaultArchetypeCreatorIT.java:398)


FAILED:  org.apache.maven.archetype.creator.DefaultArchetypeCreatorIT.testCreateFilesetArchetype5

Error Message:
Invoker process ended with result different than 0!

Stack Trace:
java.lang.Exception: Invoker process ended with result different than 0!
	at org.apache.maven.archetype.creator.DefaultArchetypeCreatorIT.createFilesetArchetype(DefaultArchetypeCreatorIT.java:136)
	at org.apache.maven.archetype.creator.DefaultArchetypeCreatorIT.testCreateFilesetArchetype5(DefaultArchetypeCreatorIT.java:429)


FAILED:  org.apache.maven.archetype.creator.DefaultArchetypeCreatorIT.testCreateFilesetArchetype6

Error Message:
Invoker process ended with result different than 0!

Stack Trace:
java.lang.Exception: Invoker process ended with result different than 0!
	at org.apache.maven.archetype.creator.DefaultArchetypeCreatorIT.createFilesetArchetype(DefaultArchetypeCreatorIT.java:136)
	at org.apache.maven.archetype.creator.DefaultArchetypeCreatorIT.testCreateFilesetArchetype6(DefaultArchetypeCreatorIT.java:445)


FAILED:  org.apache.maven.archetype.creator.DefaultArchetypeCreatorIT.testExcludePatternsMustExcludeDirectory

Error Message:
Invoker process ended with result different than 0!

Stack Trace:
java.lang.Exception: Invoker process ended with result different than 0!
	at org.apache.maven.archetype.creator.DefaultArchetypeCreatorIT.createFilesetArchetype(DefaultArchetypeCreatorIT.java:136)
	at org.apache.maven.archetype.creator.DefaultArchetypeCreatorIT.testExcludePatternsMustExcludeDirectory(DefaultArchetypeCreatorIT.java:163)


FAILED:  org.apache.maven.archetype.creator.DefaultArchetypeCreatorIT.testExcludePatternsContainingFilesSameExtension

Error Message:
Invoker process ended with result different than 0!

Stack Trace:
java.lang.Exception: Invoker process ended with result different than 0!
	at org.apache.maven.archetype.creator.DefaultArchetypeCreatorIT.createFilesetArchetype(DefaultArchetypeCreatorIT.java:136)
	at org.apache.maven.archetype.creator.DefaultArchetypeCreatorIT.testExcludePatternsContainingFilesSameExtension(DefaultArchetypeCreatorIT.java:177)


FAILED:  org.apache.maven.archetype.creator.DefaultArchetypeCreatorIT.testChangeJavaFilenameWhenCustomPropertyEqualsClassName

Error Message:
Invoker process ended with result different than 0!

Stack Trace:
java.lang.Exception: Invoker process ended with result different than 0!
	at org.apache.maven.archetype.creator.DefaultArchetypeCreatorIT.createFilesetArchetype(DefaultArchetypeCreatorIT.java:136)
	at org.apache.maven.archetype.creator.DefaultArchetypeCreatorIT.testChangeJavaFilenameWhenCustomPropertyEqualsClassName(DefaultArchetypeCreatorIT.java:151)


FAILED:  org.apache.maven.archetype.creator.DefaultArchetypeCreatorIT.testIncludeFileWithNoExtension

Error Message:
Invoker process ended with result different than 0!

Stack Trace:
java.lang.Exception: Invoker process ended with result different than 0!
	at org.apache.maven.archetype.creator.DefaultArchetypeCreatorIT.createFilesetArchetype(DefaultArchetypeCreatorIT.java:136)
	at org.apache.maven.archetype.creator.DefaultArchetypeCreatorIT.testIncludeFileWithNoExtension(DefaultArchetypeCreatorIT.java:189)


FAILED:  org.apache.maven.archetype.creator.DefaultArchetypeCreatorIT.testSystemPropertiesAreIncluded

Error Message:
Invoker process ended with result different than 0!

Stack Trace:
java.lang.Exception: Invoker process ended with result different than 0!
	at org.apache.maven.archetype.creator.DefaultArchetypeCreatorIT.createFilesetArchetype(DefaultArchetypeCreatorIT.java:136)
	at org.apache.maven.archetype.creator.DefaultArchetypeCreatorIT.testSystemPropertiesAreIncluded(DefaultArchetypeCreatorIT.java:200)


FAILED:  org.apache.maven.archetype.creator.DefaultArchetypeCreatorIT.testCreateFilesetArchetype1

Error Message:
Invoker process ended with result different than 0!

Stack Trace:
java.lang.Exception: Invoker process ended with result different than 0!
	at org.apache.maven.archetype.creator.DefaultArchetypeCreatorIT.createFilesetArchetype(DefaultArchetypeCreatorIT.java:136)
	at org.apache.maven.archetype.creator.DefaultArchetypeCreatorIT.testCreateFilesetArchetype1(DefaultArchetypeCreatorIT.java:211)


FAILED:  org.apache.maven.archetype.creator.DefaultArchetypeCreatorIT.testCreateFilesetArchetype2

Error Message:
Invoker process ended with result different than 0!

Stack Trace:
java.lang.Exception: Invoker process ended with result different than 0!
	at org.apache.maven.archetype.creator.DefaultArchetypeCreatorIT.createFilesetArchetype(DefaultArchetypeCreatorIT.java:136)
	at org.apache.maven.archetype.creator.DefaultArchetypeCreatorIT.testCreateFilesetArchetype2(DefaultArchetypeCreatorIT.java:225)


FAILED:  org.apache.maven.archetype.creator.DefaultArchetypeCreatorIT.testCreateFilesetArchetype3

Error Message:
Invoker process ended with result different than 0!

Stack Trace:
java.lang.Exception: Invoker process ended with result different than 0!
	at org.apache.maven.archetype.creator.DefaultArchetypeCreatorIT.createFilesetArchetype(DefaultArchetypeCreatorIT.java:136)
	at org.apache.maven.archetype.creator.DefaultArchetypeCreatorIT.testCreateFilesetArchetype3(DefaultArchetypeCreatorIT.java:233)


FAILED:  org.apache.maven.archetype.creator.DefaultArchetypeCreatorIT.testCreateFilesetArchetype4

Error Message:
Invoker process ended with result different than 0!

Stack Trace:
java.lang.Exception: Invoker process ended with result different than 0!
	at org.apache.maven.archetype.creator.DefaultArchetypeCreatorIT.createFilesetArchetype(DefaultArchetypeCreatorIT.java:136)
	at org.apache.maven.archetype.creator.DefaultArchetypeCreatorIT.testCreateFilesetArchetype4(DefaultArchetypeCreatorIT.java:398)


FAILED:  org.apache.maven.archetype.creator.DefaultArchetypeCreatorIT.testCreateFilesetArchetype5

Error Message:
Invoker process ended with result different than 0!

Stack Trace:
java.lang.Exception: Invoker process ended with result different than 0!
	at org.apache.maven.archetype.creator.DefaultArchetypeCreatorIT.createFilesetArchetype(DefaultArchetypeCreatorIT.java:136)
	at org.apache.maven.archetype.creator.DefaultArchetypeCreatorIT.testCreateFilesetArchetype5(DefaultArchetypeCreatorIT.java:429)


FAILED:  org.apache.maven.archetype.creator.DefaultArchetypeCreatorIT.testCreateFilesetArchetype6

Error Message:
Invoker process ended with result different than 0!

Stack Trace:
java.lang.Exception: Invoker process ended with result different than 0!
	at org.apache.maven.archetype.creator.DefaultArchetypeCreatorIT.createFilesetArchetype(DefaultArchetypeCreatorIT.java:136)
	at org.apache.maven.archetype.creator.DefaultArchetypeCreatorIT.testCreateFilesetArchetype6(DefaultArchetypeCreatorIT.java:445)


FAILED:  org.apache.maven.archetype.creator.DefaultArchetypeCreatorIT.testExcludePatternsMustExcludeDirectory

Error Message:
Invoker process ended with result different than 0!

Stack Trace:
java.lang.Exception: Invoker process ended with result different than 0!
	at org.apache.maven.archetype.creator.DefaultArchetypeCreatorIT.createFilesetArchetype(DefaultArchetypeCreatorIT.java:136)
	at org.apache.maven.archetype.creator.DefaultArchetypeCreatorIT.testExcludePatternsMustExcludeDirectory(DefaultArchetypeCreatorIT.java:163)


FAILED:  org.apache.maven.archetype.creator.DefaultArchetypeCreatorIT.testExcludePatternsContainingFilesSameExtension

Error Message:
Invoker process ended with result different than 0!

Stack Trace:
java.lang.Exception: Invoker process ended with result different than 0!
	at org.apache.maven.archetype.creator.DefaultArchetypeCreatorIT.createFilesetArchetype(DefaultArchetypeCreatorIT.java:136)
	at org.apache.maven.archetype.creator.DefaultArchetypeCreatorIT.testExcludePatternsContainingFilesSameExtension(DefaultArchetypeCreatorIT.java:177)


FAILED:  org.apache.maven.archetype.creator.DefaultArchetypeCreatorIT.testChangeJavaFilenameWhenCustomPropertyEqualsClassName

Error Message:
Invoker process ended with result different than 0!

Stack Trace:
java.lang.Exception: Invoker process ended with result different than 0!
	at org.apache.maven.archetype.creator.DefaultArchetypeCreatorIT.createFilesetArchetype(DefaultArchetypeCreatorIT.java:136)
	at org.apache.maven.archetype.creator.DefaultArchetypeCreatorIT.testChangeJavaFilenameWhenCustomPropertyEqualsClassName(DefaultArchetypeCreatorIT.java:151)


FAILED:  org.apache.maven.archetype.test.ArchetyperRoundtripIT.testArchetyper

Error Message:
Invoker process ended with result different than 0!

Stack Trace:
java.lang.Exception: Invoker process ended with result different than 0!
	at org.apache.maven.archetype.test.ArchetyperRoundtripIT.testArchetyper(ArchetyperRoundtripIT.java:121)


FAILED:  org.apache.maven.archetype.test.ArchetyperRoundtripIT.testArchetyper

Error Message:
Invoker process ended with result different than 0!

Stack Trace:
java.lang.Exception: Invoker process ended with result different than 0!
	at org.apache.maven.archetype.test.ArchetyperRoundtripIT.testArchetyper(ArchetyperRoundtripIT.java:121)


FAILED:  org.apache.maven.archetype.test.ArchetyperRoundtripWithProxyIT.testArchetyper

Error Message:
Invoker process ended with result different than 0!

Stack Trace:
java.lang.Exception: Invoker process ended with result different than 0!
	at org.apache.maven.archetype.test.ArchetyperRoundtripWithProxyIT.testArchetyper(ArchetyperRoundtripWithProxyIT.java:126)


FAILED:  org.apache.maven.archetype.test.ArchetyperRoundtripWithProxyIT.testArchetyper

Error Message:
Invoker process ended with result different than 0!

Stack Trace:
java.lang.Exception: Invoker process ended with result different than 0!
	at org.apache.maven.archetype.test.ArchetyperRoundtripWithProxyIT.testArchetyper(ArchetyperRoundtripWithProxyIT.java:126)


FAILED:  org.apache.maven.archetype.test.RoundtripMultiModuleIT.testArchetyper

Error Message:
Invoker process ended with result different than 0!

Stack Trace:
java.lang.Exception: Invoker process ended with result different than 0!
	at org.apache.maven.archetype.test.RoundtripMultiModuleIT.testArchetyper(RoundtripMultiModuleIT.java:126)


FAILED:  org.apache.maven.archetype.test.RoundtripMultiModuleIT.testArchetyper

Error Message:
Invoker process ended with result different than 0!

Stack Trace:
java.lang.Exception: Invoker process ended with result different than 0!
	at org.apache.maven.archetype.test.RoundtripMultiModuleIT.testArchetyper(RoundtripMultiModuleIT.java:126)




Build log:
[...truncated 4.97 MB...]
[windows-jdk7] 	at org.jenkinsci.plugins.workflow.cps.CpsThreadGroup$2.call(CpsThreadGroup.java:243)
[windows-jdk7] 	at org.jenkinsci.plugins.workflow.cps.CpsThreadGroup$2.call(CpsThreadGroup.java:231)
[windows-jdk7] 	at org.jenkinsci.plugins.workflow.cps.CpsVmExecutorService$2.call(CpsVmExecutorService.java:64)
[windows-jdk7] 	at java.util.concurrent.FutureTask.run(FutureTask.java:266)
[windows-jdk7] 	at hudson.remoting.SingleLaneExecutorService$1.run(SingleLaneExecutorService.java:112)
[windows-jdk7] 	at jenkins.util.ContextResettingExecutorService$1.run(ContextResettingExecutorService.java:28)
[windows-jdk7] 	at java.util.concurrent.Executors$RunnableAdapter.call(Executors.java:511)
[windows-jdk7] 	at java.util.concurrent.FutureTask.run(FutureTask.java:266)
[windows-jdk7] 	at java.util.concurrent.ThreadPoolExecutor.runWorker(ThreadPoolExecutor.java:1149)
[windows-jdk7] 	at java.util.concurrent.ThreadPoolExecutor$Worker.run(ThreadPoolExecutor.java:624)
[windows-jdk7] 	at java.lang.Thread.run(Thread.java:748)
[windows-jdk7] [withMaven] junitPublisher - Archive test results for Maven artifact org.apache.maven.archetype:archetype-catalog:3.0.2-SNAPSHOT
generated by maven-surefire-plugin:test (default-test): m\archetype-models\archetype-catalog\target\surefire-reports\*.xml
[windows-jdk7] Recording test results
[windows-jdk7] None of the test reports contained any result
[windows-jdk7] [withMaven] junitPublisher - Archive test results for Maven artifact org.apache.maven.archetype:archetype-descriptor:3.0.2-SNAPSHOT
generated by maven-surefire-plugin:test (default-test): m\archetype-models\archetype-descriptor\target\surefire-reports\*.xml
[windows-jdk7] Recording test results
[windows-jdk7] None of the test reports contained any result
[windows-jdk7] [withMaven] junitPublisher - Archive test results for Maven artifact org.apache.maven.archetype:archetype-repository:3.0.2-SNAPSHOT
generated by maven-surefire-plugin:test (default-test): m\archetype-testing\archetype-repository\target\surefire-reports\*.xml
[windows-jdk7] Recording test results
[windows-jdk7] None of the test reports contained any result
[windows-jdk7] [withMaven] junitPublisher - Archive test results for Maven artifact org.apache.maven.archetype:archetype-proxy:3.0.2-SNAPSHOT
generated by maven-surefire-plugin:test (default-test): m\archetype-testing\archetype-proxy\target\surefire-reports\*.xml
[windows-jdk7] Recording test results
[windows-jdk7] None of the test reports contained any result
[windows-jdk7] [withMaven] junitPublisher - Archive test results for Maven artifact org.apache.maven.archetype:archetype-common:3.0.2-SNAPSHOT
generated by maven-surefire-plugin:test (default-test): m\archetype-common\target\surefire-reports\*.xml
[windows-jdk7] Recording test results
[windows-jdk7] [withMaven] junitPublisher - Archive test results for Maven artifact org.apache.maven.archetype:archetype-packaging:3.0.2-SNAPSHOT
generated by maven-surefire-plugin:test (default-test): m\archetype-packaging\target\surefire-reports\*.xml
[windows-jdk7] Recording test results
[windows-jdk7] None of the test reports contained any result
[windows-jdk7] [withMaven] junitPublisher - Archive test results for Maven artifact org.apache.maven.plugins:maven-archetype-plugin:3.0.2-SNAPSHOT
generated by maven-surefire-plugin:test (default-test): m\maven-archetype-plugin\target\surefire-reports\*.xml
[windows-jdk7] Recording test results
[windows-jdk7] [withMaven] junitPublisher - Archive test results for Maven artifact org.apache.maven.archetype:archetype-final:3.0.2-SNAPSHOT
generated by maven-surefire-plugin:test (default-test): m\archetype-testing\archetype-final\target\surefire-reports\*.xml
[windows-jdk7] Recording test results
[windows-jdk7] None of the test reports contained any result
[windows-jdk7] [withMaven] junitPublisher - Archive test results for Maven artifact org.apache.maven.archetype:archetype-final:3.0.2-SNAPSHOT
generated by maven-failsafe-plugin:integration-test (default): m\archetype-testing\archetype-final\target\failsafe-reports\*.xml
[windows-jdk7] Recording test results
[Pipeline] [windows-jdk9] }
[windows-jdk9] ERROR: [withMaven] WARNING Exception executing Maven reporter 'Invoker Publisher'
/ org.jenkinsci.plugins.pipeline.maven.publishers.InvokerRunsPublisher. Please report a bug
associated for the component 'pipeline-maven-plugin' at https://issues.jenkins-ci.org 
[windows-jdk9] java.lang.IllegalArgumentException: Cannot relativize 'src/it/projects' relatively
to 'f:\jenkins\jenkins-slave\workspace\-box_maven-archetype_master-7AVMJNUR3VZV7RPVUBCE43H65NYTRWAOYFWSDDPCNSCWDYBAGBVQ'
[windows-jdk9] 	at org.jenkinsci.plugins.pipeline.maven.util.XmlUtils.getPathInWorkspace(XmlUtils.java:396)
[windows-jdk9] 	at org.jenkinsci.plugins.pipeline.maven.publishers.InvokerRunsPublisher.expandAndRelativize(InvokerRunsPublisher.java:179)
[windows-jdk9] 	at org.jenkinsci.plugins.pipeline.maven.publishers.InvokerRunsPublisher.executeReporter(InvokerRunsPublisher.java:127)
[windows-jdk9] 	at org.jenkinsci.plugins.pipeline.maven.publishers.InvokerRunsPublisher.process(InvokerRunsPublisher.java:104)
[windows-jdk9] 	at org.jenkinsci.plugins.pipeline.maven.MavenSpyLogProcessor.processMavenSpyLogs(MavenSpyLogProcessor.java:114)
[windows-jdk9] 	at org.jenkinsci.plugins.pipeline.maven.WithMavenStepExecution$WorkspaceCleanupCallback.finished(WithMavenStepExecution.java:1015)
[windows-jdk9] 	at org.jenkinsci.plugins.workflow.steps.BodyExecutionCallback$TailCall.onSuccess(BodyExecutionCallback.java:114)
[windows-jdk9] 	at org.jenkinsci.plugins.workflow.cps.CpsBodyExecution$SuccessAdapter.receive(CpsBodyExecution.java:368)
[windows-jdk9] 	at com.cloudbees.groovy.cps.Outcome.resumeFrom(Outcome.java:73)
[windows-jdk9] 	at com.cloudbees.groovy.cps.Continuable$1.call(Continuable.java:166)
[windows-jdk9] 	at com.cloudbees.groovy.cps.Continuable$1.call(Continuable.java:163)
[windows-jdk9] 	at org.codehaus.groovy.runtime.GroovyCategorySupport$ThreadCategoryInfo.use(GroovyCategorySupport.java:122)
[windows-jdk9] 	at org.codehaus.groovy.runtime.GroovyCategorySupport.use(GroovyCategorySupport.java:261)
[windows-jdk9] 	at com.cloudbees.groovy.cps.Continuable.run0(Continuable.java:163)
[windows-jdk9] 	at org.jenkinsci.plugins.workflow.cps.SandboxContinuable.access$001(SandboxContinuable.java:19)
[windows-jdk9] 	at org.jenkinsci.plugins.workflow.cps.SandboxContinuable$1.call(SandboxContinuable.java:35)
[windows-jdk9] 	at org.jenkinsci.plugins.workflow.cps.SandboxContinuable$1.call(SandboxContinuable.java:32)
[windows-jdk9] 	at org.jenkinsci.plugins.scriptsecurity.sandbox.groovy.GroovySandbox.runInSandbox(GroovySandbox.java:108)
[windows-jdk9] 	at org.jenkinsci.plugins.workflow.cps.SandboxContinuable.run0(SandboxContinuable.java:32)
[windows-jdk9] 	at org.jenkinsci.plugins.workflow.cps.CpsThread.runNextChunk(CpsThread.java:174)
[windows-jdk9] 	at org.jenkinsci.plugins.workflow.cps.CpsThreadGroup.run(CpsThreadGroup.java:331)
[windows-jdk9] 	at org.jenkinsci.plugins.workflow.cps.CpsThreadGroup.access$200(CpsThreadGroup.java:82)
[windows-jdk9] 	at org.jenkinsci.plugins.workflow.cps.CpsThreadGroup$2.call(CpsThreadGroup.java:243)
[windows-jdk9] 	at org.jenkinsci.plugins.workflow.cps.CpsThreadGroup$2.call(CpsThreadGroup.java:231)
[windows-jdk9] 	at org.jenkinsci.plugins.workflow.cps.CpsVmExecutorService$2.call(CpsVmExecutorService.java:64)
[windows-jdk9] 	at java.util.concurrent.FutureTask.run(FutureTask.java:266)
[windows-jdk9] 	at hudson.remoting.SingleLaneExecutorService$1.run(SingleLaneExecutorService.java:112)
[windows-jdk9] 	at jenkins.util.ContextResettingExecutorService$1.run(ContextResettingExecutorService.java:28)
[windows-jdk9] 	at java.util.concurrent.Executors$RunnableAdapter.call(Executors.java:511)
[windows-jdk9] 	at java.util.concurrent.FutureTask.run(FutureTask.java:266)
[windows-jdk9] 	at java.util.concurrent.ThreadPoolExecutor.runWorker(ThreadPoolExecutor.java:1149)
[windows-jdk9] 	at java.util.concurrent.ThreadPoolExecutor$Worker.run(ThreadPoolExecutor.java:624)
[windows-jdk9] 	at java.lang.Thread.run(Thread.java:748)
[windows-jdk9] [withMaven] junitPublisher - Archive test results for Maven artifact org.apache.maven.archetype:archetype-catalog:3.0.2-SNAPSHOT
generated by maven-surefire-plugin:test (default-test): m\archetype-models\archetype-catalog\target\surefire-reports\*.xml
[windows-jdk9] Recording test results
[windows-jdk9] None of the test reports contained any result
[windows-jdk9] [withMaven] junitPublisher - Archive test results for Maven artifact org.apache.maven.archetype:archetype-descriptor:3.0.2-SNAPSHOT
generated by maven-surefire-plugin:test (default-test): m\archetype-models\archetype-descriptor\target\surefire-reports\*.xml
[windows-jdk9] Recording test results
[windows-jdk9] None of the test reports contained any result
[windows-jdk9] [withMaven] junitPublisher - Archive test results for Maven artifact org.apache.maven.archetype:archetype-repository:3.0.2-SNAPSHOT
generated by maven-surefire-plugin:test (default-test): m\archetype-testing\archetype-repository\target\surefire-reports\*.xml
[windows-jdk9] Recording test results
[windows-jdk9] None of the test reports contained any result
[windows-jdk9] [withMaven] junitPublisher - Archive test results for Maven artifact org.apache.maven.archetype:archetype-proxy:3.0.2-SNAPSHOT
generated by maven-surefire-plugin:test (default-test): m\archetype-testing\archetype-proxy\target\surefire-reports\*.xml
[windows-jdk9] Recording test results
[windows-jdk9] None of the test reports contained any result
[windows-jdk9] [withMaven] junitPublisher - Archive test results for Maven artifact org.apache.maven.archetype:archetype-common:3.0.2-SNAPSHOT
generated by maven-surefire-plugin:test (default-test): m\archetype-common\target\surefire-reports\*.xml
[windows-jdk9] Recording test results
[windows-jdk9] [withMaven] junitPublisher - Archive test results for Maven artifact org.apache.maven.archetype:archetype-packaging:3.0.2-SNAPSHOT
generated by maven-surefire-plugin:test (default-test): m\archetype-packaging\target\surefire-reports\*.xml
[windows-jdk9] Recording test results
[windows-jdk9] None of the test reports contained any result
[windows-jdk9] [withMaven] junitPublisher - Archive test results for Maven artifact org.apache.maven.plugins:maven-archetype-plugin:3.0.2-SNAPSHOT
generated by maven-surefire-plugin:test (default-test): m\maven-archetype-plugin\target\surefire-reports\*.xml
[windows-jdk9] Recording test results
[windows-jdk9] [withMaven] junitPublisher - Archive test results for Maven artifact org.apache.maven.archetype:archetype-final:3.0.2-SNAPSHOT
generated by maven-surefire-plugin:test (default-test): m\archetype-testing\archetype-final\target\surefire-reports\*.xml
[windows-jdk9] Recording test results
[windows-jdk9] None of the test reports contained any result
[windows-jdk9] [withMaven] junitPublisher - Archive test results for Maven artifact org.apache.maven.archetype:archetype-final:3.0.2-SNAPSHOT
generated by maven-failsafe-plugin:integration-test (default): m\archetype-testing\archetype-final\target\failsafe-reports\*.xml
[windows-jdk9] Recording test results
[Pipeline] [windows-jdk10] }
[windows-jdk10] ERROR: [withMaven] WARNING Exception executing Maven reporter 'Invoker Publisher'
/ org.jenkinsci.plugins.pipeline.maven.publishers.InvokerRunsPublisher. Please report a bug
associated for the component 'pipeline-maven-plugin' at https://issues.jenkins-ci.org 
[windows-jdk10] java.lang.IllegalArgumentException: Cannot relativize 'src/it/projects' relatively
to 'f:\jenkins\jenkins-slave\workspace\-box_maven-archetype_master-7AVMJNUR3VZV7RPVUBCE43H65NYTRWAOYFWSDDPCNSCWDYBAGBVQ@2'
[windows-jdk10] 	at org.jenkinsci.plugins.pipeline.maven.util.XmlUtils.getPathInWorkspace(XmlUtils.java:396)
[windows-jdk10] 	at org.jenkinsci.plugins.pipeline.maven.publishers.InvokerRunsPublisher.expandAndRelativize(InvokerRunsPublisher.java:179)
[windows-jdk10] 	at org.jenkinsci.plugins.pipeline.maven.publishers.InvokerRunsPublisher.executeReporter(InvokerRunsPublisher.java:127)
[windows-jdk10] 	at org.jenkinsci.plugins.pipeline.maven.publishers.InvokerRunsPublisher.process(InvokerRunsPublisher.java:104)
[windows-jdk10] 	at org.jenkinsci.plugins.pipeline.maven.MavenSpyLogProcessor.processMavenSpyLogs(MavenSpyLogProcessor.java:114)
[windows-jdk10] 	at org.jenkinsci.plugins.pipeline.maven.WithMavenStepExecution$WorkspaceCleanupCallback.finished(WithMavenStepExecution.java:1015)
[windows-jdk10] 	at org.jenkinsci.plugins.workflow.steps.BodyExecutionCallback$TailCall.onSuccess(BodyExecutionCallback.java:114)
[windows-jdk10] 	at org.jenkinsci.plugins.workflow.cps.CpsBodyExecution$SuccessAdapter.receive(CpsBodyExecution.java:368)
[windows-jdk10] 	at com.cloudbees.groovy.cps.Outcome.resumeFrom(Outcome.java:73)
[windows-jdk10] 	at com.cloudbees.groovy.cps.Continuable$1.call(Continuable.java:166)
[windows-jdk10] 	at com.cloudbees.groovy.cps.Continuable$1.call(Continuable.java:163)
[windows-jdk10] 	at org.codehaus.groovy.runtime.GroovyCategorySupport$ThreadCategoryInfo.use(GroovyCategorySupport.java:122)
[windows-jdk10] 	at org.codehaus.groovy.runtime.GroovyCategorySupport.use(GroovyCategorySupport.java:261)
[windows-jdk10] 	at com.cloudbees.groovy.cps.Continuable.run0(Continuable.java:163)
[windows-jdk10] 	at org.jenkinsci.plugins.workflow.cps.SandboxContinuable.access$001(SandboxContinuable.java:19)
[windows-jdk10] 	at org.jenkinsci.plugins.workflow.cps.SandboxContinuable$1.call(SandboxContinuable.java:35)
[windows-jdk10] 	at org.jenkinsci.plugins.workflow.cps.SandboxContinuable$1.call(SandboxContinuable.java:32)
[windows-jdk10] 	at org.jenkinsci.plugins.scriptsecurity.sandbox.groovy.GroovySandbox.runInSandbox(GroovySandbox.java:108)
[windows-jdk10] 	at org.jenkinsci.plugins.workflow.cps.SandboxContinuable.run0(SandboxContinuable.java:32)
[windows-jdk10] 	at org.jenkinsci.plugins.workflow.cps.CpsThread.runNextChunk(CpsThread.java:174)
[windows-jdk10] 	at org.jenkinsci.plugins.workflow.cps.CpsThreadGroup.run(CpsThreadGroup.java:331)
[windows-jdk10] 	at org.jenkinsci.plugins.workflow.cps.CpsThreadGroup.access$200(CpsThreadGroup.java:82)
[windows-jdk10] 	at org.jenkinsci.plugins.workflow.cps.CpsThreadGroup$2.call(CpsThreadGroup.java:243)
[windows-jdk10] 	at org.jenkinsci.plugins.workflow.cps.CpsThreadGroup$2.call(CpsThreadGroup.java:231)
[windows-jdk10] 	at org.jenkinsci.plugins.workflow.cps.CpsVmExecutorService$2.call(CpsVmExecutorService.java:64)
[windows-jdk10] 	at java.util.concurrent.FutureTask.run(FutureTask.java:266)
[windows-jdk10] 	at hudson.remoting.SingleLaneExecutorService$1.run(SingleLaneExecutorService.java:112)
[windows-jdk10] 	at jenkins.util.ContextResettingExecutorService$1.run(ContextResettingExecutorService.java:28)
[windows-jdk10] 	at java.util.concurrent.Executors$RunnableAdapter.call(Executors.java:511)
[windows-jdk10] 	at java.util.concurrent.FutureTask.run(FutureTask.java:266)
[windows-jdk10] 	at java.util.concurrent.ThreadPoolExecutor.runWorker(ThreadPoolExecutor.java:1149)
[windows-jdk10] 	at java.util.concurrent.ThreadPoolExecutor$Worker.run(ThreadPoolExecutor.java:624)
[windows-jdk10] 	at java.lang.Thread.run(Thread.java:748)
[windows-jdk10] [withMaven] junitPublisher - Archive test results for Maven artifact org.apache.maven.archetype:archetype-catalog:3.0.2-SNAPSHOT
generated by maven-surefire-plugin:test (default-test): m\archetype-models\archetype-catalog\target\surefire-reports\*.xml
[windows-jdk10] Recording test results
[windows-jdk10] None of the test reports contained any result
[windows-jdk10] [withMaven] junitPublisher - Archive test results for Maven artifact org.apache.maven.archetype:archetype-descriptor:3.0.2-SNAPSHOT
generated by maven-surefire-plugin:test (default-test): m\archetype-models\archetype-descriptor\target\surefire-reports\*.xml
[windows-jdk10] Recording test results
[windows-jdk10] None of the test reports contained any result
[windows-jdk10] [withMaven] junitPublisher - Archive test results for Maven artifact org.apache.maven.archetype:archetype-repository:3.0.2-SNAPSHOT
generated by maven-surefire-plugin:test (default-test): m\archetype-testing\archetype-repository\target\surefire-reports\*.xml
[windows-jdk10] Recording test results
[windows-jdk10] None of the test reports contained any result
[windows-jdk10] [withMaven] junitPublisher - Archive test results for Maven artifact org.apache.maven.archetype:archetype-proxy:3.0.2-SNAPSHOT
generated by maven-surefire-plugin:test (default-test): m\archetype-testing\archetype-proxy\target\surefire-reports\*.xml
[windows-jdk10] Recording test results
[windows-jdk10] None of the test reports contained any result
[windows-jdk10] [withMaven] junitPublisher - Archive test results for Maven artifact org.apache.maven.archetype:archetype-common:3.0.2-SNAPSHOT
generated by maven-surefire-plugin:test (default-test): m\archetype-common\target\surefire-reports\*.xml
[windows-jdk10] Recording test results
[windows-jdk10] [withMaven] junitPublisher - Archive test results for Maven artifact org.apache.maven.archetype:archetype-packaging:3.0.2-SNAPSHOT
generated by maven-surefire-plugin:test (default-test): m\archetype-packaging\target\surefire-reports\*.xml
[windows-jdk10] Recording test results
[windows-jdk10] None of the test reports contained any result
[windows-jdk10] [withMaven] junitPublisher - Archive test results for Maven artifact org.apache.maven.plugins:maven-archetype-plugin:3.0.2-SNAPSHOT
generated by maven-surefire-plugin:test (default-test): m\maven-archetype-plugin\target\surefire-reports\*.xml
[windows-jdk10] Recording test results
[windows-jdk10] [withMaven] junitPublisher - Archive test results for Maven artifact org.apache.maven.archetype:archetype-final:3.0.2-SNAPSHOT
generated by maven-surefire-plugin:test (default-test): m\archetype-testing\archetype-final\target\surefire-reports\*.xml
[windows-jdk10] Recording test results
[windows-jdk10] None of the test reports contained any result
[windows-jdk10] [withMaven] junitPublisher - Archive test results for Maven artifact org.apache.maven.archetype:archetype-final:3.0.2-SNAPSHOT
generated by maven-failsafe-plugin:integration-test (default): m\archetype-testing\archetype-final\target\failsafe-reports\*.xml
[windows-jdk10] Recording test results
[Pipeline] [linux-jdk7] // node
[Pipeline] [windows-jdk7] // withMaven
[Pipeline] [windows-jdk9] // withMaven
[Pipeline] [windows-jdk10] // withMaven
[Pipeline] [linux-jdk7] }
[Pipeline] [windows-jdk7] }
[Pipeline] [windows-jdk9] }
[Pipeline] [windows-jdk10] }
[Pipeline] [windows-jdk8] }
[Pipeline] [windows-jdk7] // stage
[Pipeline] [windows-jdk9] // stage
[Pipeline] [windows-jdk10] // stage
[Pipeline] [windows-jdk8] // dir
[Pipeline] [windows-jdk7] }
[Pipeline] [windows-jdk9] }
[Pipeline] [windows-jdk10] }
[Pipeline] [windows-jdk8] }
[windows-jdk8] ERROR: [withMaven] WARNING Exception executing Maven reporter 'Invoker Publisher'
/ org.jenkinsci.plugins.pipeline.maven.publishers.InvokerRunsPublisher. Please report a bug
associated for the component 'pipeline-maven-plugin' at https://issues.jenkins-ci.org 
[windows-jdk8] java.lang.IllegalArgumentException: Cannot relativize 'src/it/projects' relatively
to 'f:\jenkins\jenkins-slave\workspace\-box_maven-archetype_master-7AVMJNUR3VZV7RPVUBCE43H65NYTRWAOYFWSDDPCNSCWDYBAGBVQ@2'
[windows-jdk8] 	at org.jenkinsci.plugins.pipeline.maven.util.XmlUtils.getPathInWorkspace(XmlUtils.java:396)
[windows-jdk8] 	at org.jenkinsci.plugins.pipeline.maven.publishers.InvokerRunsPublisher.expandAndRelativize(InvokerRunsPublisher.java:179)
[windows-jdk8] 	at org.jenkinsci.plugins.pipeline.maven.publishers.InvokerRunsPublisher.executeReporter(InvokerRunsPublisher.java:127)
[windows-jdk8] 	at org.jenkinsci.plugins.pipeline.maven.publishers.InvokerRunsPublisher.process(InvokerRunsPublisher.java:104)
[windows-jdk8] 	at org.jenkinsci.plugins.pipeline.maven.MavenSpyLogProcessor.processMavenSpyLogs(MavenSpyLogProcessor.java:114)
[windows-jdk8] 	at org.jenkinsci.plugins.pipeline.maven.WithMavenStepExecution$WorkspaceCleanupCallback.finished(WithMavenStepExecution.java:1015)
[windows-jdk8] 	at org.jenkinsci.plugins.workflow.steps.BodyExecutionCallback$TailCall.onSuccess(BodyExecutionCallback.java:114)
[windows-jdk8] 	at org.jenkinsci.plugins.workflow.cps.CpsBodyExecution$SuccessAdapter.receive(CpsBodyExecution.java:368)
[windows-jdk8] 	at com.cloudbees.groovy.cps.Outcome.resumeFrom(Outcome.java:73)
[windows-jdk8] 	at com.cloudbees.groovy.cps.Continuable$1.call(Continuable.java:166)
[windows-jdk8] 	at com.cloudbees.groovy.cps.Continuable$1.call(Continuable.java:163)
[windows-jdk8] 	at org.codehaus.groovy.runtime.GroovyCategorySupport$ThreadCategoryInfo.use(GroovyCategorySupport.java:122)
[windows-jdk8] 	at org.codehaus.groovy.runtime.GroovyCategorySupport.use(GroovyCategorySupport.java:261)
[windows-jdk8] 	at com.cloudbees.groovy.cps.Continuable.run0(Continuable.java:163)
[windows-jdk8] 	at org.jenkinsci.plugins.workflow.cps.SandboxContinuable.access$001(SandboxContinuable.java:19)
[windows-jdk8] 	at org.jenkinsci.plugins.workflow.cps.SandboxContinuable$1.call(SandboxContinuable.java:35)
[windows-jdk8] 	at org.jenkinsci.plugins.workflow.cps.SandboxContinuable$1.call(SandboxContinuable.java:32)
[windows-jdk8] 	at org.jenkinsci.plugins.scriptsecurity.sandbox.groovy.GroovySandbox.runInSandbox(GroovySandbox.java:108)
[windows-jdk8] 	at org.jenkinsci.plugins.workflow.cps.SandboxContinuable.run0(SandboxContinuable.java:32)
[windows-jdk8] 	at org.jenkinsci.plugins.workflow.cps.CpsThread.runNextChunk(CpsThread.java:174)
[windows-jdk8] 	at org.jenkinsci.plugins.workflow.cps.CpsThreadGroup.run(CpsThreadGroup.java:331)
[windows-jdk8] 	at org.jenkinsci.plugins.workflow.cps.CpsThreadGroup.access$200(CpsThreadGroup.java:82)
[windows-jdk8] 	at org.jenkinsci.plugins.workflow.cps.CpsThreadGroup$2.call(CpsThreadGroup.java:243)
[windows-jdk8] 	at org.jenkinsci.plugins.workflow.cps.CpsThreadGroup$2.call(CpsThreadGroup.java:231)
[windows-jdk8] 	at org.jenkinsci.plugins.workflow.cps.CpsVmExecutorService$2.call(CpsVmExecutorService.java:64)
[windows-jdk8] 	at java.util.concurrent.FutureTask.run(FutureTask.java:266)
[windows-jdk8] 	at hudson.remoting.SingleLaneExecutorService$1.run(SingleLaneExecutorService.java:112)
[windows-jdk8] 	at jenkins.util.ContextResettingExecutorService$1.run(ContextResettingExecutorService.java:28)
[windows-jdk8] 	at java.util.concurrent.Executors$RunnableAdapter.call(Executors.java:511)
[windows-jdk8] 	at java.util.concurrent.FutureTask.run(FutureTask.java:266)
[windows-jdk8] 	at java.util.concurrent.ThreadPoolExecutor.runWorker(ThreadPoolExecutor.java:1149)
[windows-jdk8] 	at java.util.concurrent.ThreadPoolExecutor$Worker.run(ThreadPoolExecutor.java:624)
[windows-jdk8] 	at java.lang.Thread.run(Thread.java:748)
[windows-jdk8] [withMaven] junitPublisher - Archive test results for Maven artifact org.apache.maven.archetype:archetype-catalog:3.0.2-SNAPSHOT
generated by maven-surefire-plugin:test (default-test): m\archetype-models\archetype-catalog\target\surefire-reports\*.xml
[windows-jdk8] Recording test results
[windows-jdk8] None of the test reports contained any result
[windows-jdk8] [withMaven] junitPublisher - Archive test results for Maven artifact org.apache.maven.archetype:archetype-descriptor:3.0.2-SNAPSHOT
generated by maven-surefire-plugin:test (default-test): m\archetype-models\archetype-descriptor\target\surefire-reports\*.xml
[windows-jdk8] Recording test results
[windows-jdk8] None of the test reports contained any result
[windows-jdk8] [withMaven] junitPublisher - Archive test results for Maven artifact org.apache.maven.archetype:archetype-repository:3.0.2-SNAPSHOT
generated by maven-surefire-plugin:test (default-test): m\archetype-testing\archetype-repository\target\surefire-reports\*.xml
[windows-jdk8] Recording test results
[windows-jdk8] None of the test reports contained any result
[windows-jdk8] [withMaven] junitPublisher - Archive test results for Maven artifact org.apache.maven.archetype:archetype-proxy:3.0.2-SNAPSHOT
generated by maven-surefire-plugin:test (default-test): m\archetype-testing\archetype-proxy\target\surefire-reports\*.xml
[windows-jdk8] Recording test results
[windows-jdk8] None of the test reports contained any result
[windows-jdk8] [withMaven] junitPublisher - Archive test results for Maven artifact org.apache.maven.archetype:archetype-common:3.0.2-SNAPSHOT
generated by maven-surefire-plugin:test (default-test): m\archetype-common\target\surefire-reports\*.xml
[windows-jdk8] Recording test results
[windows-jdk8] [withMaven] junitPublisher - Archive test results for Maven artifact org.apache.maven.archetype:archetype-packaging:3.0.2-SNAPSHOT
generated by maven-surefire-plugin:test (default-test): m\archetype-packaging\target\surefire-reports\*.xml
[windows-jdk8] Recording test results
[windows-jdk8] None of the test reports contained any result
[windows-jdk8] [withMaven] junitPublisher - Archive test results for Maven artifact org.apache.maven.plugins:maven-archetype-plugin:3.0.2-SNAPSHOT
generated by maven-surefire-plugin:test (default-test): m\maven-archetype-plugin\target\surefire-reports\*.xml
[windows-jdk8] Recording test results
[windows-jdk8] [withMaven] junitPublisher - Archive test results for Maven artifact org.apache.maven.archetype:archetype-final:3.0.2-SNAPSHOT
generated by maven-surefire-plugin:test (default-test): m\archetype-testing\archetype-final\target\surefire-reports\*.xml
[windows-jdk8] Recording test results
[windows-jdk8] None of the test reports contained any result
[windows-jdk8] [withMaven] junitPublisher - Archive test results for Maven artifact org.apache.maven.archetype:archetype-final:3.0.2-SNAPSHOT
generated by maven-failsafe-plugin:integration-test (default): m\archetype-testing\archetype-final\target\failsafe-reports\*.xml
[windows-jdk8] Recording test results
[Pipeline] [windows-jdk7] // node
[Pipeline] [windows-jdk9] // node
[Pipeline] [windows-jdk10] // node
[Pipeline] [windows-jdk8] // withMaven
[Pipeline] [windows-jdk7] }
[Pipeline] [windows-jdk9] }
[Pipeline] [windows-jdk10] }
[Pipeline] [windows-jdk8] }
[Pipeline] [windows-jdk8] // stage
[Pipeline] [windows-jdk8] }
[Pipeline] [windows-jdk8] // node
[Pipeline] [windows-jdk8] }
[Pipeline] // parallel
[Pipeline] stage
[Pipeline] { (Notifications)
[Pipeline] echo
Build result: UNSTABLE
[Pipeline] jiraIssueSelector
Mime
  • Unnamed multipart/mixed (inline, None, 0 bytes)
View raw message