maven-notifications mailing list archives

Site index · List index
Message view « Date » · « Thread »
Top « Date » · « Thread »
From Apache Jenkins Server <jenk...@builds.apache.org>
Subject Build failed in Jenkins: Maven TLP » maven-enforcer » MENFORCER-276 #3
Date Sun, 17 Jun 2018 17:15:29 GMT
See https://builds.apache.org/job/maven-box/job/maven-enforcer/job/MENFORCER-276/3/

No changes.

No tests ran.

Build log:
[...truncated 1.07 MB...]
[linux-jdk10] [INFO] --- maven-remote-resources-plugin:1.5:process (process-resource-bundles)
@ enforcer-rules ---
[linux-jdk10] [INFO] 
[linux-jdk10] [INFO] --- maven-resources-plugin:3.0.2:resources (default-resources) @ enforcer-rules
---
[linux-jdk10] [INFO] Using 'UTF-8' encoding to copy filtered resources.
[linux-jdk10] [INFO] skip non existing resourceDirectory /home/jenkins/jenkins-slave/workspace/aven-enforcer_MENFORCER-276-ARAEEUQ3DZKGP7LK65FX6C75KHKIJYNAPASQYCZKRS4IVUWL44FA@2/m/enforcer-rules/src/main/resources
[linux-jdk10] [INFO] Copying 3 resources
[linux-jdk10] [INFO] 
[linux-jdk10] [INFO] --- maven-compiler-plugin:3.7.0:compile (default-compile) @ enforcer-rules
---
[linux-jdk10] [INFO] Changes detected - recompiling the module!
[linux-jdk10] [INFO] Compiling 43 source files to /home/jenkins/jenkins-slave/workspace/aven-enforcer_MENFORCER-276-ARAEEUQ3DZKGP7LK65FX6C75KHKIJYNAPASQYCZKRS4IVUWL44FA@2/m/enforcer-rules/target/classes
[Pipeline] [linux-jdk7] // dir
[Pipeline] [linux-jdk8] }
[Pipeline] [linux-jdk7] }
[linux-jdk7] [withMaven] artifactsPublisher - Archive artifact m/pom.xml under org/apache/maven/enforcer/enforcer/3.0.0-SNAPSHOT/enforcer-3.0.0-SNAPSHOT.pom
[linux-jdk7] [withMaven] artifactsPublisher - Archive artifact m/enforcer-api/pom.xml under
org/apache/maven/enforcer/enforcer-api/3.0.0-SNAPSHOT/enforcer-api-3.0.0-SNAPSHOT.pom
[linux-jdk7] [withMaven] artifactsPublisher - Archive artifact m/enforcer-api/target/enforcer-api-3.0.0-SNAPSHOT.jar
under org/apache/maven/enforcer/enforcer-api/3.0.0-SNAPSHOT/enforcer-api-3.0.0-SNAPSHOT.jar
[linux-jdk7] [withMaven] artifactsPublisher - Archive artifact m/target/enforcer-3.0.0-SNAPSHOT-site.xml
under org/apache/maven/enforcer/enforcer/3.0.0-SNAPSHOT/enforcer-3.0.0-SNAPSHOT-site.xml
[linux-jdk7] [Fast Archiver] No prior successful build to compare, so performing full copy
of artifacts
[linux-jdk7] [withMaven] junitPublisher - Archive test results for Maven artifact org.apache.maven.enforcer:enforcer-api:3.0.0-SNAPSHOT
generated by maven-surefire-plugin:test (default-test): m/enforcer-api/target/surefire-reports/*.xml
[linux-jdk7] Recording test results
[linux-jdk7] None of the test reports contained any result
[linux-jdk7] [withMaven] openTasksPublisher - Scan Tasks for Maven artifact org.apache.maven.enforcer:enforcer-api:3.0.0-SNAPSHOT
in source directory m/enforcer-api/src/main/java
[linux-jdk7] [withMaven] openTasksPublisher - Scan Tasks for Maven artifact org.apache.maven.enforcer:enforcer-rules:3.0.0-SNAPSHOT
in source directory m/enforcer-rules/src/main/java
[linux-jdk7] [TASKS] Scanning folder '/home/jenkins/jenkins-slave/workspace/aven-enforcer_MENFORCER-276-ARAEEUQ3DZKGP7LK65FX6C75KHKIJYNAPASQYCZKRS4IVUWL44FA'
for files matching the pattern 'm/enforcer-api/src/main/java/**/*,m/enforcer-rules/src/main/java/**/*'
- excludes: null
[linux-jdk7] [TASKS] Found 48 files to scan for tasks
[linux-jdk7] [TASKS] Found 5 open tasks.
[linux-jdk7] Skipping warnings blame since pipelines do not have an SCM link.%n
[Pipeline] [windows-jdk7] dir
[windows-jdk7] Running in f:\jenkins\jenkins-slave\workspace\aven-enforcer_MENFORCER-276-ARAEEUQ3DZKGP7LK65FX6C75KHKIJYNAPASQYCZKRS4IVUWL44FA\m
[Pipeline] [windows-jdk7] {
[Pipeline] [windows-jdk7] checkout
[Pipeline] [linux-jdk8] // node
[windows-jdk7] Cloning the remote Git repository
[windows-jdk7] Cloning with configured refspecs honoured and without tags
[windows-jdk7] Cloning repository https://gitbox.apache.org/repos/asf/maven-enforcer.git
[windows-jdk7]  > git init f:\jenkins\jenkins-slave\workspace\aven-enforcer_MENFORCER-276-ARAEEUQ3DZKGP7LK65FX6C75KHKIJYNAPASQYCZKRS4IVUWL44FA\m
# timeout=10
[Pipeline] [linux-jdk7] // withMaven
[windows-jdk7] Fetching upstream changes from https://gitbox.apache.org/repos/asf/maven-enforcer.git
[windows-jdk7]  > git --version # timeout=10
[Pipeline] [linux-jdk8] }
[linux-jdk8] Failed in branch linux-jdk8
[Pipeline] [linux-jdk7] echo
[linux-jdk7] [FAIL FAST] linux-jdk8 had first failure, ignoring script returned exit code
1
[Pipeline] [linux-jdk7] }
[windows-jdk7]  > git fetch --no-tags --progress https://gitbox.apache.org/repos/asf/maven-enforcer.git
+refs/heads/*:refs/remotes/origin/*
[linux-jdk9] Sending interrupt signal to process
[linux-jdk9] [INFO] /home/jenkins/jenkins-slave/workspace/aven-enforcer_MENFORCER-276-ARAEEUQ3DZKGP7LK65FX6C75KHKIJYNAPASQYCZKRS4IVUWL44FA/m/enforcer-rules/src/test/java/org/apache/maven/plugins/enforcer/MockPathTranslator.java:
Some input files use or override a deprecated API.
[linux-jdk9] [INFO] /home/jenkins/jenkins-slave/workspace/aven-enforcer_MENFORCER-276-ARAEEUQ3DZKGP7LK65FX6C75KHKIJYNAPASQYCZKRS4IVUWL44FA/m/enforcer-rules/src/test/java/org/apache/maven/plugins/enforcer/MockPathTranslator.java:
Recompile with -Xlint:deprecation for details.
[linux-jdk9] [INFO] /home/jenkins/jenkins-slave/workspace/aven-enforcer_MENFORCER-276-ARAEEUQ3DZKGP7LK65FX6C75KHKIJYNAPASQYCZKRS4IVUWL44FA/m/enforcer-rules/src/test/java/org/apache/maven/plugins/enforcer/MockProject.java:
Some input files use unchecked or unsafe operations.
[linux-jdk9] [INFO] /home/jenkins/jenkins-slave/workspace/aven-enforcer_MENFORCER-276-ARAEEUQ3DZKGP7LK65FX6C75KHKIJYNAPASQYCZKRS4IVUWL44FA/m/enforcer-rules/src/test/java/org/apache/maven/plugins/enforcer/MockProject.java:
Recompile with -Xlint:unchecked for details.
[linux-jdk9] [INFO] -------------------------------------------------------------
[linux-jdk9] [ERROR] COMPILATION ERROR : 
[linux-jdk9] [INFO] -------------------------------------------------------------
[linux-jdk9] [ERROR] /home/jenkins/jenkins-slave/workspace/aven-enforcer_MENFORCER-276-ARAEEUQ3DZKGP7LK65FX6C75KHKIJYNAPASQYCZKRS4IVUWL44FA/m/enforcer-rules/src/test/java/org/apache/maven/plugins/enforcer/TestRequireUpperBoundDeps.java:[14,47]
cannot find symbol
[linux-jdk9]   symbol:   class TestEnforcerRuleUtils
[linux-jdk9]   location: package org.apache.maven.plugins.enforcer.utils
[linux-jdk9] [ERROR] /home/jenkins/jenkins-slave/workspace/aven-enforcer_MENFORCER-276-ARAEEUQ3DZKGP7LK65FX6C75KHKIJYNAPASQYCZKRS4IVUWL44FA/m/enforcer-rules/src/test/java/org/apache/maven/plugins/enforcer/TestRequireUpperBoundDeps.java:[87,9]
cannot find symbol
[linux-jdk9]   symbol:   variable TestEnforcerRuleUtils
[linux-jdk9]   location: class org.apache.maven.plugins.enforcer.TestRequireUpperBoundDeps
[linux-jdk9] [ERROR] /home/jenkins/jenkins-slave/workspace/aven-enforcer_MENFORCER-276-ARAEEUQ3DZKGP7LK65FX6C75KHKIJYNAPASQYCZKRS4IVUWL44FA/m/enforcer-rules/src/test/java/org/apache/maven/plugins/enforcer/TestRequireUpperBoundDeps.java:[97,9]
cannot find symbol
[linux-jdk9]   symbol:   variable TestEnforcerRuleUtils
[linux-jdk9]   location: class org.apache.maven.plugins.enforcer.TestRequireUpperBoundDeps
[linux-jdk9] [ERROR] /home/jenkins/jenkins-slave/workspace/aven-enforcer_MENFORCER-276-ARAEEUQ3DZKGP7LK65FX6C75KHKIJYNAPASQYCZKRS4IVUWL44FA/m/enforcer-rules/src/test/java/org/apache/maven/plugins/enforcer/TestRequireUpperBoundDeps.java:[107,9]
cannot find symbol
[linux-jdk9]   symbol:   variable TestEnforcerRuleUtils
[linux-jdk9]   location: class org.apache.maven.plugins.enforcer.TestRequireUpperBoundDeps
[linux-jdk9] [ERROR] /home/jenkins/jenkins-slave/workspace/aven-enforcer_MENFORCER-276-ARAEEUQ3DZKGP7LK65FX6C75KHKIJYNAPASQYCZKRS4IVUWL44FA/m/enforcer-rules/src/test/java/org/apache/maven/plugins/enforcer/TestRequireUpperBoundDeps.java:[118,9]
cannot find symbol
[linux-jdk9]   symbol:   variable TestEnforcerRuleUtils
[linux-jdk9]   location: class org.apache.maven.plugins.enforcer.TestRequireUpperBoundDeps
[linux-jdk9] [INFO] 5 errors 
[linux-jdk9] [INFO] -------------------------------------------------------------
[linux-jdk9] [INFO] ------------------------------------------------------------------------
[linux-jdk9] [INFO] Reactor Summary:
[linux-jdk9] [INFO] 
[linux-jdk9] [INFO] Apache Maven Enforcer .............................. SUCCESS [ 14.360
s]
[linux-jdk9] [INFO] Apache Maven Enforcer API .......................... SUCCESS [  4.037
s]
[linux-jdk9] [INFO] Apache Maven Enforcer Built-In Rules ............... FAILURE [  5.198
s]
[linux-jdk9] [INFO] Apache Maven Enforcer Plugin ....................... SKIPPED
[linux-jdk9] [INFO] ------------------------------------------------------------------------
[linux-jdk9] [INFO] BUILD FAILURE
[linux-jdk9] [INFO] ------------------------------------------------------------------------
[linux-jdk9] [INFO] Total time: 24.939 s
[linux-jdk9] [INFO] Finished at: 2018-06-17T17:14:57Z
[linux-jdk9] [INFO] Final Memory: 38M/128M
[linux-jdk9] [INFO] ------------------------------------------------------------------------
[linux-jdk9] [INFO] [jenkins-event-spy] Generated /home/jenkins/jenkins-slave/workspace/aven-enforcer_MENFORCER-276-ARAEEUQ3DZKGP7LK65FX6C75KHKIJYNAPASQYCZKRS4IVUWL44FA@tmp/withMavenc809b79c/maven-spy-20180617-171432-7186921916159147575618.log
[linux-jdk9] [ERROR] Failed to execute goal org.apache.maven.plugins:maven-compiler-plugin:3.7.0:testCompile
(default-testCompile) on project enforcer-rules: Compilation failure: Compilation failure:

[linux-jdk9] [ERROR] /home/jenkins/jenkins-slave/workspace/aven-enforcer_MENFORCER-276-ARAEEUQ3DZKGP7LK65FX6C75KHKIJYNAPASQYCZKRS4IVUWL44FA/m/enforcer-rules/src/test/java/org/apache/maven/plugins/enforcer/TestRequireUpperBoundDeps.java:[14,47]
cannot find symbol
[linux-jdk9] [ERROR]   symbol:   class TestEnforcerRuleUtils
[linux-jdk9] [ERROR]   location: package org.apache.maven.plugins.enforcer.utils
[linux-jdk9] [ERROR] /home/jenkins/jenkins-slave/workspace/aven-enforcer_MENFORCER-276-ARAEEUQ3DZKGP7LK65FX6C75KHKIJYNAPASQYCZKRS4IVUWL44FA/m/enforcer-rules/src/test/java/org/apache/maven/plugins/enforcer/TestRequireUpperBoundDeps.java:[87,9]
cannot find symbol
[linux-jdk9] [ERROR]   symbol:   variable TestEnforcerRuleUtils
[linux-jdk9] [ERROR]   location: class org.apache.maven.plugins.enforcer.TestRequireUpperBoundDeps
[linux-jdk9] [ERROR] /home/jenkins/jenkins-slave/workspace/aven-enforcer_MENFORCER-276-ARAEEUQ3DZKGP7LK65FX6C75KHKIJYNAPASQYCZKRS4IVUWL44FA/m/enforcer-rules/src/test/java/org/apache/maven/plugins/enforcer/TestRequireUpperBoundDeps.java:[97,9]
cannot find symbol
[linux-jdk9] [ERROR]   symbol:   variable TestEnforcerRuleUtils
[linux-jdk9] [ERROR]   location: class org.apache.maven.plugins.enforcer.TestRequireUpperBoundDeps
[linux-jdk9] [ERROR] /home/jenkins/jenkins-slave/workspace/aven-enforcer_MENFORCER-276-ARAEEUQ3DZKGP7LK65FX6C75KHKIJYNAPASQYCZKRS4IVUWL44FA/m/enforcer-rules/src/test/java/org/apache/maven/plugins/enforcer/TestRequireUpperBoundDeps.java:[107,9]
cannot find symbol
[linux-jdk9] [ERROR]   symbol:   variable TestEnforcerRuleUtils
[linux-jdk9] [ERROR]   location: class org.apache.maven.plugins.enforcer.TestRequireUpperBoundDeps
[linux-jdk9] [ERROR] /home/jenkins/jenkins-slave/workspace/aven-enforcer_MENFORCER-276-ARAEEUQ3DZKGP7LK65FX6C75KHKIJYNAPASQYCZKRS4IVUWL44FA/m/enforcer-rules/src/test/java/org/apache/maven/plugins/enforcer/TestRequireUpperBoundDeps.java:[118,9]
cannot find symbol
[linux-jdk9] [ERROR]   symbol:   variable TestEnforcerRuleUtils
[linux-jdk9] [ERROR]   location: class org.apache.maven.plugins.enforcer.TestRequireUpperBoundDeps
[linux-jdk9] [ERROR] -> [Help 1]
[linux-jdk9] [ERROR] 
[linux-jdk9] [ERROR] To see the full stack trace of the errors, re-run Maven with the -e switch.
[linux-jdk9] [ERROR] Re-run Maven using the -X switch to enable full debug logging.
[linux-jdk9] [ERROR] 
[linux-jdk9] [ERROR] For more information about the errors and possible solutions, please
read the following articles:
[linux-jdk9] [ERROR] [Help 1] http://cwiki.apache.org/confluence/display/MAVEN/MojoFailureException
[linux-jdk9] [ERROR] 
[linux-jdk9] [ERROR] After correcting the problems, you can resume the build with the command
[linux-jdk9] [ERROR]   mvn <goals> -rf :enforcer-rules
[linux-jdk10] Sending interrupt signal to process
[windows-jdk7]  > git config remote.origin.url https://gitbox.apache.org/repos/asf/maven-enforcer.git
# timeout=10
[windows-jdk7]  > git config --add remote.origin.fetch +refs/heads/*:refs/remotes/origin/*
# timeout=10
[windows-jdk7]  > git config remote.origin.url https://gitbox.apache.org/repos/asf/maven-enforcer.git
# timeout=10
[windows-jdk7] Fetching without tags
[windows-jdk7] Fetching upstream changes from https://gitbox.apache.org/repos/asf/maven-enforcer.git
[windows-jdk7]  > git fetch --no-tags --progress https://gitbox.apache.org/repos/asf/maven-enforcer.git
+refs/heads/*:refs/remotes/origin/*
[windows-jdk7] Checking out Revision a7650017ace1e95d4e6c2aa65f15b08b890be40f (MENFORCER-276)
[windows-jdk7]  > git config core.sparsecheckout # timeout=10
[windows-jdk7]  > git checkout -f a7650017ace1e95d4e6c2aa65f15b08b890be40f
[windows-jdk7] Commit message: "Add Unit tests for RequireUpperBoundDeps"
[windows-jdk7] Cleaning workspace
[windows-jdk7]  > git rev-parse --verify HEAD # timeout=10
[windows-jdk7] Resetting working tree
[windows-jdk7]  > git reset --hard # timeout=10
[windows-jdk7]  > git clean -fdx # timeout=10
[windows-jdk8] Running on windows-2012-3 in f:\jenkins\jenkins-slave\workspace\aven-enforcer_MENFORCER-276-ARAEEUQ3DZKGP7LK65FX6C75KHKIJYNAPASQYCZKRS4IVUWL44FA@2
[linux-jdk9] Cannot contact H31: java.lang.InterruptedException
[linux-jdk10] After 10s process did not stop
[linux-jdk10] Cannot contact H31: java.lang.InterruptedException
[linux-jdk10] [INFO] /home/jenkins/jenkins-slave/workspace/aven-enforcer_MENFORCER-276-ARAEEUQ3DZKGP7LK65FX6C75KHKIJYNAPASQYCZKRS4IVUWL44FA@2/m/enforcer-rules/src/main/java/org/apache/maven/plugins/enforcer/utils/EnforcerRuleUtils.java:
Some input files use or override a deprecated API.
[linux-jdk10] [INFO] /home/jenkins/jenkins-slave/workspace/aven-enforcer_MENFORCER-276-ARAEEUQ3DZKGP7LK65FX6C75KHKIJYNAPASQYCZKRS4IVUWL44FA@2/m/enforcer-rules/src/main/java/org/apache/maven/plugins/enforcer/utils/EnforcerRuleUtils.java:
Recompile with -Xlint:deprecation for details.
[linux-jdk10] [INFO] /home/jenkins/jenkins-slave/workspace/aven-enforcer_MENFORCER-276-ARAEEUQ3DZKGP7LK65FX6C75KHKIJYNAPASQYCZKRS4IVUWL44FA@2/m/enforcer-rules/src/main/java/org/apache/maven/plugins/enforcer/RequirePluginVersions.java:
/home/jenkins/jenkins-slave/workspace/aven-enforcer_MENFORCER-276-ARAEEUQ3DZKGP7LK65FX6C75KHKIJYNAPASQYCZKRS4IVUWL44FA@2/m/enforcer-rules/src/main/java/org/apache/maven/plugins/enforcer/RequirePluginVersions.java
uses unchecked or unsafe operations.
[linux-jdk10] [INFO] /home/jenkins/jenkins-slave/workspace/aven-enforcer_MENFORCER-276-ARAEEUQ3DZKGP7LK65FX6C75KHKIJYNAPASQYCZKRS4IVUWL44FA@2/m/enforcer-rules/src/main/java/org/apache/maven/plugins/enforcer/RequirePluginVersions.java:
Recompile with -Xlint:unchecked for details.
[linux-jdk10] [INFO] 
[linux-jdk10] [INFO] --- maven-resources-plugin:3.0.2:testResources (default-testResources)
@ enforcer-rules ---
[linux-jdk10] [INFO] Using 'UTF-8' encoding to copy filtered resources.
[linux-jdk10] [INFO] Copying 11 resources
[linux-jdk10] [INFO] Copying 3 resources
[linux-jdk10] [INFO] 
[linux-jdk10] [INFO] --- maven-compiler-plugin:3.7.0:testCompile (default-testCompile) @ enforcer-rules
---
[linux-jdk10] [INFO] Changes detected - recompiling the module!
[linux-jdk10] [INFO] Compiling 35 source files to /home/jenkins/jenkins-slave/workspace/aven-enforcer_MENFORCER-276-ARAEEUQ3DZKGP7LK65FX6C75KHKIJYNAPASQYCZKRS4IVUWL44FA@2/m/enforcer-rules/target/test-classes
[windows-jdk10] Running on windows-2012-3 in f:\jenkins\jenkins-slave\workspace\aven-enforcer_MENFORCER-276-ARAEEUQ3DZKGP7LK65FX6C75KHKIJYNAPASQYCZKRS4IVUWL44FA@3
[Pipeline] [linux-jdk7] // stage
[Pipeline] [windows-jdk8] {
[Pipeline] [windows-jdk9] // node
[Pipeline] [windows-jdk10] // node
[Pipeline] [windows-jdk9] }
[windows-jdk9] Failed in branch windows-jdk9
[Pipeline] [windows-jdk10] }
[windows-jdk10] Failed in branch windows-jdk10
[Pipeline] [linux-jdk7] }
[Pipeline] [linux-jdk9] }
[Pipeline] [linux-jdk10] }
[Pipeline] [windows-jdk7] }
[Pipeline] [windows-jdk8] stage
[Pipeline] [windows-jdk8] { (Checkout windows-jdk8)
[Pipeline] [windows-jdk8] dir
[windows-jdk8] Running in f:\jenkins\jenkins-slave\workspace\aven-enforcer_MENFORCER-276-ARAEEUQ3DZKGP7LK65FX6C75KHKIJYNAPASQYCZKRS4IVUWL44FA@2\m
[Pipeline] [windows-jdk8] {
[Pipeline] [windows-jdk8] checkout
[Pipeline] [linux-jdk7] // node
[Pipeline] [linux-jdk9] // dir
[windows-jdk8] Cloning the remote Git repository
[windows-jdk8] Cloning with configured refspecs honoured and without tags
[Pipeline] [linux-jdk10] // dir
[windows-jdk8] Cloning repository https://gitbox.apache.org/repos/asf/maven-enforcer.git
[windows-jdk8]  > git init f:\jenkins\jenkins-slave\workspace\aven-enforcer_MENFORCER-276-ARAEEUQ3DZKGP7LK65FX6C75KHKIJYNAPASQYCZKRS4IVUWL44FA@2\m
# timeout=10
[windows-jdk8] Fetching upstream changes from https://gitbox.apache.org/repos/asf/maven-enforcer.git
[windows-jdk8]  > git --version # timeout=10
[windows-jdk8]  > git fetch --no-tags --progress https://gitbox.apache.org/repos/asf/maven-enforcer.git
+refs/heads/*:refs/remotes/origin/*
[windows-jdk8]  > git config remote.origin.url https://gitbox.apache.org/repos/asf/maven-enforcer.git
# timeout=10
[windows-jdk8]  > git config --add remote.origin.fetch +refs/heads/*:refs/remotes/origin/*
# timeout=10
[windows-jdk8]  > git config remote.origin.url https://gitbox.apache.org/repos/asf/maven-enforcer.git
# timeout=10
[windows-jdk8] Fetching without tags
[windows-jdk8] Fetching upstream changes from https://gitbox.apache.org/repos/asf/maven-enforcer.git
[windows-jdk8]  > git fetch --no-tags --progress https://gitbox.apache.org/repos/asf/maven-enforcer.git
+refs/heads/*:refs/remotes/origin/*
[windows-jdk8] Checking out Revision a7650017ace1e95d4e6c2aa65f15b08b890be40f (MENFORCER-276)
[windows-jdk8]  > git config core.sparsecheckout # timeout=10
[windows-jdk8]  > git checkout -f a7650017ace1e95d4e6c2aa65f15b08b890be40f
[windows-jdk8] Commit message: "Add Unit tests for RequireUpperBoundDeps"
[windows-jdk8] Cleaning workspace
[windows-jdk8]  > git rev-parse --verify HEAD # timeout=10
[windows-jdk8] Resetting working tree
[windows-jdk8]  > git reset --hard # timeout=10
[windows-jdk8]  > git clean -fdx # timeout=10
[Pipeline] [windows-jdk7] // dir
[Pipeline] [linux-jdk7] }
[Pipeline] [linux-jdk9] }
[linux-jdk9] [withMaven] junitPublisher - Archive test results for Maven artifact org.apache.maven.enforcer:enforcer-api:3.0.0-SNAPSHOT
generated by maven-surefire-plugin:test (default-test): m/enforcer-api/target/surefire-reports/*.xml
[linux-jdk9] Recording test results
[linux-jdk9] None of the test reports contained any result
[Pipeline] [linux-jdk10] }
[linux-jdk10] [withMaven] One or multiple Maven executions have been ignored by the Jenkins
Pipeline Maven Plugin because they have been interrupted before completion (1). See Pipeline
Maven Plugin FAQ for more details.
[Pipeline] [windows-jdk7] }
[Pipeline] [linux-jdk9] // withMaven
[Pipeline] [linux-jdk10] // withMaven
[Pipeline] [windows-jdk7] // stage
[Pipeline] [linux-jdk9] echo
[linux-jdk9] [FAIL FAST] linux-jdk8 had first failure, ignoring script returned exit code
1
[Pipeline] [linux-jdk9] }
[Pipeline] [linux-jdk10] echo
[linux-jdk10] [FAIL FAST] linux-jdk8 had first failure, ignoring null
[Pipeline] [linux-jdk10] }
[Pipeline] [windows-jdk7] stage
[Pipeline] [windows-jdk7] { (Build windows-jdk7)
[Pipeline] [windows-jdk8] }
[Pipeline] [windows-jdk7] echo
[windows-jdk7] [FAIL FAST] linux-jdk8 has failed. Skipping windows-jdk7.
[Pipeline] [windows-jdk7] }
[Pipeline] [linux-jdk9] // stage
[Pipeline] [linux-jdk10] // stage
[Pipeline] [linux-jdk9] }
[Pipeline] [linux-jdk10] }
[Pipeline] [windows-jdk8] // dir
[Pipeline] [windows-jdk8] }
[Pipeline] [windows-jdk7] // stage
[Pipeline] [windows-jdk7] }
[Pipeline] [linux-jdk9] // node
[Pipeline] [linux-jdk10] // node
[Pipeline] [linux-jdk9] }
[Pipeline] [linux-jdk10] }
[Pipeline] [windows-jdk8] // stage
[Pipeline] [windows-jdk8] stage
[Pipeline] [windows-jdk8] { (Build windows-jdk8)
[Pipeline] [windows-jdk7] // node
[Pipeline] [windows-jdk7] }
[Pipeline] [windows-jdk8] echo
[windows-jdk8] [FAIL FAST] linux-jdk8 has failed. Skipping windows-jdk8.
[Pipeline] [windows-jdk8] }
[Pipeline] [windows-jdk8] // stage
[Pipeline] [windows-jdk8] }
[Pipeline] [windows-jdk8] // node
[Pipeline] [windows-jdk8] }
[windows-jdk8] Failed in branch windows-jdk8
[Pipeline] // parallel
[Pipeline] echo
***** FAST FAILURE *****

Fast failure triggered by linux-jdk8

***** FAST FAILURE *****
[Pipeline] stage
[Pipeline] { (Notifications)
[Pipeline] echo
Build result: FAILURE
[Pipeline] jiraIssueSelector
Mime
  • Unnamed multipart/mixed (inline, None, 0 bytes)
View raw message