maven-notifications mailing list archives

Site index · List index
Message view « Date » · « Thread »
Top « Date » · « Thread »
From Apache Jenkins Server <jenk...@builds.apache.org>
Subject Build unstable in Jenkins: Maven TLP » maven » MNG-6391 #6
Date Sun, 10 Jun 2018 11:13:14 GMT
See https://builds.apache.org/job/maven-box/job/maven/job/MNG-6391/6/

Changes:

* [MNG-6386] ${project.baseUri} is not a valid URI (according to RFC 3986)
* [MNG-6386] ${project.baseUri} is not a valid URI (according to RFC 3986)
* [MNG-6386] ${project.baseUri} is not a valid URI (according to RFC 3986)
* [MNG-6386] ${project.baseUri} is not a valid URI (according to RFC 3986)

2 tests failed.
FAILED:  org.apache.maven.it.MavenITmng6352PrintVersionTest.testitShouldPrintVersionAtTopAndAtBottom

Error Message:
expected:<4> but was:<0>

Stack Trace:
junit.framework.AssertionFailedError: expected:<4> but was:<0>
	at org.apache.maven.it.MavenITmng6352PrintVersionTest.testitShouldPrintVersionAtTopAndAtBottom(MavenITmng6352PrintVersionTest.java:72)


FAILED:  org.apache.maven.it.MavenITmng6352PrintVersionTest.testitShouldPrintVersionAtTopAndAtBottom

Error Message:
expected:<4> but was:<0>

Stack Trace:
junit.framework.AssertionFailedError: expected:<4> but was:<0>
	at org.apache.maven.it.MavenITmng6352PrintVersionTest.testitShouldPrintVersionAtTopAndAtBottom(MavenITmng6352PrintVersionTest.java:72)




Build log:
[...truncated 6.36 MB...]
[windows-jdk8] 	at org.jenkinsci.plugins.workflow.cps.CpsThreadGroup.run(CpsThreadGroup.java:331)
[windows-jdk8] 	at org.jenkinsci.plugins.workflow.cps.CpsThreadGroup.access$200(CpsThreadGroup.java:82)
[windows-jdk8] 	at org.jenkinsci.plugins.workflow.cps.CpsThreadGroup$2.call(CpsThreadGroup.java:243)
[windows-jdk8] 	at org.jenkinsci.plugins.workflow.cps.CpsThreadGroup$2.call(CpsThreadGroup.java:231)
[windows-jdk8] 	at org.jenkinsci.plugins.workflow.cps.CpsVmExecutorService$2.call(CpsVmExecutorService.java:64)
[windows-jdk8] 	at java.util.concurrent.FutureTask.run(FutureTask.java:266)
[windows-jdk8] 	at hudson.remoting.SingleLaneExecutorService$1.run(SingleLaneExecutorService.java:112)
[windows-jdk8] 	at jenkins.util.ContextResettingExecutorService$1.run(ContextResettingExecutorService.java:28)
[windows-jdk8] 	at java.util.concurrent.Executors$RunnableAdapter.call(Executors.java:511)
[windows-jdk8] 	at java.util.concurrent.FutureTask.run(FutureTask.java:266)
[windows-jdk8] 	at java.util.concurrent.ThreadPoolExecutor.runWorker(ThreadPoolExecutor.java:1149)
[windows-jdk8] 	at java.util.concurrent.ThreadPoolExecutor$Worker.run(ThreadPoolExecutor.java:624)
[windows-jdk8] 	at java.lang.Thread.run(Thread.java:748)
[windows-jdk8] ERROR: [withMaven] artifactsPublisher - WARNING: Exception archiving and fingerprinting
MavenArtifact{org.apache.maven.its.plugins:maven-it-plugins:xml:site:2.1-SNAPSHOT(version:
2.1-SNAPSHOT, snapshot:true)  C:\mvn-it-1.tmp\core-it-support\core-it-plugins\target\maven-it-plugins-2.1-SNAPSHOT-site.xml},
skip archiving of the artifacts
[windows-jdk8] java.lang.IllegalArgumentException: Cannot relativize 'C:\mvn-it-1.tmp\core-it-support\core-it-plugins\target\maven-it-plugins-2.1-SNAPSHOT-site.xml'
relatively to '/mvn-it-1.tmp'
[windows-jdk8] 	at org.jenkinsci.plugins.pipeline.maven.util.XmlUtils.getPathInWorkspace(XmlUtils.java:396)
[windows-jdk8] 	at org.jenkinsci.plugins.pipeline.maven.publishers.GeneratedArtifactsPublisher.process(GeneratedArtifactsPublisher.java:95)
[windows-jdk8] 	at org.jenkinsci.plugins.pipeline.maven.MavenSpyLogProcessor.processMavenSpyLogs(MavenSpyLogProcessor.java:114)
[windows-jdk8] 	at org.jenkinsci.plugins.pipeline.maven.WithMavenStepExecution$WorkspaceCleanupCallback.finished(WithMavenStepExecution.java:1015)
[windows-jdk8] 	at org.jenkinsci.plugins.workflow.steps.BodyExecutionCallback$TailCall.onSuccess(BodyExecutionCallback.java:114)
[windows-jdk8] 	at org.jenkinsci.plugins.workflow.cps.CpsBodyExecution$SuccessAdapter.receive(CpsBodyExecution.java:368)
[windows-jdk8] 	at com.cloudbees.groovy.cps.Outcome.resumeFrom(Outcome.java:73)
[windows-jdk8] 	at com.cloudbees.groovy.cps.Continuable$1.call(Continuable.java:166)
[windows-jdk8] 	at com.cloudbees.groovy.cps.Continuable$1.call(Continuable.java:163)
[windows-jdk8] 	at org.codehaus.groovy.runtime.GroovyCategorySupport$ThreadCategoryInfo.use(GroovyCategorySupport.java:122)
[windows-jdk8] 	at org.codehaus.groovy.runtime.GroovyCategorySupport.use(GroovyCategorySupport.java:261)
[windows-jdk8] 	at com.cloudbees.groovy.cps.Continuable.run0(Continuable.java:163)
[windows-jdk8] 	at org.jenkinsci.plugins.workflow.cps.SandboxContinuable.access$001(SandboxContinuable.java:19)
[windows-jdk8] 	at org.jenkinsci.plugins.workflow.cps.SandboxContinuable$1.call(SandboxContinuable.java:35)
[windows-jdk8] 	at org.jenkinsci.plugins.workflow.cps.SandboxContinuable$1.call(SandboxContinuable.java:32)
[windows-jdk8] 	at org.jenkinsci.plugins.scriptsecurity.sandbox.groovy.GroovySandbox.runInSandbox(GroovySandbox.java:108)
[windows-jdk8] 	at org.jenkinsci.plugins.workflow.cps.SandboxContinuable.run0(SandboxContinuable.java:32)
[windows-jdk8] 	at org.jenkinsci.plugins.workflow.cps.CpsThread.runNextChunk(CpsThread.java:174)
[windows-jdk8] 	at org.jenkinsci.plugins.workflow.cps.CpsThreadGroup.run(CpsThreadGroup.java:331)
[windows-jdk8] 	at org.jenkinsci.plugins.workflow.cps.CpsThreadGroup.access$200(CpsThreadGroup.java:82)
[windows-jdk8] 	at org.jenkinsci.plugins.workflow.cps.CpsThreadGroup$2.call(CpsThreadGroup.java:243)
[windows-jdk8] 	at org.jenkinsci.plugins.workflow.cps.CpsThreadGroup$2.call(CpsThreadGroup.java:231)
[windows-jdk8] 	at org.jenkinsci.plugins.workflow.cps.CpsVmExecutorService$2.call(CpsVmExecutorService.java:64)
[windows-jdk8] 	at java.util.concurrent.FutureTask.run(FutureTask.java:266)
[windows-jdk8] 	at hudson.remoting.SingleLaneExecutorService$1.run(SingleLaneExecutorService.java:112)
[windows-jdk8] 	at jenkins.util.ContextResettingExecutorService$1.run(ContextResettingExecutorService.java:28)
[windows-jdk8] 	at java.util.concurrent.Executors$RunnableAdapter.call(Executors.java:511)
[windows-jdk8] 	at java.util.concurrent.FutureTask.run(FutureTask.java:266)
[windows-jdk8] 	at java.util.concurrent.ThreadPoolExecutor.runWorker(ThreadPoolExecutor.java:1149)
[windows-jdk8] 	at java.util.concurrent.ThreadPoolExecutor$Worker.run(ThreadPoolExecutor.java:624)
[windows-jdk8] 	at java.lang.Thread.run(Thread.java:748)
[windows-jdk8] ERROR: [withMaven] artifactsPublisher - WARNING: Exception archiving and fingerprinting
MavenArtifact{org.apache.maven.its.plugins:maven-it-plugin-core-stubs:xml:site:2.1-SNAPSHOT(version:
2.1-SNAPSHOT, snapshot:true)  C:\mvn-it-1.tmp\core-it-support\core-it-plugins\maven-it-plugin-core-stubs\target\maven-it-plugin-core-stubs-2.1-SNAPSHOT-site.xml},
skip archiving of the artifacts
[windows-jdk8] java.lang.IllegalArgumentException: Cannot relativize 'C:\mvn-it-1.tmp\core-it-support\core-it-plugins\maven-it-plugin-core-stubs\target\maven-it-plugin-core-stubs-2.1-SNAPSHOT-site.xml'
relatively to '/mvn-it-1.tmp'
[windows-jdk8] 	at org.jenkinsci.plugins.pipeline.maven.util.XmlUtils.getPathInWorkspace(XmlUtils.java:396)
[windows-jdk8] 	at org.jenkinsci.plugins.pipeline.maven.publishers.GeneratedArtifactsPublisher.process(GeneratedArtifactsPublisher.java:95)
[windows-jdk8] 	at org.jenkinsci.plugins.pipeline.maven.MavenSpyLogProcessor.processMavenSpyLogs(MavenSpyLogProcessor.java:114)
[windows-jdk8] 	at org.jenkinsci.plugins.pipeline.maven.WithMavenStepExecution$WorkspaceCleanupCallback.finished(WithMavenStepExecution.java:1015)
[windows-jdk8] 	at org.jenkinsci.plugins.workflow.steps.BodyExecutionCallback$TailCall.onSuccess(BodyExecutionCallback.java:114)
[windows-jdk8] 	at org.jenkinsci.plugins.workflow.cps.CpsBodyExecution$SuccessAdapter.receive(CpsBodyExecution.java:368)
[windows-jdk8] 	at com.cloudbees.groovy.cps.Outcome.resumeFrom(Outcome.java:73)
[windows-jdk8] 	at com.cloudbees.groovy.cps.Continuable$1.call(Continuable.java:166)
[windows-jdk8] 	at com.cloudbees.groovy.cps.Continuable$1.call(Continuable.java:163)
[windows-jdk8] 	at org.codehaus.groovy.runtime.GroovyCategorySupport$ThreadCategoryInfo.use(GroovyCategorySupport.java:122)
[windows-jdk8] 	at org.codehaus.groovy.runtime.GroovyCategorySupport.use(GroovyCategorySupport.java:261)
[windows-jdk8] 	at com.cloudbees.groovy.cps.Continuable.run0(Continuable.java:163)
[windows-jdk8] 	at org.jenkinsci.plugins.workflow.cps.SandboxContinuable.access$001(SandboxContinuable.java:19)
[windows-jdk8] 	at org.jenkinsci.plugins.workflow.cps.SandboxContinuable$1.call(SandboxContinuable.java:35)
[windows-jdk8] 	at org.jenkinsci.plugins.workflow.cps.SandboxContinuable$1.call(SandboxContinuable.java:32)
[windows-jdk8] 	at org.jenkinsci.plugins.scriptsecurity.sandbox.groovy.GroovySandbox.runInSandbox(GroovySandbox.java:108)
[windows-jdk8] 	at org.jenkinsci.plugins.workflow.cps.SandboxContinuable.run0(SandboxContinuable.java:32)
[windows-jdk8] 	at org.jenkinsci.plugins.workflow.cps.CpsThread.runNextChunk(CpsThread.java:174)
[windows-jdk8] 	at org.jenkinsci.plugins.workflow.cps.CpsThreadGroup.run(CpsThreadGroup.java:331)
[windows-jdk8] 	at org.jenkinsci.plugins.workflow.cps.CpsThreadGroup.access$200(CpsThreadGroup.java:82)
[windows-jdk8] 	at org.jenkinsci.plugins.workflow.cps.CpsThreadGroup$2.call(CpsThreadGroup.java:243)
[windows-jdk8] 	at org.jenkinsci.plugins.workflow.cps.CpsThreadGroup$2.call(CpsThreadGroup.java:231)
[windows-jdk8] 	at org.jenkinsci.plugins.workflow.cps.CpsVmExecutorService$2.call(CpsVmExecutorService.java:64)
[windows-jdk8] 	at java.util.concurrent.FutureTask.run(FutureTask.java:266)
[windows-jdk8] 	at hudson.remoting.SingleLaneExecutorService$1.run(SingleLaneExecutorService.java:112)
[windows-jdk8] 	at jenkins.util.ContextResettingExecutorService$1.run(ContextResettingExecutorService.java:28)
[windows-jdk8] 	at java.util.concurrent.Executors$RunnableAdapter.call(Executors.java:511)
[windows-jdk8] 	at java.util.concurrent.FutureTask.run(FutureTask.java:266)
[windows-jdk8] 	at java.util.concurrent.ThreadPoolExecutor.runWorker(ThreadPoolExecutor.java:1149)
[windows-jdk8] 	at java.util.concurrent.ThreadPoolExecutor$Worker.run(ThreadPoolExecutor.java:624)
[windows-jdk8] 	at java.lang.Thread.run(Thread.java:748)
[windows-jdk8] ERROR: [withMaven] artifactsPublisher - WARNING: Exception archiving and fingerprinting
MavenArtifact{org.apache.maven.its:core-it-support-artifacts:zip:repo:2.1-SNAPSHOT(version:
2.1-SNAPSHOT, snapshot:true)  C:\mvn-it-1.tmp\core-it-support\core-it-support-artifacts\target\core-it-support-artifacts-2.1-SNAPSHOT-repo.zip},
skip archiving of the artifacts
[windows-jdk8] java.lang.IllegalArgumentException: Cannot relativize 'C:\mvn-it-1.tmp\core-it-support\core-it-support-artifacts\target\core-it-support-artifacts-2.1-SNAPSHOT-repo.zip'
relatively to '/mvn-it-1.tmp'
[windows-jdk8] 	at org.jenkinsci.plugins.pipeline.maven.util.XmlUtils.getPathInWorkspace(XmlUtils.java:396)
[windows-jdk8] 	at org.jenkinsci.plugins.pipeline.maven.publishers.GeneratedArtifactsPublisher.process(GeneratedArtifactsPublisher.java:95)
[windows-jdk8] 	at org.jenkinsci.plugins.pipeline.maven.MavenSpyLogProcessor.processMavenSpyLogs(MavenSpyLogProcessor.java:114)
[windows-jdk8] 	at org.jenkinsci.plugins.pipeline.maven.WithMavenStepExecution$WorkspaceCleanupCallback.finished(WithMavenStepExecution.java:1015)
[windows-jdk8] 	at org.jenkinsci.plugins.workflow.steps.BodyExecutionCallback$TailCall.onSuccess(BodyExecutionCallback.java:114)
[windows-jdk8] 	at org.jenkinsci.plugins.workflow.cps.CpsBodyExecution$SuccessAdapter.receive(CpsBodyExecution.java:368)
[windows-jdk8] 	at com.cloudbees.groovy.cps.Outcome.resumeFrom(Outcome.java:73)
[windows-jdk8] 	at com.cloudbees.groovy.cps.Continuable$1.call(Continuable.java:166)
[windows-jdk8] 	at com.cloudbees.groovy.cps.Continuable$1.call(Continuable.java:163)
[windows-jdk8] 	at org.codehaus.groovy.runtime.GroovyCategorySupport$ThreadCategoryInfo.use(GroovyCategorySupport.java:122)
[windows-jdk8] 	at org.codehaus.groovy.runtime.GroovyCategorySupport.use(GroovyCategorySupport.java:261)
[windows-jdk8] 	at com.cloudbees.groovy.cps.Continuable.run0(Continuable.java:163)
[windows-jdk8] 	at org.jenkinsci.plugins.workflow.cps.SandboxContinuable.access$001(SandboxContinuable.java:19)
[windows-jdk8] 	at org.jenkinsci.plugins.workflow.cps.SandboxContinuable$1.call(SandboxContinuable.java:35)
[windows-jdk8] 	at org.jenkinsci.plugins.workflow.cps.SandboxContinuable$1.call(SandboxContinuable.java:32)
[windows-jdk8] 	at org.jenkinsci.plugins.scriptsecurity.sandbox.groovy.GroovySandbox.runInSandbox(GroovySandbox.java:108)
[windows-jdk8] 	at org.jenkinsci.plugins.workflow.cps.SandboxContinuable.run0(SandboxContinuable.java:32)
[windows-jdk8] 	at org.jenkinsci.plugins.workflow.cps.CpsThread.runNextChunk(CpsThread.java:174)
[windows-jdk8] 	at org.jenkinsci.plugins.workflow.cps.CpsThreadGroup.run(CpsThreadGroup.java:331)
[windows-jdk8] 	at org.jenkinsci.plugins.workflow.cps.CpsThreadGroup.access$200(CpsThreadGroup.java:82)
[windows-jdk8] 	at org.jenkinsci.plugins.workflow.cps.CpsThreadGroup$2.call(CpsThreadGroup.java:243)
[windows-jdk8] 	at org.jenkinsci.plugins.workflow.cps.CpsThreadGroup$2.call(CpsThreadGroup.java:231)
[windows-jdk8] 	at org.jenkinsci.plugins.workflow.cps.CpsVmExecutorService$2.call(CpsVmExecutorService.java:64)
[windows-jdk8] 	at java.util.concurrent.FutureTask.run(FutureTask.java:266)
[windows-jdk8] 	at hudson.remoting.SingleLaneExecutorService$1.run(SingleLaneExecutorService.java:112)
[windows-jdk8] 	at jenkins.util.ContextResettingExecutorService$1.run(ContextResettingExecutorService.java:28)
[windows-jdk8] 	at java.util.concurrent.Executors$RunnableAdapter.call(Executors.java:511)
[windows-jdk8] 	at java.util.concurrent.FutureTask.run(FutureTask.java:266)
[windows-jdk8] 	at java.util.concurrent.ThreadPoolExecutor.runWorker(ThreadPoolExecutor.java:1149)
[windows-jdk8] 	at java.util.concurrent.ThreadPoolExecutor$Worker.run(ThreadPoolExecutor.java:624)
[windows-jdk8] 	at java.lang.Thread.run(Thread.java:748)
[windows-jdk8] ERROR: [withMaven] artifactsPublisher - WARNING: Exception archiving and fingerprinting
MavenArtifact{org.apache.maven.its:core-it-suite:test-jar:tests:2.1-SNAPSHOT(version: 2.1-SNAPSHOT,
snapshot:true)  C:\mvn-it-1.tmp\core-it-suite\target\core-it-suite-2.1-SNAPSHOT-tests.jar},
skip archiving of the artifacts
[windows-jdk8] java.lang.IllegalArgumentException: Cannot relativize 'C:\mvn-it-1.tmp\core-it-suite\target\core-it-suite-2.1-SNAPSHOT-tests.jar'
relatively to '/mvn-it-1.tmp'
[windows-jdk8] 	at org.jenkinsci.plugins.pipeline.maven.util.XmlUtils.getPathInWorkspace(XmlUtils.java:396)
[windows-jdk8] 	at org.jenkinsci.plugins.pipeline.maven.publishers.GeneratedArtifactsPublisher.process(GeneratedArtifactsPublisher.java:95)
[windows-jdk8] 	at org.jenkinsci.plugins.pipeline.maven.MavenSpyLogProcessor.processMavenSpyLogs(MavenSpyLogProcessor.java:114)
[windows-jdk8] 	at org.jenkinsci.plugins.pipeline.maven.WithMavenStepExecution$WorkspaceCleanupCallback.finished(WithMavenStepExecution.java:1015)
[windows-jdk8] 	at org.jenkinsci.plugins.workflow.steps.BodyExecutionCallback$TailCall.onSuccess(BodyExecutionCallback.java:114)
[windows-jdk8] 	at org.jenkinsci.plugins.workflow.cps.CpsBodyExecution$SuccessAdapter.receive(CpsBodyExecution.java:368)
[windows-jdk8] 	at com.cloudbees.groovy.cps.Outcome.resumeFrom(Outcome.java:73)
[windows-jdk8] 	at com.cloudbees.groovy.cps.Continuable$1.call(Continuable.java:166)
[windows-jdk8] 	at com.cloudbees.groovy.cps.Continuable$1.call(Continuable.java:163)
[windows-jdk8] 	at org.codehaus.groovy.runtime.GroovyCategorySupport$ThreadCategoryInfo.use(GroovyCategorySupport.java:122)
[windows-jdk8] 	at org.codehaus.groovy.runtime.GroovyCategorySupport.use(GroovyCategorySupport.java:261)
[windows-jdk8] 	at com.cloudbees.groovy.cps.Continuable.run0(Continuable.java:163)
[windows-jdk8] 	at org.jenkinsci.plugins.workflow.cps.SandboxContinuable.access$001(SandboxContinuable.java:19)
[windows-jdk8] 	at org.jenkinsci.plugins.workflow.cps.SandboxContinuable$1.call(SandboxContinuable.java:35)
[windows-jdk8] 	at org.jenkinsci.plugins.workflow.cps.SandboxContinuable$1.call(SandboxContinuable.java:32)
[windows-jdk8] 	at org.jenkinsci.plugins.scriptsecurity.sandbox.groovy.GroovySandbox.runInSandbox(GroovySandbox.java:108)
[windows-jdk8] 	at org.jenkinsci.plugins.workflow.cps.SandboxContinuable.run0(SandboxContinuable.java:32)
[windows-jdk8] 	at org.jenkinsci.plugins.workflow.cps.CpsThread.runNextChunk(CpsThread.java:174)
[windows-jdk8] 	at org.jenkinsci.plugins.workflow.cps.CpsThreadGroup.run(CpsThreadGroup.java:331)
[windows-jdk8] 	at org.jenkinsci.plugins.workflow.cps.CpsThreadGroup.access$200(CpsThreadGroup.java:82)
[windows-jdk8] 	at org.jenkinsci.plugins.workflow.cps.CpsThreadGroup$2.call(CpsThreadGroup.java:243)
[windows-jdk8] 	at org.jenkinsci.plugins.workflow.cps.CpsThreadGroup$2.call(CpsThreadGroup.java:231)
[windows-jdk8] 	at org.jenkinsci.plugins.workflow.cps.CpsVmExecutorService$2.call(CpsVmExecutorService.java:64)
[windows-jdk8] 	at java.util.concurrent.FutureTask.run(FutureTask.java:266)
[windows-jdk8] 	at hudson.remoting.SingleLaneExecutorService$1.run(SingleLaneExecutorService.java:112)
[windows-jdk8] 	at jenkins.util.ContextResettingExecutorService$1.run(ContextResettingExecutorService.java:28)
[windows-jdk8] 	at java.util.concurrent.Executors$RunnableAdapter.call(Executors.java:511)
[windows-jdk8] 	at java.util.concurrent.FutureTask.run(FutureTask.java:266)
[windows-jdk8] 	at java.util.concurrent.ThreadPoolExecutor.runWorker(ThreadPoolExecutor.java:1149)
[windows-jdk8] 	at java.util.concurrent.ThreadPoolExecutor$Worker.run(ThreadPoolExecutor.java:624)
[windows-jdk8] 	at java.lang.Thread.run(Thread.java:748)
[windows-jdk8] ERROR: [withMaven] WARNING Exception executing Maven reporter 'Junit Publisher'
/ org.jenkinsci.plugins.pipeline.maven.publishers.JunitTestsPublisher. Please report a bug
associated for the component 'pipeline-maven-plugin' at https://issues.jenkins-ci.org 
[windows-jdk8] java.lang.IllegalArgumentException: Cannot relativize 'C:\mvn-it-1.tmp\core-it-support\core-it-plugins\maven-it-plugin-active-collection\target/surefire-reports'
relatively to '/mvn-it-1.tmp'
[windows-jdk8] 	at org.jenkinsci.plugins.pipeline.maven.util.XmlUtils.getPathInWorkspace(XmlUtils.java:396)
[windows-jdk8] 	at org.jenkinsci.plugins.pipeline.maven.publishers.JunitTestsPublisher.executeReporter(JunitTestsPublisher.java:236)
[windows-jdk8] 	at org.jenkinsci.plugins.pipeline.maven.publishers.JunitTestsPublisher.process(JunitTestsPublisher.java:182)
[windows-jdk8] 	at org.jenkinsci.plugins.pipeline.maven.MavenSpyLogProcessor.processMavenSpyLogs(MavenSpyLogProcessor.java:114)
[windows-jdk8] 	at org.jenkinsci.plugins.pipeline.maven.WithMavenStepExecution$WorkspaceCleanupCallback.finished(WithMavenStepExecution.java:1015)
[windows-jdk8] 	at org.jenkinsci.plugins.workflow.steps.BodyExecutionCallback$TailCall.onSuccess(BodyExecutionCallback.java:114)
[windows-jdk8] 	at org.jenkinsci.plugins.workflow.cps.CpsBodyExecution$SuccessAdapter.receive(CpsBodyExecution.java:368)
[windows-jdk8] 	at com.cloudbees.groovy.cps.Outcome.resumeFrom(Outcome.java:73)
[windows-jdk8] 	at com.cloudbees.groovy.cps.Continuable$1.call(Continuable.java:166)
[windows-jdk8] 	at com.cloudbees.groovy.cps.Continuable$1.call(Continuable.java:163)
[windows-jdk8] 	at org.codehaus.groovy.runtime.GroovyCategorySupport$ThreadCategoryInfo.use(GroovyCategorySupport.java:122)
[windows-jdk8] 	at org.codehaus.groovy.runtime.GroovyCategorySupport.use(GroovyCategorySupport.java:261)
[windows-jdk8] 	at com.cloudbees.groovy.cps.Continuable.run0(Continuable.java:163)
[windows-jdk8] 	at org.jenkinsci.plugins.workflow.cps.SandboxContinuable.access$001(SandboxContinuable.java:19)
[windows-jdk8] 	at org.jenkinsci.plugins.workflow.cps.SandboxContinuable$1.call(SandboxContinuable.java:35)
[windows-jdk8] 	at org.jenkinsci.plugins.workflow.cps.SandboxContinuable$1.call(SandboxContinuable.java:32)
[windows-jdk8] 	at org.jenkinsci.plugins.scriptsecurity.sandbox.groovy.GroovySandbox.runInSandbox(GroovySandbox.java:108)
[windows-jdk8] 	at org.jenkinsci.plugins.workflow.cps.SandboxContinuable.run0(SandboxContinuable.java:32)
[windows-jdk8] 	at org.jenkinsci.plugins.workflow.cps.CpsThread.runNextChunk(CpsThread.java:174)
[windows-jdk8] 	at org.jenkinsci.plugins.workflow.cps.CpsThreadGroup.run(CpsThreadGroup.java:331)
[windows-jdk8] 	at org.jenkinsci.plugins.workflow.cps.CpsThreadGroup.access$200(CpsThreadGroup.java:82)
[windows-jdk8] 	at org.jenkinsci.plugins.workflow.cps.CpsThreadGroup$2.call(CpsThreadGroup.java:243)
[windows-jdk8] 	at org.jenkinsci.plugins.workflow.cps.CpsThreadGroup$2.call(CpsThreadGroup.java:231)
[windows-jdk8] 	at org.jenkinsci.plugins.workflow.cps.CpsVmExecutorService$2.call(CpsVmExecutorService.java:64)
[windows-jdk8] 	at java.util.concurrent.FutureTask.run(FutureTask.java:266)
[windows-jdk8] 	at hudson.remoting.SingleLaneExecutorService$1.run(SingleLaneExecutorService.java:112)
[windows-jdk8] 	at jenkins.util.ContextResettingExecutorService$1.run(ContextResettingExecutorService.java:28)
[windows-jdk8] 	at java.util.concurrent.Executors$RunnableAdapter.call(Executors.java:511)
[windows-jdk8] 	at java.util.concurrent.FutureTask.run(FutureTask.java:266)
[windows-jdk8] 	at java.util.concurrent.ThreadPoolExecutor.runWorker(ThreadPoolExecutor.java:1149)
[windows-jdk8] 	at java.util.concurrent.ThreadPoolExecutor$Worker.run(ThreadPoolExecutor.java:624)
[windows-jdk8] 	at java.lang.Thread.run(Thread.java:748)
[windows-jdk8] ERROR: [withMaven] WARNING Exception executing Maven reporter 'Open Task Scanner
Publisher' / org.jenkinsci.plugins.pipeline.maven.publishers.TasksScannerPublisher. Please
report a bug associated for the component 'pipeline-maven-plugin' at https://issues.jenkins-ci.org

[windows-jdk8] java.lang.IllegalArgumentException: Cannot relativize 'C:\mvn-it-1.tmp\src\main\java'
relatively to '/mvn-it-1.tmp'
[windows-jdk8] 	at org.jenkinsci.plugins.pipeline.maven.util.XmlUtils.getPathInWorkspace(XmlUtils.java:396)
[windows-jdk8] 	at org.jenkinsci.plugins.pipeline.maven.publishers.TasksScannerPublisher.process(TasksScannerPublisher.java:136)
[windows-jdk8] 	at org.jenkinsci.plugins.pipeline.maven.MavenSpyLogProcessor.processMavenSpyLogs(MavenSpyLogProcessor.java:114)
[windows-jdk8] 	at org.jenkinsci.plugins.pipeline.maven.WithMavenStepExecution$WorkspaceCleanupCallback.finished(WithMavenStepExecution.java:1015)
[windows-jdk8] 	at org.jenkinsci.plugins.workflow.steps.BodyExecutionCallback$TailCall.onSuccess(BodyExecutionCallback.java:114)
[windows-jdk8] 	at org.jenkinsci.plugins.workflow.cps.CpsBodyExecution$SuccessAdapter.receive(CpsBodyExecution.java:368)
[windows-jdk8] 	at com.cloudbees.groovy.cps.Outcome.resumeFrom(Outcome.java:73)
[windows-jdk8] 	at com.cloudbees.groovy.cps.Continuable$1.call(Continuable.java:166)
[windows-jdk8] 	at com.cloudbees.groovy.cps.Continuable$1.call(Continuable.java:163)
[windows-jdk8] 	at org.codehaus.groovy.runtime.GroovyCategorySupport$ThreadCategoryInfo.use(GroovyCategorySupport.java:122)
[windows-jdk8] 	at org.codehaus.groovy.runtime.GroovyCategorySupport.use(GroovyCategorySupport.java:261)
[windows-jdk8] 	at com.cloudbees.groovy.cps.Continuable.run0(Continuable.java:163)
[windows-jdk8] 	at org.jenkinsci.plugins.workflow.cps.SandboxContinuable.access$001(SandboxContinuable.java:19)
[windows-jdk8] 	at org.jenkinsci.plugins.workflow.cps.SandboxContinuable$1.call(SandboxContinuable.java:35)
[windows-jdk8] 	at org.jenkinsci.plugins.workflow.cps.SandboxContinuable$1.call(SandboxContinuable.java:32)
[windows-jdk8] 	at org.jenkinsci.plugins.scriptsecurity.sandbox.groovy.GroovySandbox.runInSandbox(GroovySandbox.java:108)
[windows-jdk8] 	at org.jenkinsci.plugins.workflow.cps.SandboxContinuable.run0(SandboxContinuable.java:32)
[windows-jdk8] 	at org.jenkinsci.plugins.workflow.cps.CpsThread.runNextChunk(CpsThread.java:174)
[windows-jdk8] 	at org.jenkinsci.plugins.workflow.cps.CpsThreadGroup.run(CpsThreadGroup.java:331)
[windows-jdk8] 	at org.jenkinsci.plugins.workflow.cps.CpsThreadGroup.access$200(CpsThreadGroup.java:82)
[windows-jdk8] 	at org.jenkinsci.plugins.workflow.cps.CpsThreadGroup$2.call(CpsThreadGroup.java:243)
[windows-jdk8] 	at org.jenkinsci.plugins.workflow.cps.CpsThreadGroup$2.call(CpsThreadGroup.java:231)
[windows-jdk8] 	at org.jenkinsci.plugins.workflow.cps.CpsVmExecutorService$2.call(CpsVmExecutorService.java:64)
[windows-jdk8] 	at java.util.concurrent.FutureTask.run(FutureTask.java:266)
[windows-jdk8] 	at hudson.remoting.SingleLaneExecutorService$1.run(SingleLaneExecutorService.java:112)
[windows-jdk8] 	at jenkins.util.ContextResettingExecutorService$1.run(ContextResettingExecutorService.java:28)
[windows-jdk8] 	at java.util.concurrent.Executors$RunnableAdapter.call(Executors.java:511)
[windows-jdk8] 	at java.util.concurrent.FutureTask.run(FutureTask.java:266)
[windows-jdk8] 	at java.util.concurrent.ThreadPoolExecutor.runWorker(ThreadPoolExecutor.java:1149)
[windows-jdk8] 	at java.util.concurrent.ThreadPoolExecutor$Worker.run(ThreadPoolExecutor.java:624)
[windows-jdk8] 	at java.lang.Thread.run(Thread.java:748)
[Pipeline] [linux-jdk8] // dir
[Pipeline] [windows-jdk8] // withMaven
[Pipeline] [linux-jdk8] }
[Pipeline] [linux-jdk7] }
[Pipeline] [windows-jdk8] deleteDir
[Pipeline] [linux-jdk8] // stage
[Pipeline] [linux-jdk7] // dir
[Pipeline] [linux-jdk8] }
[Pipeline] [linux-jdk7] }
[Pipeline] [linux-jdk8] // node
[Pipeline] [linux-jdk7] // stage
[Pipeline] [linux-jdk8] }
[Pipeline] [linux-jdk7] }
[Pipeline] [linux-jdk7] // node
[Pipeline] [linux-jdk7] }
[Pipeline] [windows-jdk7] }
[Pipeline] [windows-jdk7] // dir
[Pipeline] [windows-jdk7] }
[Pipeline] [windows-jdk7] // stage
[Pipeline] [windows-jdk7] }
[Pipeline] [windows-jdk7] // node
[Pipeline] [windows-jdk7] }
[Pipeline] [windows-jdk8] }
[Pipeline] [windows-jdk8] // dir
[Pipeline] [windows-jdk8] }
[Pipeline] [windows-jdk8] // stage
[Pipeline] [windows-jdk8] }
[Pipeline] [windows-jdk8] // node
[Pipeline] [windows-jdk8] }
[Pipeline] // parallel
[Pipeline] stage
[Pipeline] { (Notifications)
[Pipeline] echo
Build result: UNSTABLE
[Pipeline] jiraIssueSelector
[Pipeline] jiraComment
[Pipeline] emailext
Mime
  • Unnamed multipart/mixed (inline, None, 0 bytes)
View raw message