maven-notifications mailing list archives

Site index · List index
Message view « Date » · « Thread »
Top « Date » · « Thread »
From Apache Jenkins Server <jenk...@builds.apache.org>
Subject Build failed in Jenkins: Maven TLP » maven-scm » SCM-886 #2
Date Tue, 03 Jul 2018 10:26:35 GMT
See https://builds.apache.org/job/maven-box/job/maven-scm/job/SCM-886/2/

Changes:

* Add jdkForMaven and mavenForJdk methods Use reqexp for version matching
* regex in switch/case are full match, not partial match
* Update JDKs
* Looks like the API has changed.
* Try to fix it.
* enable TLS 1.2 for Java 7
* TLSv1.x being deactivated since June. So only TLSv1.2 is valid for
* Add asfMavenTlpPlgnBuild to run plugins with multiple Maven versions
* Add maven version to stageId
* Add removeFromCollection() due to RejectedAccessException on
* Scripts not permitted to use method java.util.Collection stream
* Pass 'first'
* Ensure at least minimum required Java version is used
* builds.a.o doesn't have a Maven 3.1.x
* Pass 'failfast'
* Pass 'failingFast'
* Set https.protocols for Java7
* Make failingFast global variable
* Introduce a shared taskContext to keep track of failures
* Make taskContext accessible for try-catch
* Ensure tasks on the same Jenkins instance don't block each others
* dir('m') was used twice
* Also run site goal
* Remove unused parameter
* Disable site plan, doesn't work with multimodules

32 tests failed.
FAILED:  org.apache.maven.scm.plugin.BranchMojoTest.testBranch

Error Message:
Command failed.The svn command failed.

Stack Trace:
org.apache.maven.plugin.MojoExecutionException: Command failed.The svn command failed.
	at org.apache.maven.scm.plugin.BranchMojoTest.setUp(BranchMojoTest.java:74)


FAILED:  org.apache.maven.scm.plugin.ChangeLogMojoTest.testChangeLogWithParameters

Error Message:
Command failed.The svn command failed.

Stack Trace:
org.apache.maven.plugin.MojoExecutionException: Command failed.The svn command failed.
	at org.apache.maven.scm.plugin.ChangeLogMojoTest.testChangeLogWithParameters(ChangeLogMojoTest.java:102)


FAILED:  org.apache.maven.scm.plugin.ChangeLogMojoTest.testChangeLog

Error Message:
Command failed.The svn command failed.

Stack Trace:
org.apache.maven.plugin.MojoExecutionException: Command failed.The svn command failed.
	at org.apache.maven.scm.plugin.ChangeLogMojoTest.testChangeLog(ChangeLogMojoTest.java:79)


FAILED:  org.apache.maven.scm.plugin.CheckoutMojoTest.testExcludeInclude

Error Message:
Command failed.The svn command failed.

Stack Trace:
org.apache.maven.plugin.MojoExecutionException: Command failed.The svn command failed.
	at org.apache.maven.scm.plugin.CheckoutMojoTest.testExcludeInclude(CheckoutMojoTest.java:153)


FAILED:  org.apache.maven.scm.plugin.CheckoutMojoTest.testUseExport

Error Message:
Command failed.The svn command failed.

Stack Trace:
org.apache.maven.plugin.MojoExecutionException: Command failed.The svn command failed.
	at org.apache.maven.scm.plugin.CheckoutMojoTest.testUseExport(CheckoutMojoTest.java:132)


FAILED:  org.apache.maven.scm.plugin.CheckoutMojoTest.testSkipCheckoutWithConnectionUrl

Error Message:
Command failed.The svn command failed.

Stack Trace:
org.apache.maven.plugin.MojoExecutionException: Command failed.The svn command failed.
	at org.apache.maven.scm.plugin.CheckoutMojoTest.testSkipCheckoutWithConnectionUrl(CheckoutMojoTest.java:96)


FAILED:  org.apache.maven.scm.plugin.ExportMojoTest.testExcludeInclude

Error Message:
Command failed.The svn command failed.

Stack Trace:
org.apache.maven.plugin.MojoExecutionException: Command failed.The svn command failed.
	at org.apache.maven.scm.plugin.ExportMojoTest.testExcludeInclude(ExportMojoTest.java:90)


FAILED:  org.apache.maven.scm.plugin.ExportMojoTest.testExport

Error Message:
Command failed.The svn command failed.

Stack Trace:
org.apache.maven.plugin.MojoExecutionException: Command failed.The svn command failed.
	at org.apache.maven.scm.plugin.ExportMojoTest.testExport(ExportMojoTest.java:55)


FAILED:  org.apache.maven.scm.plugin.TagMojoTest.testTag

Error Message:
Command failed.The svn command failed.

Stack Trace:
org.apache.maven.plugin.MojoExecutionException: Command failed.The svn command failed.
	at org.apache.maven.scm.plugin.TagMojoTest.setUp(TagMojoTest.java:74)


FAILED:  org.apache.maven.scm.plugin.TagMojoTest.testTagWithTimestamp

Error Message:
Command failed.The svn command failed.

Stack Trace:
org.apache.maven.plugin.MojoExecutionException: Command failed.The svn command failed.
	at org.apache.maven.scm.plugin.TagMojoTest.setUp(TagMojoTest.java:74)


FAILED:  org.apache.maven.scm.plugin.UpdateMojoTest.testSkipCheckoutWithConnectionUrl

Error Message:
Command failed.The svn command failed.

Stack Trace:
org.apache.maven.plugin.MojoExecutionException: Command failed.The svn command failed.
	at org.apache.maven.scm.plugin.UpdateMojoTest.testSkipCheckoutWithConnectionUrl(UpdateMojoTest.java:73)


FAILED:  org.apache.maven.scm.provider.git.gitexe.command.checkin.GitCheckInCommandNoBranchTest.testCheckinNoBranch

Error Message:
The command result success flag was false.

Stack Trace:
junit.framework.AssertionFailedError: The command result success flag was false.
	at org.apache.maven.scm.provider.git.gitexe.command.checkin.GitCheckInCommandNoBranchTest.checkoutRepo(GitCheckInCommandNoBranchTest.java:99)
	at org.apache.maven.scm.provider.git.gitexe.command.checkin.GitCheckInCommandNoBranchTest.testCheckinNoBranch(GitCheckInCommandNoBranchTest.java:85)


FAILED:  org.apache.maven.scm.provider.git.gitexe.command.checkin.GitCheckInCommandNoBranchTest.testCheckinNoBranch

Error Message:
The command result success flag was false.

Stack Trace:
junit.framework.AssertionFailedError: The command result success flag was false.
	at org.apache.maven.scm.provider.git.gitexe.command.checkin.GitCheckInCommandNoBranchTest.checkoutRepo(GitCheckInCommandNoBranchTest.java:99)
	at org.apache.maven.scm.provider.git.gitexe.command.checkin.GitCheckInCommandNoBranchTest.testCheckinNoBranch(GitCheckInCommandNoBranchTest.java:66)


FAILED:  org.apache.maven.scm.provider.git.gitexe.command.checkin.GitCheckInCommandNoBranchTest.testCheckinNoBranch

Error Message:
The command result success flag was false.

Stack Trace:
junit.framework.AssertionFailedError: The command result success flag was false.
	at org.apache.maven.scm.provider.git.gitexe.command.checkin.GitCheckInCommandNoBranchTest.checkoutRepo(GitCheckInCommandNoBranchTest.java:99)
	at org.apache.maven.scm.provider.git.gitexe.command.checkin.GitCheckInCommandNoBranchTest.testCheckinNoBranch(GitCheckInCommandNoBranchTest.java:85)


FAILED:  org.apache.maven.scm.provider.git.gitexe.command.checkin.GitCheckInCommandNoBranchTest.testCheckinNoBranch

Error Message:
The command result success flag was false.

Stack Trace:
junit.framework.AssertionFailedError: The command result success flag was false.
	at org.apache.maven.scm.provider.git.gitexe.command.checkin.GitCheckInCommandNoBranchTest.checkoutRepo(GitCheckInCommandNoBranchTest.java:99)
	at org.apache.maven.scm.provider.git.gitexe.command.checkin.GitCheckInCommandNoBranchTest.testCheckinNoBranch(GitCheckInCommandNoBranchTest.java:85)


FAILED:  org.apache.maven.scm.provider.git.gitexe.command.checkin.GitCheckInCommandTest.testCheckinAfterRename

Error Message:
The command result success flag was false.

Stack Trace:
junit.framework.AssertionFailedError: The command result success flag was false.
	at org.apache.maven.scm.provider.git.gitexe.command.checkin.GitCheckInCommandTest.checkoutRepoInto(GitCheckInCommandTest.java:146)
	at org.apache.maven.scm.provider.git.gitexe.command.checkin.GitCheckInCommandTest.testCheckinAfterRename(GitCheckInCommandTest.java:99)


FAILED:  org.apache.maven.scm.provider.git.gitexe.command.checkin.GitCheckInCommandTest.testCheckinAfterRename

Error Message:
The command result success flag was false.

Stack Trace:
junit.framework.AssertionFailedError: The command result success flag was false.
	at org.apache.maven.scm.provider.git.gitexe.command.checkin.GitCheckInCommandTest.checkoutRepoInto(GitCheckInCommandTest.java:146)
	at org.apache.maven.scm.provider.git.gitexe.command.checkin.GitCheckInCommandTest.testCheckinAfterRename(GitCheckInCommandTest.java:99)


FAILED:  org.apache.maven.scm.provider.git.gitexe.command.checkin.GitCheckInCommandTest.testCheckinAfterRename

Error Message:
The command result success flag was false.

Stack Trace:
junit.framework.AssertionFailedError: The command result success flag was false.
	at org.apache.maven.scm.provider.git.gitexe.command.checkin.GitCheckInCommandTest.checkoutRepoInto(GitCheckInCommandTest.java:146)
	at org.apache.maven.scm.provider.git.gitexe.command.checkin.GitCheckInCommandTest.testCheckinAfterRename(GitCheckInCommandTest.java:99)


FAILED:  org.apache.maven.scm.provider.git.gitexe.command.checkin.GitCheckInCommandTest.testCheckinAfterRename

Error Message:
The command result success flag was false.

Stack Trace:
junit.framework.AssertionFailedError: The command result success flag was false.
	at org.apache.maven.scm.provider.git.gitexe.command.checkin.GitCheckInCommandTest.checkoutRepoInto(GitCheckInCommandTest.java:146)
	at org.apache.maven.scm.provider.git.gitexe.command.checkin.GitCheckInCommandTest.testCheckinAfterRename(GitCheckInCommandTest.java:99)


FAILED:  org.apache.maven.scm.provider.git.gitexe.command.checkout.GitExeCheckOutCommandNoBranchTest.testCheckoutNoBranch

Error Message:
The command result success flag was false.

Stack Trace:
junit.framework.AssertionFailedError: The command result success flag was false.
	at org.apache.maven.scm.provider.git.gitexe.command.checkout.GitExeCheckOutCommandNoBranchTest.checkoutRepo(GitExeCheckOutCommandNoBranchTest.java:89)
	at org.apache.maven.scm.provider.git.gitexe.command.checkout.GitExeCheckOutCommandNoBranchTest.testCheckoutNoBranch(GitExeCheckOutCommandNoBranchTest.java:65)


FAILED:  org.apache.maven.scm.provider.git.gitexe.command.checkout.GitExeCheckOutCommandNoBranchTest.testDoubleCheckoutNoBranch

Error Message:
The command result success flag was false.

Stack Trace:
junit.framework.AssertionFailedError: The command result success flag was false.
	at org.apache.maven.scm.provider.git.gitexe.command.checkout.GitExeCheckOutCommandNoBranchTest.checkoutRepo(GitExeCheckOutCommandNoBranchTest.java:89)
	at org.apache.maven.scm.provider.git.gitexe.command.checkout.GitExeCheckOutCommandNoBranchTest.testDoubleCheckoutNoBranch(GitExeCheckOutCommandNoBranchTest.java:77)


FAILED:  org.apache.maven.scm.provider.git.jgit.command.branch.JGitBranchCommandTckTest.testBranchCommandTest

Error Message:
Exception while executing SCM command.

Stack Trace:
org.apache.maven.scm.ScmException: Exception while executing SCM command.
Caused by: org.apache.maven.scm.ScmException: JGit checkout failure!
Caused by: org.eclipse.jgit.api.errors.JGitInternalException: Exception caught during execution
of fetch command
Caused by: org.eclipse.jgit.errors.NotSupportedException: URI not supported: file://2/m/maven-scm-providers/maven-scm-providers-git/maven-scm-provider-jgit/target/scm-test/repository


FAILED:  org.apache.maven.scm.provider.git.jgit.command.changelog.JGitChangeLogCommandTckTest.testChangeLogCommand

Error Message:
Exception while executing SCM command.

Stack Trace:
org.apache.maven.scm.ScmException: Exception while executing SCM command.
Caused by: org.apache.maven.scm.ScmException: JGit checkout failure!
Caused by: org.eclipse.jgit.api.errors.JGitInternalException: Exception caught during execution
of fetch command
Caused by: org.eclipse.jgit.errors.NotSupportedException: URI not supported: file://2/m/maven-scm-providers/maven-scm-providers-git/maven-scm-provider-jgit/target/scm-test/repository


FAILED:  org.apache.maven.scm.provider.git.jgit.command.checkin.JGitCheckInCommandCommitterAuthorTckTest.testCheckInCommandTest

Error Message:
Exception while executing SCM command.

Stack Trace:
org.apache.maven.scm.ScmException: Exception while executing SCM command.
	at org.apache.maven.scm.provider.git.jgit.command.checkin.JGitCheckInCommandCommitterAuthorTckTest.setUp(JGitCheckInCommandCommitterAuthorTckTest.java:60)
Caused by: org.apache.maven.scm.ScmException: JGit checkout failure!
	at org.apache.maven.scm.provider.git.jgit.command.checkin.JGitCheckInCommandCommitterAuthorTckTest.setUp(JGitCheckInCommandCommitterAuthorTckTest.java:60)
Caused by: org.eclipse.jgit.api.errors.JGitInternalException: Exception caught during execution
of fetch command
	at org.apache.maven.scm.provider.git.jgit.command.checkin.JGitCheckInCommandCommitterAuthorTckTest.setUp(JGitCheckInCommandCommitterAuthorTckTest.java:60)
Caused by: org.eclipse.jgit.errors.NotSupportedException: URI not supported: file://2/m/maven-scm-providers/maven-scm-providers-git/maven-scm-provider-jgit/target/scm-test/repository
	at org.apache.maven.scm.provider.git.jgit.command.checkin.JGitCheckInCommandCommitterAuthorTckTest.setUp(JGitCheckInCommandCommitterAuthorTckTest.java:60)


FAILED:  org.apache.maven.scm.provider.git.jgit.command.checkin.JGitCheckInCommandCommitterAuthorTckTest.testCheckInCommandPartialFileset

Error Message:
Exception while executing SCM command.

Stack Trace:
org.apache.maven.scm.ScmException: Exception while executing SCM command.
	at org.apache.maven.scm.provider.git.jgit.command.checkin.JGitCheckInCommandCommitterAuthorTckTest.setUp(JGitCheckInCommandCommitterAuthorTckTest.java:60)
Caused by: org.apache.maven.scm.ScmException: JGit checkout failure!
	at org.apache.maven.scm.provider.git.jgit.command.checkin.JGitCheckInCommandCommitterAuthorTckTest.setUp(JGitCheckInCommandCommitterAuthorTckTest.java:60)
Caused by: org.eclipse.jgit.api.errors.JGitInternalException: Exception caught during execution
of fetch command
	at org.apache.maven.scm.provider.git.jgit.command.checkin.JGitCheckInCommandCommitterAuthorTckTest.setUp(JGitCheckInCommandCommitterAuthorTckTest.java:60)
Caused by: org.eclipse.jgit.errors.NotSupportedException: URI not supported: file://2/m/maven-scm-providers/maven-scm-providers-git/maven-scm-provider-jgit/target/scm-test/repository
	at org.apache.maven.scm.provider.git.jgit.command.checkin.JGitCheckInCommandCommitterAuthorTckTest.setUp(JGitCheckInCommandCommitterAuthorTckTest.java:60)


FAILED:  org.apache.maven.scm.provider.git.jgit.command.checkin.JGitCheckInCommandTckTest.testCheckInCommandTest

Error Message:
Exception while executing SCM command.

Stack Trace:
org.apache.maven.scm.ScmException: Exception while executing SCM command.
Caused by: org.apache.maven.scm.ScmException: JGit checkout failure!
Caused by: org.eclipse.jgit.api.errors.JGitInternalException: Exception caught during execution
of fetch command
Caused by: org.eclipse.jgit.errors.NotSupportedException: URI not supported: file://2/m/maven-scm-providers/maven-scm-providers-git/maven-scm-provider-jgit/target/scm-test/repository


FAILED:  org.apache.maven.scm.provider.git.jgit.command.checkin.JGitCheckInCommandTckTest.testCheckInCommandPartialFileset

Error Message:
Exception while executing SCM command.

Stack Trace:
org.apache.maven.scm.ScmException: Exception while executing SCM command.
Caused by: org.apache.maven.scm.ScmException: JGit checkout failure!
Caused by: org.eclipse.jgit.api.errors.JGitInternalException: Exception caught during execution
of fetch command
Caused by: org.eclipse.jgit.errors.NotSupportedException: URI not supported: file://2/m/maven-scm-providers/maven-scm-providers-git/maven-scm-provider-jgit/target/scm-test/repository


FAILED:  org.apache.maven.scm.provider.git.jgit.command.checkout.JGitCheckOutCommandTckTest.testCheckOutCommandTest

Error Message:
Exception while executing SCM command.

Stack Trace:
org.apache.maven.scm.ScmException: Exception while executing SCM command.
Caused by: org.apache.maven.scm.ScmException: JGit checkout failure!
Caused by: org.eclipse.jgit.api.errors.JGitInternalException: Exception caught during execution
of fetch command
Caused by: org.eclipse.jgit.errors.NotSupportedException: URI not supported: file://2/m/maven-scm-providers/maven-scm-providers-git/maven-scm-provider-jgit/target/scm-test/repository


FAILED:  org.apache.maven.scm.provider.git.jgit.command.diff.JGitDiffCommandTckTest.testDiffCommand

Error Message:
Exception while executing SCM command.

Stack Trace:
org.apache.maven.scm.ScmException: Exception while executing SCM command.
Caused by: org.apache.maven.scm.ScmException: JGit checkout failure!
Caused by: org.eclipse.jgit.api.errors.JGitInternalException: Exception caught during execution
of fetch command
Caused by: org.eclipse.jgit.errors.NotSupportedException: URI not supported: file://2/m/maven-scm-providers/maven-scm-providers-git/maven-scm-provider-jgit/target/scm-test/repository


FAILED:  org.apache.maven.scm.provider.git.jgit.command.remoteinfo.JGitRemoteInfoCommandTckTest.testRemoteInfoCommand

Error Message:
Exception while executing SCM command.

Stack Trace:
org.apache.maven.scm.ScmException: Exception while executing SCM command.
Caused by: org.apache.maven.scm.ScmException: JGit checkout failure!
Caused by: org.eclipse.jgit.api.errors.JGitInternalException: Exception caught during execution
of fetch command
Caused by: org.eclipse.jgit.errors.NotSupportedException: URI not supported: file://2/m/maven-scm-providers/maven-scm-providers-git/maven-scm-provider-jgit/target/scm-test/repository


FAILED:  org.apache.maven.scm.provider.git.jgit.command.status.JGitStatusCommandTckTest.testStatusCommand

Error Message:
Exception while executing SCM command.

Stack Trace:
org.apache.maven.scm.ScmException: Exception while executing SCM command.
Caused by: org.apache.maven.scm.ScmException: JGit checkout failure!
Caused by: org.eclipse.jgit.api.errors.JGitInternalException: Exception caught during execution
of fetch command
Caused by: org.eclipse.jgit.errors.NotSupportedException: URI not supported: file://2/m/maven-scm-providers/maven-scm-providers-git/maven-scm-provider-jgit/target/scm-test/repository


FAILED:  org.apache.maven.scm.provider.git.jgit.command.tag.JGitTagCommandTckTest.testTagCommandTest

Error Message:
Exception while executing SCM command.

Stack Trace:
org.apache.maven.scm.ScmException: Exception while executing SCM command.
Caused by: org.apache.maven.scm.ScmException: JGit checkout failure!
Caused by: org.eclipse.jgit.api.errors.JGitInternalException: Exception caught during execution
of fetch command
Caused by: org.eclipse.jgit.errors.NotSupportedException: URI not supported: file://2/m/maven-scm-providers/maven-scm-providers-git/maven-scm-provider-jgit/target/scm-test/repository




Build log:
[...truncated 7.00 MB...]
[windows-jdk10] [INFO] Downloaded: https://repo.maven.apache.org/maven2/org/apache/maven/wagon/wagon-provider-api/1.0-alpha-6/wagon-provider-api-1.0-alpha-6.jar
(43 kB at 2.1 MB/s)
[windows-jdk10] [INFO] Downloading: https://repo.maven.apache.org/maven2/org/apache/maven/shared/maven-repository-builder/1.0/maven-repository-builder-1.0.jar
[windows-jdk10] [INFO] Downloaded: https://repo.maven.apache.org/maven2/org/apache/maven/shared/maven-filtering/1.3/maven-filtering-1.3.jar
(51 kB at 2.3 MB/s)
[windows-jdk10] [INFO] Downloaded: https://repo.maven.apache.org/maven2/org/codehaus/plexus/plexus-io/2.6/plexus-io-2.6.jar
(84 kB at 3.5 MB/s)
[windows-jdk10] [INFO] Downloaded: https://repo.maven.apache.org/maven2/org/apache/maven/shared/maven-repository-builder/1.0/maven-repository-builder-1.0.jar
(22 kB at 819 kB/s)
[windows-jdk10] [INFO] Downloaded: https://repo.maven.apache.org/maven2/org/iq80/snappy/snappy/0.3/snappy-0.3.jar
(49 kB at 1.7 MB/s)
[windows-jdk10] [INFO] Downloaded: https://repo.maven.apache.org/maven2/org/codehaus/plexus/plexus-utils/3.0.21/plexus-utils-3.0.21.jar
(245 kB at 7.6 MB/s)
[windows-jdk10] [WARNING] Error injecting: org.codehaus.plexus.archiver.jar.JarArchiver
[windows-jdk10] java.lang.ExceptionInInitializerError
[windows-jdk10] 	at java.base/jdk.internal.reflect.NativeConstructorAccessorImpl.newInstance0(Native
Method)
[windows-jdk10] 	at java.base/jdk.internal.reflect.NativeConstructorAccessorImpl.newInstance(NativeConstructorAccessorImpl.java:62)
[windows-jdk10] 	at java.base/jdk.internal.reflect.DelegatingConstructorAccessorImpl.newInstance(DelegatingConstructorAccessorImpl.java:45)
[windows-jdk10] 	at java.base/java.lang.reflect.Constructor.newInstance(Constructor.java:488)
[windows-jdk10] 	at com.google.inject.internal.DefaultConstructionProxyFactory$1.newInstance(DefaultConstructionProxyFactory.java:86)
[windows-jdk10] 	at com.google.inject.internal.ConstructorInjector.provision(ConstructorInjector.java:105)
[windows-jdk10] 	at com.google.inject.internal.ConstructorInjector.access$000(ConstructorInjector.java:32)
[windows-jdk10] 	at com.google.inject.internal.ConstructorInjector$1.call(ConstructorInjector.java:89)
[windows-jdk10] 	at com.google.inject.internal.ProvisionListenerStackCallback$Provision.provision(ProvisionListenerStackCallback.java:115)
[windows-jdk10] 	at com.google.inject.internal.ProvisionListenerStackCallback$Provision.provision(ProvisionListenerStackCallback.java:133)
[windows-jdk10] 	at com.google.inject.internal.ProvisionListenerStackCallback.provision(ProvisionListenerStackCallback.java:68)
[windows-jdk10] 	at com.google.inject.internal.ConstructorInjector.construct(ConstructorInjector.java:87)
[windows-jdk10] 	at com.google.inject.internal.ConstructorBindingImpl$Factory.get(ConstructorBindingImpl.java:267)
[windows-jdk10] 	at com.google.inject.internal.InjectorImpl$2$1.call(InjectorImpl.java:1016)
[windows-jdk10] 	at com.google.inject.internal.InjectorImpl.callInContext(InjectorImpl.java:1103)
[windows-jdk10] 	at com.google.inject.internal.InjectorImpl$2.get(InjectorImpl.java:1012)
[windows-jdk10] 	at com.google.inject.internal.InjectorImpl.getInstance(InjectorImpl.java:1051)
[windows-jdk10] 	at org.eclipse.sisu.space.AbstractDeferredClass.get(AbstractDeferredClass.java:48)
[windows-jdk10] 	at com.google.inject.internal.ProviderInternalFactory.provision(ProviderInternalFactory.java:81)
[windows-jdk10] 	at com.google.inject.internal.InternalFactoryToInitializableAdapter.provision(InternalFactoryToInitializableAdapter.java:53)
[windows-jdk10] 	at com.google.inject.internal.ProviderInternalFactory$1.call(ProviderInternalFactory.java:65)
[windows-jdk10] 	at com.google.inject.internal.ProvisionListenerStackCallback$Provision.provision(ProvisionListenerStackCallback.java:115)
[windows-jdk10] 	at com.google.inject.internal.ProvisionListenerStackCallback$Provision.provision(ProvisionListenerStackCallback.java:133)
[windows-jdk10] 	at com.google.inject.internal.ProvisionListenerStackCallback.provision(ProvisionListenerStackCallback.java:68)
[windows-jdk10] 	at com.google.inject.internal.ProviderInternalFactory.circularGet(ProviderInternalFactory.java:63)
[windows-jdk10] 	at com.google.inject.internal.InternalFactoryToInitializableAdapter.get(InternalFactoryToInitializableAdapter.java:45)
[windows-jdk10] 	at com.google.inject.internal.InjectorImpl$2$1.call(InjectorImpl.java:1016)
[windows-jdk10] 	at com.google.inject.internal.InjectorImpl.callInContext(InjectorImpl.java:1092)
[windows-jdk10] 	at com.google.inject.internal.InjectorImpl$2.get(InjectorImpl.java:1012)
[windows-jdk10] 	at org.eclipse.sisu.inject.Guice4$1.get(Guice4.java:162)
[windows-jdk10] 	at org.eclipse.sisu.inject.LazyBeanEntry.getValue(LazyBeanEntry.java:81)
[windows-jdk10] 	at org.eclipse.sisu.plexus.LazyPlexusBean.getValue(LazyPlexusBean.java:51)
[windows-jdk10] 	at org.codehaus.plexus.DefaultPlexusContainer.lookup(DefaultPlexusContainer.java:263)
[windows-jdk10] 	at org.codehaus.plexus.DefaultPlexusContainer.lookup(DefaultPlexusContainer.java:243)
[windows-jdk10] 	at org.codehaus.plexus.archiver.manager.DefaultArchiverManager.getArchiver(DefaultArchiverManager.java:63)
[windows-jdk10] 	at org.apache.maven.plugin.assembly.archive.DefaultAssemblyArchiver.createArchiver(DefaultAssemblyArchiver.java:302)
[windows-jdk10] 	at org.apache.maven.plugin.assembly.archive.DefaultAssemblyArchiver.createArchive(DefaultAssemblyArchiver.java:170)
[windows-jdk10] 	at org.apache.maven.plugin.assembly.mojos.AbstractAssemblyMojo.execute(AbstractAssemblyMojo.java:484)
[windows-jdk10] 	at org.apache.maven.plugin.DefaultBuildPluginManager.executeMojo(DefaultBuildPluginManager.java:134)
[windows-jdk10] 	at org.apache.maven.lifecycle.internal.MojoExecutor.execute(MojoExecutor.java:208)
[windows-jdk10] 	at org.apache.maven.lifecycle.internal.MojoExecutor.execute(MojoExecutor.java:154)
[windows-jdk10] 	at org.apache.maven.lifecycle.internal.MojoExecutor.execute(MojoExecutor.java:146)
[windows-jdk10] 	at org.apache.maven.lifecycle.internal.LifecycleModuleBuilder.buildProject(LifecycleModuleBuilder.java:117)
[windows-jdk10] 	at org.apache.maven.lifecycle.internal.LifecycleModuleBuilder.buildProject(LifecycleModuleBuilder.java:81)
[windows-jdk10] 	at org.apache.maven.lifecycle.internal.builder.singlethreaded.SingleThreadedBuilder.build(SingleThreadedBuilder.java:51)
[windows-jdk10] 	at org.apache.maven.lifecycle.internal.LifecycleStarter.execute(LifecycleStarter.java:128)
[windows-jdk10] 	at org.apache.maven.DefaultMaven.doExecute(DefaultMaven.java:309)
[windows-jdk10] 	at org.apache.maven.DefaultMaven.doExecute(DefaultMaven.java:194)
[windows-jdk10] 	at org.apache.maven.DefaultMaven.execute(DefaultMaven.java:107)
[windows-jdk10] 	at org.apache.maven.cli.MavenCli.execute(MavenCli.java:993)
[windows-jdk10] 	at org.apache.maven.cli.MavenCli.doMain(MavenCli.java:345)
[windows-jdk10] 	at org.apache.maven.cli.MavenCli.main(MavenCli.java:191)
[windows-jdk10] 	at java.base/jdk.internal.reflect.NativeMethodAccessorImpl.invoke0(Native
Method)
[windows-jdk10] 	at java.base/jdk.internal.reflect.NativeMethodAccessorImpl.invoke(NativeMethodAccessorImpl.java:62)
[windows-jdk10] 	at java.base/jdk.internal.reflect.DelegatingMethodAccessorImpl.invoke(DelegatingMethodAccessorImpl.java:43)
[windows-jdk10] 	at java.base/java.lang.reflect.Method.invoke(Method.java:564)
[windows-jdk10] 	at org.codehaus.plexus.classworlds.launcher.Launcher.launchEnhanced(Launcher.java:289)
[windows-jdk10] 	at org.codehaus.plexus.classworlds.launcher.Launcher.launch(Launcher.java:229)
[windows-jdk10] 	at org.codehaus.plexus.classworlds.launcher.Launcher.mainWithExitCode(Launcher.java:415)
[windows-jdk10] 	at org.codehaus.plexus.classworlds.launcher.Launcher.main(Launcher.java:356)
[windows-jdk10] Caused by: java.lang.ArrayIndexOutOfBoundsException: 1
[windows-jdk10] 	at org.codehaus.plexus.archiver.zip.AbstractZipArchiver.<clinit>(AbstractZipArchiver.java:123)
[windows-jdk10] 	... 60 more
[windows-jdk10] [INFO] ------------------------------------------------------------------------
[windows-jdk10] [INFO] Reactor Summary:
[windows-jdk10] [INFO] 
[windows-jdk10] [INFO] Maven SCM .......................................... SUCCESS [ 11.532
s]
[windows-jdk10] [INFO] Maven SCM API ...................................... SUCCESS [  6.244
s]
[windows-jdk10] [INFO] Maven SCM Managers ................................. SUCCESS [  0.637
s]
[windows-jdk10] [INFO] Maven SCM Manager for Plexus ....................... SUCCESS [  1.671
s]
[windows-jdk10] [INFO] Maven SCM Test ..................................... SUCCESS [  2.242
s]
[windows-jdk10] [INFO] Maven SCM Providers ................................ SUCCESS [  0.953
s]
[windows-jdk10] [INFO] Maven SCM AccuRev Provider ......................... SUCCESS [  5.145
s]
[windows-jdk10] [INFO] Maven SCM Bazaar Provider .......................... SUCCESS [  2.440
s]
[windows-jdk10] [INFO] Maven SCM Clearcase Provider ....................... SUCCESS [  3.923
s]
[windows-jdk10] [INFO] Maven SCM CVS Provider - Parent .................... SUCCESS [  0.708
s]
[windows-jdk10] [INFO] Maven SCM CVS Provider TCK tests ................... SUCCESS [  1.946
s]
[windows-jdk10] [INFO] Maven SCM CVS Provider - Common library ............ SUCCESS [  2.862
s]
[windows-jdk10] [INFO] Maven SCM CVS Provider - CVS Executable Impl. ...... SUCCESS [  2.407
s]
[windows-jdk10] [INFO] Maven SCM CVS Provider - CVS Java Impl. ............ SUCCESS [  2.491
s]
[windows-jdk10] [INFO] Maven SCM Mercurial (Hg) Provider .................. SUCCESS [  2.314
s]
[windows-jdk10] [INFO] Maven SCM Git Provider - Parent .................... SUCCESS [  0.731
s]
[windows-jdk10] [INFO] Maven SCM Git Provider - Common library ............ SUCCESS [  2.537
s]
[windows-jdk10] [INFO] Maven SCM Git Provider TCK Tests ................... SUCCESS [  1.007
s]
[windows-jdk10] [INFO] Maven SCM Git Provider - Git Executable Impl. ...... SUCCESS [  5.491
s]
[windows-jdk10] [INFO] Maven SCM Git Provider - JGit Impl. ................ SUCCESS [ 29.487
s]
[windows-jdk10] [INFO] Maven SCM Local Provider ........................... SUCCESS [  2.382
s]
[windows-jdk10] [INFO] Maven SCM Perforce Provider ........................ SUCCESS [  3.143
s]
[windows-jdk10] [INFO] Maven SCM Starteam Provider ........................ SUCCESS [  4.313
s]
[windows-jdk10] [INFO] Maven SCM Subversion Provider - Parent ............. SUCCESS [  0.768
s]
[windows-jdk10] [INFO] Maven SCM Subversion Provider - Common library ..... SUCCESS [  2.634
s]
[windows-jdk10] [INFO] Maven SCM Subversion Provider TCK Tests ............ SUCCESS [  1.047
s]
[windows-jdk10] [INFO] Maven SCM Subversion Provider - SVN Executable Impl. SUCCESS [  5.523
s]
[windows-jdk10] [INFO] Maven SCM Synergy Provider ......................... SUCCESS [  2.849
s]
[windows-jdk10] [INFO] Maven SCM Visual Source Safe Provider .............. SUCCESS [  3.353
s]
[windows-jdk10] [INFO] Maven SCM TFS Provider ............................. SUCCESS [  2.573
s]
[windows-jdk10] [INFO] Maven SCM MKS Integrity Provider ................... SUCCESS [  3.214
s]
[windows-jdk10] [INFO] Maven SCM Jazz/Rational Team Concert Provider ...... SUCCESS [  3.296
s]
[windows-jdk10] [INFO] Maven SCM Standard Providers ....................... SUCCESS [  1.778
s]
[windows-jdk10] [INFO] Maven SCM Client ................................... FAILURE [  2.138
s]
[windows-jdk10] [INFO] Maven SCM Plugin ................................... SKIPPED
[windows-jdk10] [INFO] ------------------------------------------------------------------------
[windows-jdk10] [INFO] BUILD FAILURE
[windows-jdk10] [INFO] ------------------------------------------------------------------------
[windows-jdk10] [INFO] Total time: 02:07 min
[windows-jdk10] [INFO] Finished at: 2018-07-03T10:25:55Z
[windows-jdk10] [INFO] Final Memory: 50M/174M
[windows-jdk10] [INFO] ------------------------------------------------------------------------
[windows-jdk10] [WARNING] The requested profile "run-its" could not be activated because it
does not exist.
[windows-jdk10] [INFO] [jenkins-event-spy] Generated F:\jenkins\jenkins-slave\workspace\maven-box_maven-scm_SCM-886-UL5BAIGWJZZKSQFUBFU56CFQQJ22UA2WNNGACEEH7BETJV75H2BQ@tmp\withMaven321d04db\maven-spy-20180703-102348-3418222777613372659586.log
[windows-jdk10] [ERROR] Failed to execute goal org.apache.maven.plugins:maven-assembly-plugin:2.6:single
(default) on project maven-scm-client: Execution default of goal org.apache.maven.plugins:maven-assembly-plugin:2.6:single
failed: An API incompatibility was encountered while executing org.apache.maven.plugins:maven-assembly-plugin:2.6:single:
java.lang.ExceptionInInitializerError: null
[windows-jdk10] [ERROR] -----------------------------------------------------
[windows-jdk10] [ERROR] realm =    plugin>org.apache.maven.plugins:maven-assembly-plugin:2.6
[windows-jdk10] [ERROR] strategy = org.codehaus.plexus.classworlds.strategy.SelfFirstStrategy
[windows-jdk10] [ERROR] urls[0] = file:/f:/jenkins/jenkins-slave/workspace/maven-box_maven-scm_SCM-886-UL5BAIGWJZZKSQFUBFU56CFQQJ22UA2WNNGACEEH7BETJV75H2BQ/.repository/org/apache/maven/plugins/maven-assembly-plugin/2.6/maven-assembly-plugin-2.6.jar
[windows-jdk10] [ERROR] urls[1] = file:/f:/jenkins/jenkins-slave/workspace/maven-box_maven-scm_SCM-886-UL5BAIGWJZZKSQFUBFU56CFQQJ22UA2WNNGACEEH7BETJV75H2BQ/.repository/org/slf4j/slf4j-jdk14/1.5.6/slf4j-jdk14-1.5.6.jar
[windows-jdk10] [ERROR] urls[2] = file:/f:/jenkins/jenkins-slave/workspace/maven-box_maven-scm_SCM-886-UL5BAIGWJZZKSQFUBFU56CFQQJ22UA2WNNGACEEH7BETJV75H2BQ/.repository/org/slf4j/jcl-over-slf4j/1.5.6/jcl-over-slf4j-1.5.6.jar
[windows-jdk10] [ERROR] urls[3] = file:/f:/jenkins/jenkins-slave/workspace/maven-box_maven-scm_SCM-886-UL5BAIGWJZZKSQFUBFU56CFQQJ22UA2WNNGACEEH7BETJV75H2BQ/.repository/org/apache/maven/reporting/maven-reporting-api/2.2.1/maven-reporting-api-2.2.1.jar
[windows-jdk10] [ERROR] urls[4] = file:/f:/jenkins/jenkins-slave/workspace/maven-box_maven-scm_SCM-886-UL5BAIGWJZZKSQFUBFU56CFQQJ22UA2WNNGACEEH7BETJV75H2BQ/.repository/org/apache/maven/doxia/doxia-sink-api/1.1/doxia-sink-api-1.1.jar
[windows-jdk10] [ERROR] urls[5] = file:/f:/jenkins/jenkins-slave/workspace/maven-box_maven-scm_SCM-886-UL5BAIGWJZZKSQFUBFU56CFQQJ22UA2WNNGACEEH7BETJV75H2BQ/.repository/org/apache/maven/doxia/doxia-logging-api/1.1/doxia-logging-api-1.1.jar
[windows-jdk10] [ERROR] urls[6] = file:/f:/jenkins/jenkins-slave/workspace/maven-box_maven-scm_SCM-886-UL5BAIGWJZZKSQFUBFU56CFQQJ22UA2WNNGACEEH7BETJV75H2BQ/.repository/junit/junit/3.8.1/junit-3.8.1.jar
[windows-jdk10] [ERROR] urls[7] = file:/f:/jenkins/jenkins-slave/workspace/maven-box_maven-scm_SCM-886-UL5BAIGWJZZKSQFUBFU56CFQQJ22UA2WNNGACEEH7BETJV75H2BQ/.repository/commons-cli/commons-cli/1.2/commons-cli-1.2.jar
[windows-jdk10] [ERROR] urls[8] = file:/f:/jenkins/jenkins-slave/workspace/maven-box_maven-scm_SCM-886-UL5BAIGWJZZKSQFUBFU56CFQQJ22UA2WNNGACEEH7BETJV75H2BQ/.repository/org/codehaus/plexus/plexus-interactivity-api/1.0-alpha-4/plexus-interactivity-api-1.0-alpha-4.jar
[windows-jdk10] [ERROR] urls[9] = file:/f:/jenkins/jenkins-slave/workspace/maven-box_maven-scm_SCM-886-UL5BAIGWJZZKSQFUBFU56CFQQJ22UA2WNNGACEEH7BETJV75H2BQ/.repository/backport-util-concurrent/backport-util-concurrent/3.1/backport-util-concurrent-3.1.jar
[windows-jdk10] [ERROR] urls[10] = file:/f:/jenkins/jenkins-slave/workspace/maven-box_maven-scm_SCM-886-UL5BAIGWJZZKSQFUBFU56CFQQJ22UA2WNNGACEEH7BETJV75H2BQ/.repository/org/sonatype/plexus/plexus-sec-dispatcher/1.3/plexus-sec-dispatcher-1.3.jar
[windows-jdk10] [ERROR] urls[11] = file:/f:/jenkins/jenkins-slave/workspace/maven-box_maven-scm_SCM-886-UL5BAIGWJZZKSQFUBFU56CFQQJ22UA2WNNGACEEH7BETJV75H2BQ/.repository/org/sonatype/plexus/plexus-cipher/1.4/plexus-cipher-1.4.jar
[windows-jdk10] [ERROR] urls[12] = file:/f:/jenkins/jenkins-slave/workspace/maven-box_maven-scm_SCM-886-UL5BAIGWJZZKSQFUBFU56CFQQJ22UA2WNNGACEEH7BETJV75H2BQ/.repository/org/apache/maven/shared/maven-common-artifact-filters/1.4/maven-common-artifact-filters-1.4.jar
[windows-jdk10] [ERROR] urls[13] = file:/f:/jenkins/jenkins-slave/workspace/maven-box_maven-scm_SCM-886-UL5BAIGWJZZKSQFUBFU56CFQQJ22UA2WNNGACEEH7BETJV75H2BQ/.repository/org/codehaus/plexus/plexus-interpolation/1.22/plexus-interpolation-1.22.jar
[windows-jdk10] [ERROR] urls[14] = file:/f:/jenkins/jenkins-slave/workspace/maven-box_maven-scm_SCM-886-UL5BAIGWJZZKSQFUBFU56CFQQJ22UA2WNNGACEEH7BETJV75H2BQ/.repository/org/codehaus/plexus/plexus-archiver/3.0.1/plexus-archiver-3.0.1.jar
[windows-jdk10] [ERROR] urls[15] = file:/f:/jenkins/jenkins-slave/workspace/maven-box_maven-scm_SCM-886-UL5BAIGWJZZKSQFUBFU56CFQQJ22UA2WNNGACEEH7BETJV75H2BQ/.repository/org/iq80/snappy/snappy/0.3/snappy-0.3.jar
[windows-jdk10] [ERROR] urls[16] = file:/f:/jenkins/jenkins-slave/workspace/maven-box_maven-scm_SCM-886-UL5BAIGWJZZKSQFUBFU56CFQQJ22UA2WNNGACEEH7BETJV75H2BQ/.repository/org/apache/maven/shared/file-management/1.1/file-management-1.1.jar
[windows-jdk10] [ERROR] urls[17] = file:/f:/jenkins/jenkins-slave/workspace/maven-box_maven-scm_SCM-886-UL5BAIGWJZZKSQFUBFU56CFQQJ22UA2WNNGACEEH7BETJV75H2BQ/.repository/org/apache/maven/shared/maven-shared-io/1.1/maven-shared-io-1.1.jar
[windows-jdk10] [ERROR] urls[18] = file:/f:/jenkins/jenkins-slave/workspace/maven-box_maven-scm_SCM-886-UL5BAIGWJZZKSQFUBFU56CFQQJ22UA2WNNGACEEH7BETJV75H2BQ/.repository/commons-io/commons-io/2.2/commons-io-2.2.jar
[windows-jdk10] [ERROR] urls[19] = file:/f:/jenkins/jenkins-slave/workspace/maven-box_maven-scm_SCM-886-UL5BAIGWJZZKSQFUBFU56CFQQJ22UA2WNNGACEEH7BETJV75H2BQ/.repository/org/apache/maven/shared/maven-filtering/1.3/maven-filtering-1.3.jar
[windows-jdk10] [ERROR] urls[20] = file:/f:/jenkins/jenkins-slave/workspace/maven-box_maven-scm_SCM-886-UL5BAIGWJZZKSQFUBFU56CFQQJ22UA2WNNGACEEH7BETJV75H2BQ/.repository/org/apache/maven/shared/maven-shared-utils/0.6/maven-shared-utils-0.6.jar
[windows-jdk10] [ERROR] urls[21] = file:/f:/jenkins/jenkins-slave/workspace/maven-box_maven-scm_SCM-886-UL5BAIGWJZZKSQFUBFU56CFQQJ22UA2WNNGACEEH7BETJV75H2BQ/.repository/com/google/code/findbugs/jsr305/2.0.1/jsr305-2.0.1.jar
[windows-jdk10] [ERROR] urls[22] = file:/f:/jenkins/jenkins-slave/workspace/maven-box_maven-scm_SCM-886-UL5BAIGWJZZKSQFUBFU56CFQQJ22UA2WNNGACEEH7BETJV75H2BQ/.repository/org/sonatype/plexus/plexus-build-api/0.0.4/plexus-build-api-0.0.4.jar
[windows-jdk10] [ERROR] urls[23] = file:/f:/jenkins/jenkins-slave/workspace/maven-box_maven-scm_SCM-886-UL5BAIGWJZZKSQFUBFU56CFQQJ22UA2WNNGACEEH7BETJV75H2BQ/.repository/org/codehaus/plexus/plexus-io/2.6/plexus-io-2.6.jar
[windows-jdk10] [ERROR] urls[24] = file:/f:/jenkins/jenkins-slave/workspace/maven-box_maven-scm_SCM-886-UL5BAIGWJZZKSQFUBFU56CFQQJ22UA2WNNGACEEH7BETJV75H2BQ/.repository/org/apache/maven/maven-archiver/2.5/maven-archiver-2.5.jar
[windows-jdk10] [ERROR] urls[25] = file:/f:/jenkins/jenkins-slave/workspace/maven-box_maven-scm_SCM-886-UL5BAIGWJZZKSQFUBFU56CFQQJ22UA2WNNGACEEH7BETJV75H2BQ/.repository/org/codehaus/plexus/plexus-utils/3.0.21/plexus-utils-3.0.21.jar
[windows-jdk10] [ERROR] urls[26] = file:/f:/jenkins/jenkins-slave/workspace/maven-box_maven-scm_SCM-886-UL5BAIGWJZZKSQFUBFU56CFQQJ22UA2WNNGACEEH7BETJV75H2BQ/.repository/org/apache/maven/shared/maven-repository-builder/1.0/maven-repository-builder-1.0.jar
[windows-jdk10] [ERROR] urls[27] = file:/f:/jenkins/jenkins-slave/workspace/maven-box_maven-scm_SCM-886-UL5BAIGWJZZKSQFUBFU56CFQQJ22UA2WNNGACEEH7BETJV75H2BQ/.repository/commons-codec/commons-codec/1.6/commons-codec-1.6.jar
[windows-jdk10] [ERROR] Number of foreign imports: 1
[windows-jdk10] [ERROR] import: Entry[import  from realm ClassRealm[maven.api, parent: null]]
[windows-jdk10] [ERROR] 
[windows-jdk10] [ERROR] -----------------------------------------------------
[windows-jdk10] [ERROR] -> [Help 1]
[windows-jdk10] [ERROR] 
[windows-jdk10] [ERROR] To see the full stack trace of the errors, re-run Maven with the -e
switch.
[windows-jdk10] [ERROR] Re-run Maven using the -X switch to enable full debug logging.
[windows-jdk10] [ERROR] 
[windows-jdk10] [ERROR] For more information about the errors and possible solutions, please
read the following articles:
[windows-jdk10] [ERROR] [Help 1] http://cwiki.apache.org/confluence/display/MAVEN/PluginContainerException
[windows-jdk10] [ERROR] 
[windows-jdk10] [ERROR] After correcting the problems, you can resume the build with the command
[windows-jdk10] [ERROR]   mvn <goals> -rf :maven-scm-client
[Pipeline] [windows-jdk10] }
[Pipeline] [windows-jdk10] // dir
[Pipeline] [windows-jdk10] }
[windows-jdk10] [withMaven] junitPublisher - Archive test results for Maven artifact org.apache.maven.scm:maven-scm-api:1.9.6-SNAPSHOT
generated by maven-surefire-plugin:test (default-test): m\maven-scm-api\target\surefire-reports\*.xml
[windows-jdk10] Recording test results
[windows-jdk10] [withMaven] junitPublisher - Archive test results for Maven artifact org.apache.maven.scm:maven-scm-manager-plexus:1.9.6-SNAPSHOT
generated by maven-surefire-plugin:test (default-test): m\maven-scm-managers\maven-scm-manager-plexus\target\surefire-reports\*.xml
[windows-jdk10] Recording test results
[windows-jdk10] None of the test reports contained any result
[windows-jdk10] [withMaven] junitPublisher - Archive test results for Maven artifact org.apache.maven.scm:maven-scm-test:1.9.6-SNAPSHOT
generated by maven-surefire-plugin:test (default-test): m\maven-scm-test\target\surefire-reports\*.xml
[windows-jdk10] Recording test results
[windows-jdk10] [withMaven] junitPublisher - Archive test results for Maven artifact org.apache.maven.scm:maven-scm-provider-accurev:1.9.6-SNAPSHOT
generated by maven-surefire-plugin:test (default-test): m\maven-scm-providers\maven-scm-provider-accurev\target\surefire-reports\*.xml
[windows-jdk10] Recording test results
[windows-jdk10] [withMaven] junitPublisher - Archive test results for Maven artifact org.apache.maven.scm:maven-scm-provider-bazaar:1.9.6-SNAPSHOT
generated by maven-surefire-plugin:test (default-test): m\maven-scm-providers\maven-scm-provider-bazaar\target\surefire-reports\*.xml
[windows-jdk10] Recording test results
[windows-jdk10] [withMaven] junitPublisher - Archive test results for Maven artifact org.apache.maven.scm:maven-scm-provider-clearcase:1.9.6-SNAPSHOT
generated by maven-surefire-plugin:test (default-test): m\maven-scm-providers\maven-scm-provider-clearcase\target\surefire-reports\*.xml
[windows-jdk10] Recording test results
[windows-jdk10] [withMaven] junitPublisher - Archive test results for Maven artifact org.apache.maven.scm:maven-scm-provider-cvstest:1.9.6-SNAPSHOT
generated by maven-surefire-plugin:test (default-test): m\maven-scm-providers\maven-scm-providers-cvs\maven-scm-provider-cvstest\target\surefire-reports\*.xml
[windows-jdk10] Recording test results
[windows-jdk10] None of the test reports contained any result
[windows-jdk10] [withMaven] junitPublisher - Archive test results for Maven artifact org.apache.maven.scm:maven-scm-provider-cvs-commons:1.9.6-SNAPSHOT
generated by maven-surefire-plugin:test (default-test): m\maven-scm-providers\maven-scm-providers-cvs\maven-scm-provider-cvs-commons\target\surefire-reports\*.xml
[windows-jdk10] Recording test results
[windows-jdk10] [withMaven] junitPublisher - Archive test results for Maven artifact org.apache.maven.scm:maven-scm-provider-cvsexe:1.9.6-SNAPSHOT
generated by maven-surefire-plugin:test (default-test): m\maven-scm-providers\maven-scm-providers-cvs\maven-scm-provider-cvsexe\target\surefire-reports\*.xml
[windows-jdk10] Recording test results
[windows-jdk10] [withMaven] junitPublisher - Archive test results for Maven artifact org.apache.maven.scm:maven-scm-provider-cvsjava:1.9.6-SNAPSHOT
generated by maven-surefire-plugin:test (default-test): m\maven-scm-providers\maven-scm-providers-cvs\maven-scm-provider-cvsjava\target\surefire-reports\*.xml
[windows-jdk10] Recording test results
[windows-jdk10] [withMaven] junitPublisher - Archive test results for Maven artifact org.apache.maven.scm:maven-scm-provider-hg:1.9.6-SNAPSHOT
generated by maven-surefire-plugin:test (default-test): m\maven-scm-providers\maven-scm-provider-hg\target\surefire-reports\*.xml
[windows-jdk10] Recording test results
[windows-jdk10] [withMaven] junitPublisher - Archive test results for Maven artifact org.apache.maven.scm:maven-scm-provider-git-commons:1.9.6-SNAPSHOT
generated by maven-surefire-plugin:test (default-test): m\maven-scm-providers\maven-scm-providers-git\maven-scm-provider-git-commons\target\surefire-reports\*.xml
[windows-jdk10] Recording test results
[windows-jdk10] [withMaven] junitPublisher - Archive test results for Maven artifact org.apache.maven.scm:maven-scm-provider-gittest:1.9.6-SNAPSHOT
generated by maven-surefire-plugin:test (default-test): m\maven-scm-providers\maven-scm-providers-git\maven-scm-provider-gittest\target\surefire-reports\*.xml
[windows-jdk10] Recording test results
[windows-jdk10] None of the test reports contained any result
[windows-jdk10] [withMaven] junitPublisher - Archive test results for Maven artifact org.apache.maven.scm:maven-scm-provider-gitexe:1.9.6-SNAPSHOT
generated by maven-surefire-plugin:test (default-test): m\maven-scm-providers\maven-scm-providers-git\maven-scm-provider-gitexe\target\surefire-reports\*.xml
[windows-jdk10] Recording test results
[windows-jdk10] [withMaven] junitPublisher - Archive test results for Maven artifact org.apache.maven.scm:maven-scm-provider-jgit:1.9.6-SNAPSHOT
generated by maven-surefire-plugin:test (default-test): m\maven-scm-providers\maven-scm-providers-git\maven-scm-provider-jgit\target\surefire-reports\*.xml
[windows-jdk10] Recording test results
[windows-jdk10] [withMaven] junitPublisher - Archive test results for Maven artifact org.apache.maven.scm:maven-scm-provider-local:1.9.6-SNAPSHOT
generated by maven-surefire-plugin:test (default-test): m\maven-scm-providers\maven-scm-provider-local\target\surefire-reports\*.xml
[windows-jdk10] Recording test results
[windows-jdk10] [withMaven] junitPublisher - Archive test results for Maven artifact org.apache.maven.scm:maven-scm-provider-perforce:1.9.6-SNAPSHOT
generated by maven-surefire-plugin:test (default-test): m\maven-scm-providers\maven-scm-provider-perforce\target\surefire-reports\*.xml
[windows-jdk10] Recording test results
[windows-jdk10] [withMaven] junitPublisher - Archive test results for Maven artifact org.apache.maven.scm:maven-scm-provider-starteam:1.9.6-SNAPSHOT
generated by maven-surefire-plugin:test (default-test): m\maven-scm-providers\maven-scm-provider-starteam\target\surefire-reports\*.xml
[windows-jdk10] Recording test results
[windows-jdk10] [withMaven] junitPublisher - Archive test results for Maven artifact org.apache.maven.scm:maven-scm-provider-svn-commons:1.9.6-SNAPSHOT
generated by maven-surefire-plugin:test (default-test): m\maven-scm-providers\maven-scm-providers-svn\maven-scm-provider-svn-commons\target\surefire-reports\*.xml
[windows-jdk10] Recording test results
[windows-jdk10] [withMaven] junitPublisher - Archive test results for Maven artifact org.apache.maven.scm:maven-scm-provider-svntest:1.9.6-SNAPSHOT
generated by maven-surefire-plugin:test (default-test): m\maven-scm-providers\maven-scm-providers-svn\maven-scm-provider-svntest\target\surefire-reports\*.xml
[windows-jdk10] Recording test results
[windows-jdk10] None of the test reports contained any result
[windows-jdk10] [withMaven] junitPublisher - Archive test results for Maven artifact org.apache.maven.scm:maven-scm-provider-svnexe:1.9.6-SNAPSHOT
generated by maven-surefire-plugin:test (default-test): m\maven-scm-providers\maven-scm-providers-svn\maven-scm-provider-svnexe\target\surefire-reports\*.xml
[windows-jdk10] Recording test results
[windows-jdk10] [withMaven] junitPublisher - Archive test results for Maven artifact org.apache.maven.scm:maven-scm-provider-synergy:1.9.6-SNAPSHOT
generated by maven-surefire-plugin:test (default-test): m\maven-scm-providers\maven-scm-provider-synergy\target\surefire-reports\*.xml
[windows-jdk10] Recording test results
[windows-jdk10] [withMaven] junitPublisher - Archive test results for Maven artifact org.apache.maven.scm:maven-scm-provider-vss:1.9.6-SNAPSHOT
generated by maven-surefire-plugin:test (default-test): m\maven-scm-providers\maven-scm-provider-vss\target\surefire-reports\*.xml
[windows-jdk10] Recording test results
[windows-jdk10] [withMaven] junitPublisher - Archive test results for Maven artifact org.apache.maven.scm:maven-scm-provider-tfs:1.9.6-SNAPSHOT
generated by maven-surefire-plugin:test (default-test): m\maven-scm-providers\maven-scm-provider-tfs\target\surefire-reports\*.xml
[windows-jdk10] Recording test results
[windows-jdk10] [withMaven] junitPublisher - Archive test results for Maven artifact org.apache.maven.scm:maven-scm-provider-integrity:1.9.6-SNAPSHOT
generated by maven-surefire-plugin:test (default-test): m\maven-scm-providers\maven-scm-provider-integrity\target\surefire-reports\*.xml
[windows-jdk10] Recording test results
[windows-jdk10] [withMaven] junitPublisher - Archive test results for Maven artifact org.apache.maven.scm:maven-scm-provider-jazz:1.9.6-SNAPSHOT
generated by maven-surefire-plugin:test (default-test): m\maven-scm-providers\maven-scm-provider-jazz\target\surefire-reports\*.xml
[windows-jdk10] Recording test results
[windows-jdk10] [withMaven] junitPublisher - Archive test results for Maven artifact org.apache.maven.scm:maven-scm-client:1.9.6-SNAPSHOT
generated by maven-surefire-plugin:test (default-test): m\maven-scm-client\target\surefire-reports\*.xml
[windows-jdk10] Recording test results
[windows-jdk10] None of the test reports contained any result
[Pipeline] [windows-jdk10] // withMaven
[Pipeline] [windows-jdk10] echo
[windows-jdk10] [FAIL FAST] This is the first failure and likely root cause
[Pipeline] [windows-jdk10] }
[Pipeline] [windows-jdk10] // stage
[Pipeline] [windows-jdk10] }
[Pipeline] [windows-jdk10] // node
[Pipeline] [windows-jdk10] }
[windows-jdk10] Failed in branch windows-jdk10
[Pipeline] // parallel
[Pipeline] echo
***** FAST FAILURE *****

Fast failure triggered by windows-jdk10

***** FAST FAILURE *****
[Pipeline] stage
[Pipeline] { (Notifications)
[Pipeline] echo
Build result: FAILURE
[Pipeline] jiraIssueSelector
[Pipeline] emailext
Mime
  • Unnamed multipart/mixed (inline, None, 0 bytes)
View raw message