maven-notifications mailing list archives

Site index · List index
Message view « Date » · « Thread »
Top « Date » · « Thread »
From Apache Jenkins Server <jenk...@builds.apache.org>
Subject Build failed in Jenkins: Maven TLP » maven-compiler-plugin » MCOMPILER-320 #6
Date Tue, 03 Jul 2018 13:46:28 GMT
See https://builds.apache.org/job/maven-box/job/maven-compiler-plugin/job/MCOMPILER-320/6/

Changes:

* Add JDK 10 (latest)
* Change JDK10 on Windows to 'JDK 10 b46 (Windows Only)'
* Add Java 11-ea
* Add jdkForMaven and mavenForJdk methods Use reqexp for version matching
* regex in switch/case are full match, not partial match
* Update JDKs
* Looks like the API has changed.
* Try to fix it.
* Add JDK 10 to the jdk default
* auto deploy if we are currently on master branch
* revert as it seems to fail on jenkins asf
* revert this one as well
* enable TLS 1.2 for Java 7
* TLSv1.x being deactivated since June. So only TLSv1.2 is valid for
* Add asfMavenTlpPlgnBuild to run plugins with multiple Maven versions
* Add maven version to stageId
* Add removeFromCollection() due to RejectedAccessException on
* Scripts not permitted to use method java.util.Collection stream
* Pass 'first'
* Ensure at least minimum required Java version is used
* builds.a.o doesn't have a Maven 3.1.x
* Pass 'failfast'
* Pass 'failingFast'
* Set https.protocols for Java7
* Make failingFast global variable
* Introduce a shared taskContext to keep track of failures
* Make taskContext accessible for try-catch
* Ensure tasks on the same Jenkins instance don't block each others
* dir('m') was used twice
* Also run site goal
* Remove unused parameter
* Disable site plan, doesn't work with multimodules

No tests ran.

Build log:
Branch indexing
Obtained Jenkinsfile from e8daa01471eac5eb299a5396be4e3f55588f0746
Running in Durability level: MAX_SURVIVABILITY
Loading library jenkins-env@master
Attempting to resolve master from remote references...
 > git --version # timeout=10
 > git ls-remote -h https://gitbox.apache.org/repos/asf/maven-jenkins-env.git # timeout=10
Found match: refs/heads/master revision c7625b1aa84b6dd6c2d7f9872e19046718b26f6b
 > git rev-parse --is-inside-work-tree # timeout=10
Fetching changes from the remote Git repository
 > git config remote.origin.url https://gitbox.apache.org/repos/asf/maven-jenkins-env.git
# timeout=10
Fetching without tags
Fetching upstream changes from https://gitbox.apache.org/repos/asf/maven-jenkins-env.git
 > git --version # timeout=10
 > git fetch --no-tags --progress https://gitbox.apache.org/repos/asf/maven-jenkins-env.git
+refs/heads/*:refs/remotes/origin/*
Checking out Revision c7625b1aa84b6dd6c2d7f9872e19046718b26f6b (master)
 > git config core.sparsecheckout # timeout=10
 > git checkout -f c7625b1aa84b6dd6c2d7f9872e19046718b26f6b
Commit message: "Try to fix it."
 > git rev-list --no-walk 7e5a8d991ba0cfb20727aa995304672a34b631bb # timeout=10
Loading library jenkins-lib@master
Attempting to resolve master from remote references...
 > git --version # timeout=10
 > git ls-remote -h https://gitbox.apache.org/repos/asf/maven-jenkins-lib.git # timeout=10
Found match: refs/heads/master revision 8c7a5535a63e567b533627e0eb9876799ccd8364
 > git rev-parse --is-inside-work-tree # timeout=10
Fetching changes from the remote Git repository
 > git config remote.origin.url https://gitbox.apache.org/repos/asf/maven-jenkins-lib.git
# timeout=10
Fetching without tags
Fetching upstream changes from https://gitbox.apache.org/repos/asf/maven-jenkins-lib.git
 > git --version # timeout=10
 > git fetch --no-tags --progress https://gitbox.apache.org/repos/asf/maven-jenkins-lib.git
+refs/heads/*:refs/remotes/origin/*
Checking out Revision 8c7a5535a63e567b533627e0eb9876799ccd8364 (master)
 > git config core.sparsecheckout # timeout=10
 > git checkout -f 8c7a5535a63e567b533627e0eb9876799ccd8364
Commit message: "Disable site plan, doesn't work with multimodules"
 > git rev-list --no-walk 165d4b5b50014694b82fd5270194c38821160f73 # timeout=10
[Pipeline] properties
[Pipeline] echo
OS: linux JDK: 7 Maven: 3.x.x => Label: ubuntu JDK: JDK 1.7 (latest) Maven: Maven 3.5.2
[Pipeline] echo
OS: linux JDK: 8 Maven: 3.x.x => Label: ubuntu JDK: JDK 1.8 (latest) Maven: Maven 3.5.2
[Pipeline] echo
OS: linux JDK: 9 Maven: 3.x.x => Label: ubuntu JDK: JDK 1.9 (latest) Maven: Maven 3.5.2
[Pipeline] echo
OS: linux JDK: 10 Maven: 3.x.x => Label: ubuntu JDK: JDK 10 (latest) Maven: Maven 3.5.2
[Pipeline] echo
OS: windows JDK: 7 Maven: 3.x.x => Label: Windows JDK: JDK 1.7 (latest) Maven: Maven 3.5.0
(Windows)
[Pipeline] echo
OS: windows JDK: 8 Maven: 3.x.x => Label: Windows JDK: JDK 1.8 (latest) Maven: Maven 3.5.0
(Windows)
[Pipeline] echo
OS: windows JDK: 9 Maven: 3.x.x => Label: Windows JDK: JDK 1.9 (latest) Maven: Maven 3.5.0
(Windows)
[Pipeline] echo
OS: windows JDK: 10 Maven: 3.x.x => Label: Windows JDK: JDK 10 (latest) Maven: Maven 3.5.0
(Windows)
[Pipeline] parallel
[Pipeline] [linux-jdk7] { (Branch: linux-jdk7)
[Pipeline] [linux-jdk8] { (Branch: linux-jdk8)
[Pipeline] [linux-jdk9] { (Branch: linux-jdk9)
[Pipeline] [linux-jdk10] { (Branch: linux-jdk10)
[Pipeline] [windows-jdk7] { (Branch: windows-jdk7)
[Pipeline] [windows-jdk8] { (Branch: windows-jdk8)
[Pipeline] [windows-jdk9] { (Branch: windows-jdk9)
[Pipeline] [windows-jdk10] { (Branch: windows-jdk10)
[Pipeline] [linux-jdk7] node
[Pipeline] [linux-jdk8] node
[Pipeline] [linux-jdk9] node
[Pipeline] [linux-jdk10] node
[Pipeline] [windows-jdk7] node
[Pipeline] [windows-jdk8] node
[Pipeline] [windows-jdk9] node
[Pipeline] [windows-jdk10] node
[linux-jdk7] Still waiting to schedule task
[linux-jdk7] H0 doesn’t have label ubuntu; H1 doesn’t have label ubuntu; H12 doesn’t
have label ubuntu; H18 doesn’t have label ubuntu; H4 doesn’t have label ubuntu; H5 doesn’t
have label ubuntu; H8 doesn’t have label ubuntu; H9 doesn’t have label ubuntu; Jenkins
doesn’t have label ubuntu; arm1 doesn’t have label ubuntu; beam10 doesn’t have label
ubuntu; beam11 doesn’t have label ubuntu; beam12 doesn’t have label ubuntu; beam13 doesn’t
have label ubuntu; beam14 doesn’t have label ubuntu; beam15 doesn’t have label ubuntu;
beam16 doesn’t have label ubuntu; beam2 doesn’t have label ubuntu; beam3 doesn’t have
label ubuntu; beam4 doesn’t have label ubuntu; beam5 doesn’t have label ubuntu; beam6
doesn’t have label ubuntu; beam7 doesn’t have label ubuntu; beam8 doesn’t have label
ubuntu; beam9 doesn’t have label ubuntu; cassandra1 doesn’t have label ubuntu; cassandra10
doesn’t have label ubuntu; cassandra11 doesn’t have label ubuntu; cassandra12 doesn’t
have label ubuntu; cassandra13 doesn’t have label ubuntu; cassandra14 doesn’t have label
ubuntu; cassandra15 doesn’t have label ubuntu; cassandra16 doesn’t have label ubuntu;
cassandra2 doesn’t have label ubuntu; cassandra3 doesn’t have label ubuntu; cassandra4
doesn’t have label ubuntu; cassandra5 doesn’t have label ubuntu; cassandra6 doesn’t
have label ubuntu; cassandra7 doesn’t have label ubuntu; cassandra8 doesn’t have label
ubuntu; cassandra9 doesn’t have label ubuntu; couchdb-freebsd1 doesn’t have label ubuntu;
couchdb-macos1 doesn’t have label ubuntu; hadoop-ppc64le-1 doesn’t have label ubuntu;
hadoop-win1 doesn’t have label ubuntu; part of Apache Camel » master #440 should be allowed
to run first; plc4x1 doesn’t have label ubuntu; tapestry doesn’t have label ubuntu; ubuntu-1
is offline; ubuntu-2 is offline; ubuntu-6 is offline; ubuntu-eu3 is offline; ubuntu-ppc64le
doesn’t have label ubuntu; ubuntu-us1 is offline; websites1 doesn’t have label ubuntu
[linux-jdk8] Still waiting to schedule task
[linux-jdk8] H0 doesn’t have label ubuntu; H1 doesn’t have label ubuntu; H12 doesn’t
have label ubuntu; H18 doesn’t have label ubuntu; H4 doesn’t have label ubuntu; H5 doesn’t
have label ubuntu; H8 doesn’t have label ubuntu; H9 doesn’t have label ubuntu; Jenkins
doesn’t have label ubuntu; arm1 doesn’t have label ubuntu; beam10 doesn’t have label
ubuntu; beam11 doesn’t have label ubuntu; beam12 doesn’t have label ubuntu; beam13 doesn’t
have label ubuntu; beam14 doesn’t have label ubuntu; beam15 doesn’t have label ubuntu;
beam16 doesn’t have label ubuntu; beam2 doesn’t have label ubuntu; beam3 doesn’t have
label ubuntu; beam4 doesn’t have label ubuntu; beam5 doesn’t have label ubuntu; beam6
doesn’t have label ubuntu; beam7 doesn’t have label ubuntu; beam8 doesn’t have label
ubuntu; beam9 doesn’t have label ubuntu; cassandra1 doesn’t have label ubuntu; cassandra10
doesn’t have label ubuntu; cassandra11 doesn’t have label ubuntu; cassandra12 doesn’t
have label ubuntu; cassandra13 doesn’t have label ubuntu; cassandra14 doesn’t have label
ubuntu; cassandra15 doesn’t have label ubuntu; cassandra16 doesn’t have label ubuntu;
cassandra2 doesn’t have label ubuntu; cassandra3 doesn’t have label ubuntu; cassandra4
doesn’t have label ubuntu; cassandra5 doesn’t have label ubuntu; cassandra6 doesn’t
have label ubuntu; cassandra7 doesn’t have label ubuntu; cassandra8 doesn’t have label
ubuntu; cassandra9 doesn’t have label ubuntu; couchdb-freebsd1 doesn’t have label ubuntu;
couchdb-macos1 doesn’t have label ubuntu; hadoop-ppc64le-1 doesn’t have label ubuntu;
hadoop-win1 doesn’t have label ubuntu; part of Apache Camel » master #440 should be allowed
to run first; plc4x1 doesn’t have label ubuntu; tapestry doesn’t have label ubuntu; ubuntu-1
is offline; ubuntu-2 is offline; ubuntu-6 is offline; ubuntu-eu3 is offline; ubuntu-ppc64le
doesn’t have label ubuntu; ubuntu-us1 is offline; websites1 doesn’t have label ubuntu
[linux-jdk9] Still waiting to schedule task
[linux-jdk9] H0 doesn’t have label ubuntu; H1 doesn’t have label ubuntu; H12 doesn’t
have label ubuntu; H18 doesn’t have label ubuntu; H4 doesn’t have label ubuntu; H5 doesn’t
have label ubuntu; H8 doesn’t have label ubuntu; H9 doesn’t have label ubuntu; Jenkins
doesn’t have label ubuntu; Waiting for pending items to get a node assigned; arm1 doesn’t
have label ubuntu; beam10 doesn’t have label ubuntu; beam11 doesn’t have label ubuntu;
beam12 doesn’t have label ubuntu; beam13 doesn’t have label ubuntu; beam14 doesn’t have
label ubuntu; beam15 doesn’t have label ubuntu; beam16 doesn’t have label ubuntu; beam2
doesn’t have label ubuntu; beam3 doesn’t have label ubuntu; beam4 doesn’t have label
ubuntu; beam5 doesn’t have label ubuntu; beam6 doesn’t have label ubuntu; beam7 doesn’t
have label ubuntu; beam8 doesn’t have label ubuntu; beam9 doesn’t have label ubuntu; cassandra1
doesn’t have label ubuntu; cassandra10 doesn’t have label ubuntu; cassandra11 doesn’t
have label ubuntu; cassandra12 doesn’t have label ubuntu; cassandra13 doesn’t have label
ubuntu; cassandra14 doesn’t have label ubuntu; cassandra15 doesn’t have label ubuntu;
cassandra16 doesn’t have label ubuntu; cassandra2 doesn’t have label ubuntu; cassandra3
doesn’t have label ubuntu; cassandra4 doesn’t have label ubuntu; cassandra5 doesn’t
have label ubuntu; cassandra6 doesn’t have label ubuntu; cassandra7 doesn’t have label
ubuntu; cassandra8 doesn’t have label ubuntu; cassandra9 doesn’t have label ubuntu; couchdb-freebsd1
doesn’t have label ubuntu; couchdb-macos1 doesn’t have label ubuntu; hadoop-ppc64le-1
doesn’t have label ubuntu; hadoop-win1 doesn’t have label ubuntu; plc4x1 doesn’t have
label ubuntu; tapestry doesn’t have label ubuntu; ubuntu-ppc64le doesn’t have label ubuntu;
websites1 doesn’t have label ubuntu
[linux-jdk10] Still waiting to schedule task
[linux-jdk10] H0 doesn’t have label ubuntu; H1 doesn’t have label ubuntu; H12 doesn’t
have label ubuntu; H18 doesn’t have label ubuntu; H4 doesn’t have label ubuntu; H5 doesn’t
have label ubuntu; H8 doesn’t have label ubuntu; H9 doesn’t have label ubuntu; Jenkins
doesn’t have label ubuntu; Waiting for pending items to get a node assigned; arm1 doesn’t
have label ubuntu; beam10 doesn’t have label ubuntu; beam11 doesn’t have label ubuntu;
beam12 doesn’t have label ubuntu; beam13 doesn’t have label ubuntu; beam14 doesn’t have
label ubuntu; beam15 doesn’t have label ubuntu; beam16 doesn’t have label ubuntu; beam2
doesn’t have label ubuntu; beam3 doesn’t have label ubuntu; beam4 doesn’t have label
ubuntu; beam5 doesn’t have label ubuntu; beam6 doesn’t have label ubuntu; beam7 doesn’t
have label ubuntu; beam8 doesn’t have label ubuntu; beam9 doesn’t have label ubuntu; cassandra1
doesn’t have label ubuntu; cassandra10 doesn’t have label ubuntu; cassandra11 doesn’t
have label ubuntu; cassandra12 doesn’t have label ubuntu; cassandra13 doesn’t have label
ubuntu; cassandra14 doesn’t have label ubuntu; cassandra15 doesn’t have label ubuntu;
cassandra16 doesn’t have label ubuntu; cassandra2 doesn’t have label ubuntu; cassandra3
doesn’t have label ubuntu; cassandra4 doesn’t have label ubuntu; cassandra5 doesn’t
have label ubuntu; cassandra6 doesn’t have label ubuntu; cassandra7 doesn’t have label
ubuntu; cassandra8 doesn’t have label ubuntu; cassandra9 doesn’t have label ubuntu; couchdb-freebsd1
doesn’t have label ubuntu; couchdb-macos1 doesn’t have label ubuntu; hadoop-ppc64le-1
doesn’t have label ubuntu; hadoop-win1 doesn’t have label ubuntu; plc4x1 doesn’t have
label ubuntu; tapestry doesn’t have label ubuntu; ubuntu-ppc64le doesn’t have label ubuntu;
websites1 doesn’t have label ubuntu
[windows-jdk7] Still waiting to schedule task
[windows-jdk7] Waiting for next available executor on Windows
[windows-jdk8] Still waiting to schedule task
[windows-jdk8] Waiting for next available executor on Windows
[windows-jdk9] Still waiting to schedule task
[windows-jdk9] Waiting for next available executor on Windows
[windows-jdk10] Still waiting to schedule task
[windows-jdk10] Waiting for next available executor on Windows
[linux-jdk7] Running on H21 in /home/jenkins/jenkins-slave/workspace/mpiler-plugin_MCOMPILER-320-LDDLDH7HQQYXD6B2RHESP35HSEBJ26NA355LSJP2PHGG3DW43OPQ
[Pipeline] [linux-jdk7] {
[Pipeline] [linux-jdk7] stage
[Pipeline] [linux-jdk7] { (Checkout linux-jdk7)
[Pipeline] [linux-jdk7] dir
[linux-jdk7] Running in /home/jenkins/jenkins-slave/workspace/mpiler-plugin_MCOMPILER-320-LDDLDH7HQQYXD6B2RHESP35HSEBJ26NA355LSJP2PHGG3DW43OPQ/m
[Pipeline] [linux-jdk7] {
[Pipeline] [linux-jdk7] checkout
[linux-jdk7] Cloning the remote Git repository
[linux-jdk7] Cloning with configured refspecs honoured and without tags
[linux-jdk7] Cloning repository https://gitbox.apache.org/repos/asf/maven-compiler-plugin.git
[linux-jdk7]  > git init /home/jenkins/jenkins-slave/workspace/mpiler-plugin_MCOMPILER-320-LDDLDH7HQQYXD6B2RHESP35HSEBJ26NA355LSJP2PHGG3DW43OPQ/m
# timeout=10
[linux-jdk7] Fetching upstream changes from https://gitbox.apache.org/repos/asf/maven-compiler-plugin.git
[linux-jdk7]  > git --version # timeout=10
[linux-jdk7]  > git fetch --no-tags --progress https://gitbox.apache.org/repos/asf/maven-compiler-plugin.git
+refs/heads/*:refs/remotes/origin/*
[linux-jdk7]  > git config remote.origin.url https://gitbox.apache.org/repos/asf/maven-compiler-plugin.git
# timeout=10
[linux-jdk7]  > git config --add remote.origin.fetch +refs/heads/*:refs/remotes/origin/*
# timeout=10
[linux-jdk7]  > git config remote.origin.url https://gitbox.apache.org/repos/asf/maven-compiler-plugin.git
# timeout=10
[linux-jdk7] Fetching without tags
[linux-jdk7] Fetching upstream changes from https://gitbox.apache.org/repos/asf/maven-compiler-plugin.git
[linux-jdk7]  > git fetch --no-tags --progress https://gitbox.apache.org/repos/asf/maven-compiler-plugin.git
+refs/heads/*:refs/remotes/origin/*
[linux-jdk7] Checking out Revision e8daa01471eac5eb299a5396be4e3f55588f0746 (MCOMPILER-320)
[linux-jdk7]  > git config core.sparsecheckout # timeout=10
[linux-jdk7]  > git checkout -f e8daa01471eac5eb299a5396be4e3f55588f0746
[linux-jdk7] Commit message: "Merge pull request #2 from dmlloyd/MC-320-problems"
[linux-jdk7]  > git rev-list --no-walk e8daa01471eac5eb299a5396be4e3f55588f0746 # timeout=10
[linux-jdk7] Cleaning workspace
[linux-jdk7]  > git rev-parse --verify HEAD # timeout=10
[linux-jdk7] Resetting working tree
[linux-jdk7]  > git reset --hard # timeout=10
[linux-jdk7]  > git clean -fdx # timeout=10
[Pipeline] [linux-jdk7] }
[Pipeline] [linux-jdk7] // dir
[Pipeline] [linux-jdk7] }
[Pipeline] [linux-jdk7] // stage
[Pipeline] [linux-jdk7] stage
[Pipeline] [linux-jdk7] { (Build linux-jdk7)
[Pipeline] [linux-jdk7] withMaven
[linux-jdk7] [withMaven] Options: [org.jenkinsci.plugins.pipeline.maven.publishers.GeneratedArtifactsPublisher[disabled=false],
JunitTestsPublisher[disabled=false,healthScaleFactor=,keepLongStdio=false,ignoreAttachments=false],
org.jenkinsci.plugins.pipeline.maven.publishers.FindbugsAnalysisPublisher[disabled='false',
healthy='', unHealthy='', thresholdLimit='low'], org.jenkinsci.plugins.pipeline.maven.publishers.TasksScannerPublisher[disabled='false',
healthy='', unHealthy='', thresholdLimit='low'], org.jenkinsci.plugins.pipeline.maven.publishers.DependenciesFingerprintPublisher[disabled=false,
scopes=[compile, provided, runtime], versions={snapshot:true, release:false}], org.jenkinsci.plugins.pipeline.maven.publishers.InvokerRunsPublisher[disabled=false],
org.jenkinsci.plugins.pipeline.maven.publishers.PipelineGraphPublisher[disabled=false, scopes=[compile,
provided, runtime], versions={snapshot:true, release:false}, skipDownstreamTriggers=false,
lifecycleThreshold=deploy, ignoreUpstreamTriggers=false]]
[linux-jdk7] [withMaven] Available options: 
[linux-jdk7] [withMaven] using JDK installation JDK 1.7 (latest)
[linux-jdk7] [withMaven] using Maven installation 'Maven 3.5.2'
[Pipeline] [linux-jdk7] {
[Pipeline] [linux-jdk7] dir
[linux-jdk7] Running in /home/jenkins/jenkins-slave/workspace/mpiler-plugin_MCOMPILER-320-LDDLDH7HQQYXD6B2RHESP35HSEBJ26NA355LSJP2PHGG3DW43OPQ/m
[Pipeline] [linux-jdk7] {
[Pipeline] [linux-jdk7] isUnix
[Pipeline] [linux-jdk7] sh
[linux-jdk7] [m] Running shell script
[linux-jdk7] + mvn -P+run-its -Dmaven.test.failure.ignore=true -Dfindbugs.failOnError=false
clean verify
[linux-jdk7] ----- withMaven Wrapper script -----
[linux-jdk7] Picked up JAVA_TOOL_OPTIONS: -Dmaven.ext.class.path="/home/jenkins/jenkins-slave/workspace/mpiler-plugin_MCOMPILER-320-LDDLDH7HQQYXD6B2RHESP35HSEBJ26NA355LSJP2PHGG3DW43OPQ@tmp/withMaven60138613/pipeline-maven-spy.jar"
-Dorg.jenkinsci.plugins.pipeline.maven.reportsFolder="/home/jenkins/jenkins-slave/workspace/mpiler-plugin_MCOMPILER-320-LDDLDH7HQQYXD6B2RHESP35HSEBJ26NA355LSJP2PHGG3DW43OPQ@tmp/withMaven60138613"

[linux-jdk7] Apache Maven 3.5.2 (138edd61fd100ec658bfa2d307c43b76940a5d7d; 2017-10-18T07:58:13Z)
[linux-jdk7] Maven home: /home/jenkins/tools/maven/apache-maven-3.5.2
[linux-jdk7] Java version: 1.7.0_80, vendor: Oracle Corporation
[linux-jdk7] Java home: /usr/local/asfpackages/java/jdk1.7.0_80/jre
[linux-jdk7] Default locale: en_US, platform encoding: ISO-8859-1
[linux-jdk7] OS name: "linux", version: "4.4.0-109-generic", arch: "amd64", family: "unix"
[linux-jdk7] [INFO] [jenkins-event-spy] Generate /home/jenkins/jenkins-slave/workspace/mpiler-plugin_MCOMPILER-320-LDDLDH7HQQYXD6B2RHESP35HSEBJ26NA355LSJP2PHGG3DW43OPQ@tmp/withMaven60138613/maven-spy-20180703-134622-5532368445240768892741.log.tmp
...
[linux-jdk7] [INFO] Scanning for projects...
[linux-jdk7] [INFO] Downloading from central: https://repo.maven.apache.org/maven2/org/apache/maven/plugins/maven-plugins/30/maven-plugins-30.pom
[linux-jdk7] [ERROR] [ERROR] Some problems were encountered while processing the POMs:
[linux-jdk7] [FATAL] Non-resolvable parent POM for org.apache.maven.plugins:maven-compiler-plugin:3.7.1-SNAPSHOT:
Could not transfer artifact org.apache.maven.plugins:maven-plugins:pom:30 from/to central
(https://repo.maven.apache.org/maven2): Received fatal alert: protocol_version and 'parent.relativePath'
points at wrong local POM @ line 25, column 11
[linux-jdk7]  @ 
[linux-jdk7] [INFO] [jenkins-event-spy] Generated /home/jenkins/jenkins-slave/workspace/mpiler-plugin_MCOMPILER-320-LDDLDH7HQQYXD6B2RHESP35HSEBJ26NA355LSJP2PHGG3DW43OPQ@tmp/withMaven60138613/maven-spy-20180703-134622-5532368445240768892741.log
[linux-jdk7] [ERROR] The build could not read 1 project -> [Help 1]
[linux-jdk7] [ERROR]   
[linux-jdk7] [ERROR]   The project org.apache.maven.plugins:maven-compiler-plugin:3.7.1-SNAPSHOT
(/home/jenkins/jenkins-slave/workspace/mpiler-plugin_MCOMPILER-320-LDDLDH7HQQYXD6B2RHESP35HSEBJ26NA355LSJP2PHGG3DW43OPQ/m/pom.xml)
has 1 error
[linux-jdk7] [ERROR]     Non-resolvable parent POM for org.apache.maven.plugins:maven-compiler-plugin:3.7.1-SNAPSHOT:
Could not transfer artifact org.apache.maven.plugins:maven-plugins:pom:30 from/to central
(https://repo.maven.apache.org/maven2): Received fatal alert: protocol_version and 'parent.relativePath'
points at wrong local POM @ line 25, column 11 -> [Help 2]
[linux-jdk7] [ERROR] 
[linux-jdk7] [ERROR] To see the full stack trace of the errors, re-run Maven with the -e switch.
[linux-jdk7] [ERROR] Re-run Maven using the -X switch to enable full debug logging.
[linux-jdk7] [ERROR] 
[linux-jdk7] [ERROR] For more information about the errors and possible solutions, please
read the following articles:
[linux-jdk7] [ERROR] [Help 1] http://cwiki.apache.org/confluence/display/MAVEN/ProjectBuildingException
[linux-jdk7] [ERROR] [Help 2] http://cwiki.apache.org/confluence/display/MAVEN/UnresolvableModelException
[Pipeline] [linux-jdk7] }
[Pipeline] [linux-jdk7] // dir
[Pipeline] [linux-jdk7] }
[Pipeline] [linux-jdk7] // withMaven
[Pipeline] [linux-jdk7] echo
[linux-jdk7] [FAIL FAST] This is the first failure and likely root cause
[Pipeline] [linux-jdk7] }
[Pipeline] [linux-jdk7] // stage
[Pipeline] [linux-jdk7] }
[Pipeline] [linux-jdk7] // node
[Pipeline] [linux-jdk7] }
[linux-jdk7] Failed in branch linux-jdk7
[Pipeline] [linux-jdk8] // node
[Pipeline] [linux-jdk9] // node
[Pipeline] [linux-jdk10] // node
[Pipeline] [windows-jdk7] // node
[Pipeline] [windows-jdk8] // node
[Pipeline] [windows-jdk9] // node
[Pipeline] [windows-jdk10] // node
[Pipeline] [linux-jdk8] }
[linux-jdk8] Failed in branch linux-jdk8
[Pipeline] [linux-jdk9] }
[linux-jdk9] Failed in branch linux-jdk9
[Pipeline] [linux-jdk10] }
[linux-jdk10] Failed in branch linux-jdk10
[Pipeline] [windows-jdk7] }
[windows-jdk7] Failed in branch windows-jdk7
[Pipeline] [windows-jdk8] }
[windows-jdk8] Failed in branch windows-jdk8
[Pipeline] [windows-jdk9] }
[windows-jdk9] Failed in branch windows-jdk9
[Pipeline] [windows-jdk10] }
[windows-jdk10] Failed in branch windows-jdk10
[Pipeline] // parallel
[Pipeline] echo
***** FAST FAILURE *****

Fast failure triggered by linux-jdk7

***** FAST FAILURE *****
[Pipeline] stage
[Pipeline] { (Notifications)
[Pipeline] echo
Build result: FAILURE
[Pipeline] jiraIssueSelector
[Pipeline] emailext
Mime
  • Unnamed multipart/mixed (inline, None, 0 bytes)
View raw message