maven-notifications mailing list archives

Site index · List index
Message view « Date » · « Thread »
Top « Date » · « Thread »
From Apache Jenkins Server <jenk...@builds.apache.org>
Subject Build failed in Jenkins: Maven TLP » maven-changes-plugin » MNGSITE-332 #2
Date Tue, 03 Jul 2018 11:01:49 GMT
See https://builds.apache.org/job/maven-box/job/maven-changes-plugin/job/MNGSITE-332/2/

Changes:

* Add Java 11-ea
* Add jdkForMaven and mavenForJdk methods Use reqexp for version matching
* regex in switch/case are full match, not partial match
* Update JDKs
* Looks like the API has changed.
* Try to fix it.
* enable TLS 1.2 for Java 7
* TLSv1.x being deactivated since June. So only TLSv1.2 is valid for
* Add asfMavenTlpPlgnBuild to run plugins with multiple Maven versions
* Add maven version to stageId
* Add removeFromCollection() due to RejectedAccessException on
* Scripts not permitted to use method java.util.Collection stream
* Pass 'first'
* Ensure at least minimum required Java version is used
* builds.a.o doesn't have a Maven 3.1.x
* Pass 'failfast'
* Pass 'failingFast'
* Set https.protocols for Java7
* Make failingFast global variable
* Introduce a shared taskContext to keep track of failures
* Make taskContext accessible for try-catch
* Ensure tasks on the same Jenkins instance don't block each others
* dir('m') was used twice
* Also run site goal
* Remove unused parameter
* Disable site plan, doesn't work with multimodules

All tests passed

Build log:
[...truncated 721.39 KB...]
[Pipeline] [linux-jdk9] { (Checkout linux-jdk9)
[Pipeline] [linux-jdk9] dir
[linux-jdk9] Running in /home/jenkins/jenkins-slave/workspace/-changes-plugin_MNGSITE-332-UYNWIQ7CWBETSANCDIHJGN3HKOIPZ7U2N6L6GDMRAKMFBSVTU46A/m
[Pipeline] [linux-jdk9] {
[Pipeline] [linux-jdk9] checkout
[linux-jdk9]  > git rev-parse --is-inside-work-tree # timeout=10
[linux-jdk9] Fetching changes from the remote Git repository
[linux-jdk9]  > git config remote.origin.url https://gitbox.apache.org/repos/asf/maven-changes-plugin.git
# timeout=10
[linux-jdk9] Fetching without tags
[linux-jdk9] Fetching upstream changes from https://gitbox.apache.org/repos/asf/maven-changes-plugin.git
[linux-jdk9]  > git --version # timeout=10
[linux-jdk9]  > git fetch --no-tags --progress https://gitbox.apache.org/repos/asf/maven-changes-plugin.git
+refs/heads/*:refs/remotes/origin/*
[linux-jdk8] [INFO] run script verify.bsh
[linux-jdk8] [INFO] ..SUCCESS (6.8 s)
[linux-jdk8] [INFO] Building: report-changes-nofile/pom.xml
[linux-jdk9] Checking out Revision 9e3c57529c117dac5624e499f63a5b80210ff49e (MNGSITE-332)
[linux-jdk9]  > git config core.sparsecheckout # timeout=10
[linux-jdk9]  > git checkout -f 9e3c57529c117dac5624e499f63a5b80210ff49e
[linux-jdk9] Commit message: "- Changed download templates of plugins not to reference .md5
anymore"
[linux-jdk9] Cleaning workspace
[linux-jdk9]  > git rev-parse --verify HEAD # timeout=10
[linux-jdk9] Resetting working tree
[linux-jdk9]  > git reset --hard # timeout=10
[linux-jdk9]  > git clean -fdx # timeout=10
[Pipeline] [linux-jdk9] }
[Pipeline] [linux-jdk9] // dir
[Pipeline] [linux-jdk9] }
[Pipeline] [linux-jdk9] // stage
[Pipeline] [linux-jdk9] stage
[Pipeline] [linux-jdk9] { (Build linux-jdk9)
[Pipeline] [linux-jdk9] withMaven
[linux-jdk9] [withMaven] Options: [org.jenkinsci.plugins.pipeline.maven.publishers.GeneratedArtifactsPublisher[disabled=true],
JunitTestsPublisher[disabled=false,healthScaleFactor=,keepLongStdio=false,ignoreAttachments=false],
org.jenkinsci.plugins.pipeline.maven.publishers.FindbugsAnalysisPublisher[disabled='true',
healthy='', unHealthy='', thresholdLimit='low'], org.jenkinsci.plugins.pipeline.maven.publishers.TasksScannerPublisher[disabled='true',
healthy='', unHealthy='', thresholdLimit='low'], org.jenkinsci.plugins.pipeline.maven.publishers.DependenciesFingerprintPublisher[disabled=false,
scopes=[compile, provided, runtime], versions={snapshot:true, release:false}], org.jenkinsci.plugins.pipeline.maven.publishers.InvokerRunsPublisher[disabled=false],
org.jenkinsci.plugins.pipeline.maven.publishers.PipelineGraphPublisher[disabled=false, scopes=[compile,
provided, runtime], versions={snapshot:true, release:false}, skipDownstreamTriggers=false,
lifecycleThreshold=deploy, ignoreUpstreamTriggers=false]]
[linux-jdk9] [withMaven] Available options: 
[linux-jdk9] [withMaven] using JDK installation JDK 1.9 (latest)
[linux-jdk9] [withMaven] using Maven installation 'Maven 3.5.2'
[Pipeline] [linux-jdk9] {
[Pipeline] [linux-jdk9] dir
[linux-jdk9] Running in /home/jenkins/jenkins-slave/workspace/-changes-plugin_MNGSITE-332-UYNWIQ7CWBETSANCDIHJGN3HKOIPZ7U2N6L6GDMRAKMFBSVTU46A/m
[Pipeline] [linux-jdk9] {
[Pipeline] [linux-jdk9] isUnix
[Pipeline] [linux-jdk9] sh
[linux-jdk9] [m] Running shell script
[linux-jdk9] + mvn -P+run-its -Dmaven.test.failure.ignore=true -Dfindbugs.failOnError=false
-Dfindbugs.skip=true clean verify
[linux-jdk9] ----- withMaven Wrapper script -----
[linux-jdk9] Picked up JAVA_TOOL_OPTIONS: -Dmaven.ext.class.path="/home/jenkins/jenkins-slave/workspace/-changes-plugin_MNGSITE-332-UYNWIQ7CWBETSANCDIHJGN3HKOIPZ7U2N6L6GDMRAKMFBSVTU46A@tmp/withMavenf7f45a50/pipeline-maven-spy.jar"
-Dorg.jenkinsci.plugins.pipeline.maven.reportsFolder="/home/jenkins/jenkins-slave/workspace/-changes-plugin_MNGSITE-332-UYNWIQ7CWBETSANCDIHJGN3HKOIPZ7U2N6L6GDMRAKMFBSVTU46A@tmp/withMavenf7f45a50"

[linux-jdk9] Apache Maven 3.5.2 (138edd61fd100ec658bfa2d307c43b76940a5d7d; 2017-10-18T07:58:13Z)
[linux-jdk9] Maven home: /home/jenkins/tools/maven/apache-maven-3.5.2
[linux-jdk9] Java version: 9.0.1, vendor: Oracle Corporation
[linux-jdk9] Java home: /usr/local/asfpackages/java/jdk-9.0.1
[linux-jdk9] Default locale: en_US, platform encoding: ISO-8859-1
[linux-jdk9] OS name: "linux", version: "4.4.0-104-generic", arch: "amd64", family: "unix"
[linux-jdk8] [INFO] ..SUCCESS (6.9 s)
[linux-jdk8] [INFO] Building: announce-generate-no-url/pom.xml
[linux-jdk9] [INFO] [jenkins-event-spy] Generate /home/jenkins/jenkins-slave/workspace/-changes-plugin_MNGSITE-332-UYNWIQ7CWBETSANCDIHJGN3HKOIPZ7U2N6L6GDMRAKMFBSVTU46A@tmp/withMavenf7f45a50/maven-spy-20180703-110115-12212114824329348546446.log.tmp
...
[linux-jdk9] [INFO] Scanning for projects...
[linux-jdk9] [INFO] 
[linux-jdk9] [INFO] ------------------------------------------------------------------------
[linux-jdk9] [INFO] Building Apache Maven Changes Plugin 3.0.0-SNAPSHOT
[linux-jdk9] [INFO] ------------------------------------------------------------------------
[linux-jdk9] [INFO] Downloading from central: https://repo.maven.apache.org/maven2/com/sun/xml/bind/jaxb-impl/2.1.13/jaxb-impl-2.1.13.pom
[linux-jdk9] [INFO] Downloaded from central: https://repo.maven.apache.org/maven2/com/sun/xml/bind/jaxb-impl/2.1.13/jaxb-impl-2.1.13.pom
(3.0 kB at 12 kB/s)
[linux-jdk9] [INFO] Downloading from central: https://repo.maven.apache.org/maven2/com/sun/xml/bind/jaxb-impl/2.1.13/jaxb-impl-2.1.13.jar
[linux-jdk9] [INFO] Downloaded from central: https://repo.maven.apache.org/maven2/com/sun/xml/bind/jaxb-impl/2.1.13/jaxb-impl-2.1.13.jar
(877 kB at 7.4 MB/s)
[linux-jdk9] [INFO] 
[linux-jdk9] [INFO] --- maven-clean-plugin:3.0.0:clean (default-clean) @ maven-changes-plugin
---
[linux-jdk9] [INFO] 
[linux-jdk9] [INFO] --- maven-enforcer-plugin:1.4.1:enforce (enforce-bytecode-version) @ maven-changes-plugin
---
[linux-jdk8] [INFO] ..SUCCESS (4.3 s)
[linux-jdk8] [INFO] Building: announcement-generate-custom-template/pom.xml
[linux-jdk9] [INFO] 
[linux-jdk9] [INFO] --- maven-enforcer-plugin:1.4.1:enforce (ban-known-bad-maven-versions)
@ maven-changes-plugin ---
[linux-jdk9] [INFO] 
[linux-jdk9] [INFO] --- maven-enforcer-plugin:1.4.1:enforce (ensure-no-container-api) @ maven-changes-plugin
---
[linux-jdk9] [INFO] 
[linux-jdk9] [INFO] --- apache-rat-plugin:0.11:check (rat-check) @ maven-changes-plugin ---
[linux-jdk9] [INFO] 51 implicit excludes (use -debug for more details).
[linux-jdk9] [INFO] Exclude: DEPENDENCIES
[linux-jdk9] [INFO] Exclude: src/test/resources/org/apache/maven/plugins/jira/unicode-jira-results.xml
[linux-jdk9] [INFO] 179 resources included (use -debug for more details)
[linux-jdk9] [INFO] Rat check: Summary of files. Unapproved: 0 unknown: 0 generated: 0 approved:
172 licence.
[linux-jdk9] [INFO] 
[linux-jdk9] [INFO] --- maven-plugin-plugin:3.4:helpmojo (generate-helpmojo) @ maven-changes-plugin
---
[linux-jdk9] [INFO] Using 'UTF-8' encoding to read mojo metadata.
[linux-jdk9] [INFO] Mojo extractor with id: java-javadoc found 0 mojo descriptors.
[linux-jdk9] [INFO] Mojo extractor with id: java-annotations found 0 mojo descriptors.
[linux-jdk9] [INFO] 
[linux-jdk9] [INFO] --- modello-maven-plugin:1.0.1:java (standard) @ maven-changes-plugin
---
[linux-jdk9] [INFO] outputDirectory: /home/jenkins/jenkins-slave/workspace/-changes-plugin_MNGSITE-332-UYNWIQ7CWBETSANCDIHJGN3HKOIPZ7U2N6L6GDMRAKMFBSVTU46A/m/target/generated-sources/modello
[linux-jdk9] [INFO] Working on model: src/main/mdo/changes.mdo
[linux-jdk9] [INFO] Generating current version: 1.0.0
[linux-jdk9] [INFO] 
[linux-jdk9] [INFO] --- modello-maven-plugin:1.0.1:xpp3-reader (standard) @ maven-changes-plugin
---
[linux-jdk9] [INFO] outputDirectory: /home/jenkins/jenkins-slave/workspace/-changes-plugin_MNGSITE-332-UYNWIQ7CWBETSANCDIHJGN3HKOIPZ7U2N6L6GDMRAKMFBSVTU46A/m/target/generated-sources/modello
[linux-jdk9] [INFO] Working on model: src/main/mdo/changes.mdo
[linux-jdk9] [INFO] Generating current version: 1.0.0
[linux-jdk9] [INFO] 
[linux-jdk9] [INFO] --- modello-maven-plugin:1.0.1:xpp3-writer (standard) @ maven-changes-plugin
---
[linux-jdk9] [INFO] outputDirectory: /home/jenkins/jenkins-slave/workspace/-changes-plugin_MNGSITE-332-UYNWIQ7CWBETSANCDIHJGN3HKOIPZ7U2N6L6GDMRAKMFBSVTU46A/m/target/generated-sources/modello
[linux-jdk9] [INFO] Working on model: src/main/mdo/changes.mdo
[linux-jdk9] [INFO] Generating current version: 1.0.0
[linux-jdk9] [INFO] 
[linux-jdk9] [INFO] --- maven-remote-resources-plugin:1.5:process (process-resource-bundles)
@ maven-changes-plugin ---
[linux-jdk9] [INFO] 
[linux-jdk9] [INFO] --- modello-maven-plugin:1.0.1:xsd (generate-xsd) @ maven-changes-plugin
---
[linux-jdk9] [INFO] outputDirectory: /home/jenkins/jenkins-slave/workspace/-changes-plugin_MNGSITE-332-UYNWIQ7CWBETSANCDIHJGN3HKOIPZ7U2N6L6GDMRAKMFBSVTU46A/m/target/classes/META-INF/changes/xsd
[linux-jdk9] [INFO] Working on model: src/main/mdo/changes.mdo
[linux-jdk9] [INFO] Generating current version: 1.0.0
[linux-jdk9] [INFO] 
[linux-jdk9] [INFO] --- maven-resources-plugin:2.7:resources (default-resources) @ maven-changes-plugin
---
[linux-jdk9] [INFO] Using 'UTF-8' encoding to copy filtered resources.
[linux-jdk9] [INFO] Copying 33 resources
[linux-jdk9] [INFO] Copying 3 resources
[linux-jdk9] [INFO] 
[linux-jdk9] [INFO] --- maven-compiler-plugin:3.5.1:compile (default-compile) @ maven-changes-plugin
---
[linux-jdk9] [INFO] Changes detected - recompiling the module!
[linux-jdk9] [INFO] Compiling 60 source files to /home/jenkins/jenkins-slave/workspace/-changes-plugin_MNGSITE-332-UYNWIQ7CWBETSANCDIHJGN3HKOIPZ7U2N6L6GDMRAKMFBSVTU46A/m/target/classes
[linux-jdk8] [INFO] run script verify.bsh
[linux-jdk8] [INFO] ..SUCCESS (4.9 s)
[linux-jdk8] [INFO] Building: announce-generate-inconsistent-issue-management/pom.xml
[linux-jdk9] [WARNING] /home/jenkins/jenkins-slave/workspace/-changes-plugin_MNGSITE-332-UYNWIQ7CWBETSANCDIHJGN3HKOIPZ7U2N6L6GDMRAKMFBSVTU46A/m/src/main/java/org/apache/maven/plugins/changes/ChangesMojo.java:[325,38]
unchecked method invocation: method logIssueLinkTemplatePerSystem in class org.apache.maven.plugins.changes.ChangesMojo
is applied to given types
[linux-jdk9]   required: java.util.Map<java.lang.String,java.lang.String>
[linux-jdk9]   found: org.apache.commons.collections.map.CaseInsensitiveMap
[linux-jdk9] [WARNING] /home/jenkins/jenkins-slave/workspace/-changes-plugin_MNGSITE-332-UYNWIQ7CWBETSANCDIHJGN3HKOIPZ7U2N6L6GDMRAKMFBSVTU46A/m/src/main/java/org/apache/maven/plugins/changes/ChangesMojo.java:[325,40]
unchecked conversion
[linux-jdk9]   required: java.util.Map<java.lang.String,java.lang.String>
[linux-jdk9]   found:    org.apache.commons.collections.map.CaseInsensitiveMap
[linux-jdk9] [WARNING] /home/jenkins/jenkins-slave/workspace/-changes-plugin_MNGSITE-332-UYNWIQ7CWBETSANCDIHJGN3HKOIPZ7U2N6L6GDMRAKMFBSVTU46A/m/src/main/java/org/apache/maven/plugins/changes/ChangesMojo.java:[327,38]
unchecked method invocation: method setIssueLinksPerSystem in class org.apache.maven.plugins.changes.ChangesReportGenerator
is applied to given types
[linux-jdk9]   required: java.util.Map<java.lang.String,java.lang.String>
[linux-jdk9]   found: org.apache.commons.collections.map.CaseInsensitiveMap
[linux-jdk9] [WARNING] /home/jenkins/jenkins-slave/workspace/-changes-plugin_MNGSITE-332-UYNWIQ7CWBETSANCDIHJGN3HKOIPZ7U2N6L6GDMRAKMFBSVTU46A/m/src/main/java/org/apache/maven/plugins/changes/ChangesMojo.java:[327,40]
unchecked conversion
[linux-jdk9]   required: java.util.Map<java.lang.String,java.lang.String>
[linux-jdk9]   found:    org.apache.commons.collections.map.CaseInsensitiveMap
[linux-jdk9] [WARNING] /home/jenkins/jenkins-slave/workspace/-changes-plugin_MNGSITE-332-UYNWIQ7CWBETSANCDIHJGN3HKOIPZ7U2N6L6GDMRAKMFBSVTU46A/m/target/generated-sources/modello/org/apache/maven/plugins/changes/model/io/xpp3/ChangesXpp3Reader.java:[83,19]
unchecked call to add(E) as a member of the raw type java.util.Set
[linux-jdk9] [WARNING] /home/jenkins/jenkins-slave/workspace/-changes-plugin_MNGSITE-332-UYNWIQ7CWBETSANCDIHJGN3HKOIPZ7U2N6L6GDMRAKMFBSVTU46A/m/target/generated-sources/modello/org/apache/maven/plugins/changes/model/io/xpp3/ChangesXpp3Reader.java:[491,42]
unchecked method invocation: method setFixedIssues in class org.apache.maven.plugins.changes.model.Action
is applied to given types
[linux-jdk9]   required: java.util.List<org.apache.maven.plugins.changes.model.FixedIssue>
[linux-jdk9]   found: java.util.List
[linux-jdk9] [WARNING] /home/jenkins/jenkins-slave/workspace/-changes-plugin_MNGSITE-332-UYNWIQ7CWBETSANCDIHJGN3HKOIPZ7U2N6L6GDMRAKMFBSVTU46A/m/target/generated-sources/modello/org/apache/maven/plugins/changes/model/io/xpp3/ChangesXpp3Reader.java:[491,44]
unchecked conversion
[linux-jdk9]   required: java.util.List<org.apache.maven.plugins.changes.model.FixedIssue>
[linux-jdk9]   found:    java.util.List
[linux-jdk9] [WARNING] /home/jenkins/jenkins-slave/workspace/-changes-plugin_MNGSITE-332-UYNWIQ7CWBETSANCDIHJGN3HKOIPZ7U2N6L6GDMRAKMFBSVTU46A/m/target/generated-sources/modello/org/apache/maven/plugins/changes/model/io/xpp3/ChangesXpp3Reader.java:[493,32]
unchecked call to add(E) as a member of the raw type java.util.List
[linux-jdk9] [WARNING] /home/jenkins/jenkins-slave/workspace/-changes-plugin_MNGSITE-332-UYNWIQ7CWBETSANCDIHJGN3HKOIPZ7U2N6L6GDMRAKMFBSVTU46A/m/target/generated-sources/modello/org/apache/maven/plugins/changes/model/io/xpp3/ChangesXpp3Reader.java:[501,37]
unchecked method invocation: method setDueTos in class org.apache.maven.plugins.changes.model.Action
is applied to given types
[linux-jdk9]   required: java.util.List<org.apache.maven.plugins.changes.model.DueTo>
[linux-jdk9]   found: java.util.List
[linux-jdk9] [WARNING] /home/jenkins/jenkins-slave/workspace/-changes-plugin_MNGSITE-332-UYNWIQ7CWBETSANCDIHJGN3HKOIPZ7U2N6L6GDMRAKMFBSVTU46A/m/target/generated-sources/modello/org/apache/maven/plugins/changes/model/io/xpp3/ChangesXpp3Reader.java:[501,39]
unchecked conversion
[linux-jdk9]   required: java.util.List<org.apache.maven.plugins.changes.model.DueTo>
[linux-jdk9]   found:    java.util.List
[linux-jdk9] [WARNING] /home/jenkins/jenkins-slave/workspace/-changes-plugin_MNGSITE-332-UYNWIQ7CWBETSANCDIHJGN3HKOIPZ7U2N6L6GDMRAKMFBSVTU46A/m/target/generated-sources/modello/org/apache/maven/plugins/changes/model/io/xpp3/ChangesXpp3Reader.java:[503,27]
unchecked call to add(E) as a member of the raw type java.util.List
[linux-jdk9] [WARNING] /home/jenkins/jenkins-slave/workspace/-changes-plugin_MNGSITE-332-UYNWIQ7CWBETSANCDIHJGN3HKOIPZ7U2N6L6GDMRAKMFBSVTU46A/m/target/generated-sources/modello/org/apache/maven/plugins/changes/model/io/xpp3/ChangesXpp3Reader.java:[586,37]
unchecked method invocation: method setReleases in class org.apache.maven.plugins.changes.model.Body
is applied to given types
[linux-jdk9]   required: java.util.List<org.apache.maven.plugins.changes.model.Release>
[linux-jdk9]   found: java.util.List
[linux-jdk9] [WARNING] /home/jenkins/jenkins-slave/workspace/-changes-plugin_MNGSITE-332-UYNWIQ7CWBETSANCDIHJGN3HKOIPZ7U2N6L6GDMRAKMFBSVTU46A/m/target/generated-sources/modello/org/apache/maven/plugins/changes/model/io/xpp3/ChangesXpp3Reader.java:[586,39]
unchecked conversion
[linux-jdk9]   required: java.util.List<org.apache.maven.plugins.changes.model.Release>
[linux-jdk9]   found:    java.util.List
[linux-jdk9] [WARNING] /home/jenkins/jenkins-slave/workspace/-changes-plugin_MNGSITE-332-UYNWIQ7CWBETSANCDIHJGN3HKOIPZ7U2N6L6GDMRAKMFBSVTU46A/m/target/generated-sources/modello/org/apache/maven/plugins/changes/model/io/xpp3/ChangesXpp3Reader.java:[588,29]
unchecked call to add(E) as a member of the raw type java.util.List
[linux-jdk9] [WARNING] /home/jenkins/jenkins-slave/workspace/-changes-plugin_MNGSITE-332-UYNWIQ7CWBETSANCDIHJGN3HKOIPZ7U2N6L6GDMRAKMFBSVTU46A/m/target/generated-sources/modello/org/apache/maven/plugins/changes/model/io/xpp3/ChangesXpp3Reader.java:[681,37]
unchecked method invocation: method setActions in class org.apache.maven.plugins.changes.model.Component
is applied to given types
[linux-jdk9]   required: java.util.List<org.apache.maven.plugins.changes.model.Action>
[linux-jdk9]   found: java.util.List
[linux-jdk9] [WARNING] /home/jenkins/jenkins-slave/workspace/-changes-plugin_MNGSITE-332-UYNWIQ7CWBETSANCDIHJGN3HKOIPZ7U2N6L6GDMRAKMFBSVTU46A/m/target/generated-sources/modello/org/apache/maven/plugins/changes/model/io/xpp3/ChangesXpp3Reader.java:[681,39]
unchecked conversion
[linux-jdk9]   required: java.util.List<org.apache.maven.plugins.changes.model.Action>
[linux-jdk9]   found:    java.util.List
[linux-jdk9] [WARNING] /home/jenkins/jenkins-slave/workspace/-changes-plugin_MNGSITE-332-UYNWIQ7CWBETSANCDIHJGN3HKOIPZ7U2N6L6GDMRAKMFBSVTU46A/m/target/generated-sources/modello/org/apache/maven/plugins/changes/model/io/xpp3/ChangesXpp3Reader.java:[686,36]
unchecked call to add(E) as a member of the raw type java.util.List
[linux-jdk9] [WARNING] /home/jenkins/jenkins-slave/workspace/-changes-plugin_MNGSITE-332-UYNWIQ7CWBETSANCDIHJGN3HKOIPZ7U2N6L6GDMRAKMFBSVTU46A/m/target/generated-sources/modello/org/apache/maven/plugins/changes/model/io/xpp3/ChangesXpp3Reader.java:[863,39]
unchecked method invocation: method setActions in class org.apache.maven.plugins.changes.model.Release
is applied to given types
[linux-jdk9]   required: java.util.List<org.apache.maven.plugins.changes.model.Action>
[linux-jdk9]   found: java.util.List
[linux-jdk9] [WARNING] /home/jenkins/jenkins-slave/workspace/-changes-plugin_MNGSITE-332-UYNWIQ7CWBETSANCDIHJGN3HKOIPZ7U2N6L6GDMRAKMFBSVTU46A/m/target/generated-sources/modello/org/apache/maven/plugins/changes/model/io/xpp3/ChangesXpp3Reader.java:[863,41]
unchecked conversion
[linux-jdk9]   required: java.util.List<org.apache.maven.plugins.changes.model.Action>
[linux-jdk9]   found:    java.util.List
[linux-jdk9] [WARNING] /home/jenkins/jenkins-slave/workspace/-changes-plugin_MNGSITE-332-UYNWIQ7CWBETSANCDIHJGN3HKOIPZ7U2N6L6GDMRAKMFBSVTU46A/m/target/generated-sources/modello/org/apache/maven/plugins/changes/model/io/xpp3/ChangesXpp3Reader.java:[865,28]
unchecked call to add(E) as a member of the raw type java.util.List
[linux-jdk9] [WARNING] /home/jenkins/jenkins-slave/workspace/-changes-plugin_MNGSITE-332-UYNWIQ7CWBETSANCDIHJGN3HKOIPZ7U2N6L6GDMRAKMFBSVTU46A/m/src/main/java/org/apache/maven/plugins/announcement/mailsender/ProjectJavamailMailSender.java:[93,71]
com.sun.net.ssl.internal.ssl.Provider in com.sun.net.ssl.internal.ssl has been deprecated
[linux-jdk9] [INFO] 
[linux-jdk9] [INFO] --- maven-plugin-plugin:3.4:descriptor (default-descriptor) @ maven-changes-plugin
---
[linux-jdk9] [INFO] Using 'UTF-8' encoding to read mojo metadata.
[linux-jdk9] [INFO] Mojo extractor with id: java-javadoc found 0 mojo descriptors.
[linux-jdk9] [INFO] Mojo extractor with id: java-annotations found 9 mojo descriptors.
[linux-jdk9] [INFO] 
[linux-jdk9] [INFO] --- plexus-component-metadata:1.6:generate-metadata (default) @ maven-changes-plugin
---
[linux-jdk9] [INFO] ------------------------------------------------------------------------
[linux-jdk9] [INFO] BUILD FAILURE
[linux-jdk9] [INFO] ------------------------------------------------------------------------
[linux-jdk9] [INFO] Total time: 12.271 s
[linux-jdk9] [INFO] Finished at: 2018-07-03T11:01:27Z
[linux-jdk9] [INFO] Final Memory: 39M/132M
[linux-jdk9] [INFO] ------------------------------------------------------------------------
[linux-jdk9] [INFO] [jenkins-event-spy] Generated /home/jenkins/jenkins-slave/workspace/-changes-plugin_MNGSITE-332-UYNWIQ7CWBETSANCDIHJGN3HKOIPZ7U2N6L6GDMRAKMFBSVTU46A@tmp/withMavenf7f45a50/maven-spy-20180703-110115-12212114824329348546446.log
[linux-jdk9] [ERROR] Failed to execute goal org.codehaus.plexus:plexus-component-metadata:1.6:generate-metadata
(default) on project maven-changes-plugin: Error generating metadata: Failed to extract descriptors:
IllegalArgumentException -> [Help 1]
[linux-jdk9] [ERROR] 
[linux-jdk9] [ERROR] To see the full stack trace of the errors, re-run Maven with the -e switch.
[linux-jdk9] [ERROR] Re-run Maven using the -X switch to enable full debug logging.
[linux-jdk9] [ERROR] 
[linux-jdk9] [ERROR] For more information about the errors and possible solutions, please
read the following articles:
[linux-jdk9] [ERROR] [Help 1] http://cwiki.apache.org/confluence/display/MAVEN/MojoExecutionException
[Pipeline] [linux-jdk9] }
[Pipeline] [linux-jdk9] // dir
[linux-jdk8] [INFO] ..SUCCESS (3.9 s)
[linux-jdk8] [INFO] Building: report-aggregated-changes-generation/pom.xml
[Pipeline] [linux-jdk9] }
[Pipeline] [linux-jdk9] // withMaven
[Pipeline] [linux-jdk9] echo
[linux-jdk9] [FAIL FAST] This is the first failure and likely root cause
[Pipeline] [linux-jdk9] }
[Pipeline] [linux-jdk9] // stage
[Pipeline] [linux-jdk9] }
[Pipeline] [linux-jdk9] // node
[Pipeline] [linux-jdk9] }
[linux-jdk9] Failed in branch linux-jdk9
[linux-jdk8] Sending interrupt signal to process
[Pipeline] [linux-jdk10] // node
[Pipeline] [windows-jdk7] // node
[Pipeline] [windows-jdk8] // node
[Pipeline] [windows-jdk9] // node
[Pipeline] [windows-jdk10] // node
[Pipeline] [linux-jdk10] }
[linux-jdk10] Failed in branch linux-jdk10
[Pipeline] [windows-jdk7] }
[windows-jdk7] Failed in branch windows-jdk7
[Pipeline] [windows-jdk8] }
[windows-jdk8] Failed in branch windows-jdk8
[Pipeline] [windows-jdk9] }
[windows-jdk9] Failed in branch windows-jdk9
[Pipeline] [windows-jdk10] }
[windows-jdk10] Failed in branch windows-jdk10
[linux-jdk8] [INFO] ..FAILED (4.4 s)
[linux-jdk8] [INFO]   The build exited with code 143. See /home/jenkins/jenkins-slave/workspace/-changes-plugin_MNGSITE-332-UYNWIQ7CWBETSANCDIHJGN3HKOIPZ7U2N6L6GDMRAKMFBSVTU46A/m/target/it/report-aggregated-changes-generation/build.log
for details.
[linux-jdk8] [INFO] Building: announce-generate/pom.xml
[linux-jdk8] Terminated
[Pipeline] [linux-jdk8] }
[Pipeline] [linux-jdk8] // dir
[Pipeline] [linux-jdk8] }
[linux-jdk8] [withMaven] One or multiple Maven executions have been ignored by the Jenkins
Pipeline Maven Plugin because they have been interrupted before completion (2). See Pipeline
Maven Plugin FAQ for more details.
[Pipeline] [linux-jdk8] // withMaven
[Pipeline] [linux-jdk8] echo
[linux-jdk8] [FAIL FAST] linux-jdk9 had first failure, ignoring script returned exit code
143
[Pipeline] [linux-jdk8] }
[Pipeline] [linux-jdk8] // stage
[Pipeline] [linux-jdk8] }
[Pipeline] [linux-jdk8] // node
[Pipeline] [linux-jdk8] }
[Pipeline] // parallel
[Pipeline] echo
***** FAST FAILURE *****

Fast failure triggered by linux-jdk9

***** FAST FAILURE *****
[Pipeline] stage
[Pipeline] { (Notifications)
[Pipeline] echo
Build result: FAILURE
[Pipeline] jiraIssueSelector
[Pipeline] emailext
Mime
  • Unnamed multipart/mixed (inline, None, 0 bytes)
View raw message