maven-notifications mailing list archives

Site index · List index
Message view « Date » · « Thread »
Top « Date » · « Thread »
From Apache Jenkins Server <jenk...@builds.apache.org>
Subject Build failed in Jenkins: Maven TLP » maven-archetype » ARCHETYPE-551 #2
Date Tue, 03 Jul 2018 03:39:22 GMT
See https://builds.apache.org/job/maven-box/job/maven-archetype/job/ARCHETYPE-551/2/

Changes:

* Add jdkForMaven and mavenForJdk methods Use reqexp for version matching
* regex in switch/case are full match, not partial match
* Update JDKs
* Looks like the API has changed.
* Try to fix it.
* Add asfMavenTlpPlgnBuild to run plugins with multiple Maven versions
* Add maven version to stageId
* Add removeFromCollection() due to RejectedAccessException on
* Scripts not permitted to use method java.util.Collection stream
* Pass 'first'
* Ensure at least minimum required Java version is used
* builds.a.o doesn't have a Maven 3.1.x
* Pass 'failfast'
* Pass 'failingFast'
* Set https.protocols for Java7
* Make failingFast global variable
* Introduce a shared taskContext to keep track of failures
* Make taskContext accessible for try-catch
* Ensure tasks on the same Jenkins instance don't block each others
* dir('m') was used twice
* Also run site goal
* Remove unused parameter
* Disable site plan, doesn't work with multimodules

No tests ran.

Build log:
[...truncated 1.39 MB...]
[linux-jdk7] [INFO] Downloading from central: https://repo.maven.apache.org/maven2/org/apache/maven/wagon/wagon-provider-api/2.8/wagon-provider-api-2.8.jar
[linux-jdk7] [INFO] Downloaded from central: https://repo.maven.apache.org/maven2/org/apache/maven/shared/maven-artifact-transfer/0.9.0/maven-artifact-transfer-0.9.0.jar
(123 kB at 3.2 MB/s)
[linux-jdk7] [INFO] Downloading from central: https://repo.maven.apache.org/maven2/org/sonatype/aether/aether-connector-file/1.7/aether-connector-file-1.7.jar
[linux-jdk7] [INFO] Downloaded from central: https://repo.maven.apache.org/maven2/org/slf4j/slf4j-api/1.7.5/slf4j-api-1.7.5.jar
(26 kB at 636 kB/s)
[linux-jdk7] [INFO] Downloading from central: https://repo.maven.apache.org/maven2/org/sonatype/aether/aether-connector-wagon/1.7/aether-connector-wagon-1.7.jar
[linux-jdk7] [INFO] Downloaded from central: https://repo.maven.apache.org/maven2/commons-codec/commons-codec/1.6/commons-codec-1.6.jar
(233 kB at 5.0 MB/s)
[linux-jdk7] [INFO] Downloading from central: https://repo.maven.apache.org/maven2/org/codehaus/plexus/plexus-container-default/1.5.5/plexus-container-default-1.5.5.jar
[linux-jdk7] [INFO] Downloaded from central: https://repo.maven.apache.org/maven2/org/apache/maven/plugin-testing/maven-plugin-testing-harness/2.1/maven-plugin-testing-harness-2.1.jar
(39 kB at 795 kB/s)
[linux-jdk7] [INFO] Downloading from central: https://repo.maven.apache.org/maven2/org/apache/xbean/xbean-reflect/3.4/xbean-reflect-3.4.jar
[linux-jdk7] [INFO] Downloaded from central: https://repo.maven.apache.org/maven2/org/apache/maven/wagon/wagon-provider-api/2.8/wagon-provider-api-2.8.jar
(53 kB at 974 kB/s)
[linux-jdk7] [INFO] Downloading from central: https://repo.maven.apache.org/maven2/log4j/log4j/1.2.12/log4j-1.2.12.jar
[linux-jdk7] [INFO] Downloaded from central: https://repo.maven.apache.org/maven2/org/sonatype/aether/aether-connector-wagon/1.7/aether-connector-wagon-1.7.jar
(25 kB at 452 kB/s)
[linux-jdk7] [INFO] Downloading from central: https://repo.maven.apache.org/maven2/commons-logging/commons-logging-api/1.1/commons-logging-api-1.1.jar
[linux-jdk7] [INFO] Downloaded from central: https://repo.maven.apache.org/maven2/org/sonatype/aether/aether-connector-file/1.7/aether-connector-file-1.7.jar
(26 kB at 456 kB/s)
[linux-jdk7] [INFO] Downloading from central: https://repo.maven.apache.org/maven2/org/apache/maven/wagon/wagon-http/2.8/wagon-http-2.8.jar
[linux-jdk7] [INFO] Downloaded from central: https://repo.maven.apache.org/maven2/org/codehaus/plexus/plexus-container-default/1.5.5/plexus-container-default-1.5.5.jar
(217 kB at 3.3 MB/s)
[linux-jdk7] [INFO] Downloading from central: https://repo.maven.apache.org/maven2/org/apache/maven/wagon/wagon-http-shared/2.8/wagon-http-shared-2.8.jar
[linux-jdk7] [INFO] Downloaded from central: https://repo.maven.apache.org/maven2/org/apache/xbean/xbean-reflect/3.4/xbean-reflect-3.4.jar
(134 kB at 2.0 MB/s)
[linux-jdk7] [INFO] Downloading from central: https://repo.maven.apache.org/maven2/org/jsoup/jsoup/1.7.2/jsoup-1.7.2.jar
[linux-jdk7] [INFO] Downloaded from central: https://repo.maven.apache.org/maven2/commons-logging/commons-logging-api/1.1/commons-logging-api-1.1.jar
(45 kB at 656 kB/s)
[linux-jdk7] [INFO] Downloading from central: https://repo.maven.apache.org/maven2/org/apache/httpcomponents/httpclient/4.3.5/httpclient-4.3.5.jar
[linux-jdk7] [INFO] Downloaded from central: https://repo.maven.apache.org/maven2/org/apache/maven/wagon/wagon-http/2.8/wagon-http-2.8.jar
(34 kB at 484 kB/s)
[linux-jdk7] [INFO] Downloading from central: https://repo.maven.apache.org/maven2/commons-logging/commons-logging/1.1.3/commons-logging-1.1.3.jar
[linux-jdk7] [INFO] Downloaded from central: https://repo.maven.apache.org/maven2/log4j/log4j/1.2.12/log4j-1.2.12.jar
(358 kB at 4.7 MB/s)
[linux-jdk7] [INFO] Downloading from central: https://repo.maven.apache.org/maven2/org/apache/httpcomponents/httpcore/4.3.2/httpcore-4.3.2.jar
[linux-jdk7] [INFO] Downloaded from central: https://repo.maven.apache.org/maven2/org/apache/maven/wagon/wagon-http-shared/2.8/wagon-http-shared-2.8.jar
(12 kB at 150 kB/s)
[linux-jdk7] [INFO] Downloading from central: https://repo.maven.apache.org/maven2/org/mortbay/jetty/jetty/6.1.11/jetty-6.1.11.jar
[linux-jdk7] [INFO] Downloaded from central: https://repo.maven.apache.org/maven2/commons-logging/commons-logging/1.1.3/commons-logging-1.1.3.jar
(62 kB at 722 kB/s)
[linux-jdk7] [INFO] Downloading from central: https://repo.maven.apache.org/maven2/org/mortbay/jetty/servlet-api-2.5/6.1.11/servlet-api-2.5-6.1.11.jar
[windows-jdk10]  > git config core.sparsecheckout # timeout=10
[windows-jdk10]  > git checkout -f e845b06d9c2ccebaef4be812cf172045691a17e5
[windows-jdk10] Commit message: "[ARCHETYPE-551] - Upgrade maven-invoker to 3.0.1"
[windows-jdk10] Cleaning workspace
[windows-jdk10]  > git rev-parse --verify HEAD # timeout=10
[windows-jdk10] Resetting working tree
[windows-jdk10]  > git reset --hard # timeout=10
[windows-jdk10]  > git clean -fdx # timeout=10
[linux-jdk7] [INFO] Downloaded from central: https://repo.maven.apache.org/maven2/org/jsoup/jsoup/1.7.2/jsoup-1.7.2.jar
(294 kB at 3.3 MB/s)
[linux-jdk7] [INFO] Downloading from central: https://repo.maven.apache.org/maven2/org/codehaus/groovy/groovy/1.8.3/groovy-1.8.3.jar
[linux-jdk7] [INFO] Downloaded from central: https://repo.maven.apache.org/maven2/org/apache/httpcomponents/httpcore/4.3.2/httpcore-4.3.2.jar
(282 kB at 3.0 MB/s)
[linux-jdk7] [INFO] Downloading from central: https://repo.maven.apache.org/maven2/asm/asm/3.2/asm-3.2.jar
[linux-jdk7] [INFO] Downloaded from central: https://repo.maven.apache.org/maven2/org/apache/httpcomponents/httpclient/4.3.5/httpclient-4.3.5.jar
(591 kB at 6.2 MB/s)
[linux-jdk7] [INFO] Downloading from central: https://repo.maven.apache.org/maven2/asm/asm-commons/3.2/asm-commons-3.2.jar
[linux-jdk7] [INFO] Downloaded from central: https://repo.maven.apache.org/maven2/org/mortbay/jetty/servlet-api-2.5/6.1.11/servlet-api-2.5-6.1.11.jar
(132 kB at 1.3 MB/s)
[linux-jdk7] [INFO] Downloading from central: https://repo.maven.apache.org/maven2/asm/asm-util/3.2/asm-util-3.2.jar
[linux-jdk7] [INFO] Downloaded from central: https://repo.maven.apache.org/maven2/asm/asm/3.2/asm-3.2.jar
(43 kB at 398 kB/s)
[linux-jdk7] [INFO] Downloading from central: https://repo.maven.apache.org/maven2/asm/asm-analysis/3.2/asm-analysis-3.2.jar
[linux-jdk7] [INFO] Downloaded from central: https://repo.maven.apache.org/maven2/asm/asm-commons/3.2/asm-commons-3.2.jar
(33 kB at 301 kB/s)
[linux-jdk7] [INFO] Downloaded from central: https://repo.maven.apache.org/maven2/org/mortbay/jetty/jetty/6.1.11/jetty-6.1.11.jar
(500 kB at 4.5 MB/s)
[linux-jdk7] [INFO] Downloading from central: https://repo.maven.apache.org/maven2/asm/asm-tree/3.2/asm-tree-3.2.jar
[linux-jdk7] [INFO] Downloaded from central: https://repo.maven.apache.org/maven2/asm/asm-util/3.2/asm-util-3.2.jar
(37 kB at 312 kB/s)
[linux-jdk7] [INFO] Downloaded from central: https://repo.maven.apache.org/maven2/asm/asm-analysis/3.2/asm-analysis-3.2.jar
(18 kB at 145 kB/s)
[linux-jdk7] [INFO] Downloaded from central: https://repo.maven.apache.org/maven2/asm/asm-tree/3.2/asm-tree-3.2.jar
(22 kB at 176 kB/s)
[linux-jdk7] [INFO] Downloaded from central: https://repo.maven.apache.org/maven2/org/codehaus/groovy/groovy/1.8.3/groovy-1.8.3.jar
(5.5 MB at 20 MB/s)
[linux-jdk7] [INFO] 
[linux-jdk7] [INFO] --- maven-clean-plugin:3.0.0:clean (default-clean) @ archetype-common
---
[linux-jdk7] [INFO] 
[linux-jdk7] [INFO] --- maven-enforcer-plugin:1.4.1:enforce (enforce-maven-version) @ archetype-common
---
[linux-jdk7] [INFO] 
[linux-jdk7] [INFO] --- maven-enforcer-plugin:1.4.1:enforce (enforce-bytecode-version) @ archetype-common
---
[linux-jdk7] [INFO] Restricted to JDK 1.6 yet org.apache.maven.shared:maven-invoker:jar:3.0.1:compile
contains org/apache/maven/shared/invoker/InvocationRequest$ReactorFailureBehavior.class targeted
to JDK 1.7
[linux-jdk7] [WARNING] Rule 0: org.apache.maven.plugins.enforcer.EnforceBytecodeVersion failed
with message:
[linux-jdk7] Found Banned Dependency: org.apache.maven.shared:maven-invoker:jar:3.0.1
[linux-jdk7] Use 'mvn dependency:tree' to locate the source of the banned dependencies.
[linux-jdk7] [INFO] ------------------------------------------------------------------------
[linux-jdk7] [INFO] Reactor Summary:
[linux-jdk7] [INFO] 
[linux-jdk7] [INFO] Maven Archetype .................................... SUCCESS [ 17.445
s]
[linux-jdk7] [INFO] Maven Archetype Models ............................. SUCCESS [  0.678
s]
[linux-jdk7] [INFO] Maven Archetype Catalog Model ...................... SUCCESS [  4.567
s]
[linux-jdk7] [INFO] Maven Archetype Descriptor Model ................... SUCCESS [  1.385
s]
[linux-jdk7] [INFO] Maven Archetype Testing ............................ SUCCESS [  0.710
s]
[linux-jdk7] [INFO] Maven Archetype Webapp Repository .................. SUCCESS [  1.886
s]
[linux-jdk7] [INFO] Maven Archetype Webapp Proxy ....................... SUCCESS [  1.169
s]
[linux-jdk7] [INFO] Maven Archetype Common ............................. FAILURE [  3.511
s]
[linux-jdk7] [INFO] Maven Archetype Packaging .......................... SKIPPED
[linux-jdk7] [INFO] Maven Archetype Plugin ............................. SKIPPED
[linux-jdk7] [INFO] Maven Archetype Testing Final ...................... SKIPPED
[linux-jdk7] [INFO] ------------------------------------------------------------------------
[linux-jdk7] [INFO] BUILD FAILURE
[linux-jdk7] [INFO] ------------------------------------------------------------------------
[linux-jdk7] [INFO] Total time: 34.858 s
[linux-jdk7] [INFO] Finished at: 2018-07-03T03:38:57Z
[linux-jdk7] [INFO] Final Memory: 85M/1807M
[linux-jdk7] [INFO] ------------------------------------------------------------------------
[linux-jdk7] [INFO] [jenkins-event-spy] Generated /home/jenkins/jenkins-slave/workspace/ven-archetype_ARCHETYPE-551-HRU2Q2KOTZQ5SCJRJRFH54HWHKWPNEX6PLYZFXKJEPWSWHHELAOA@tmp/withMaven28597e64/maven-spy-20180703-033822-4062935837333395913763.log
[linux-jdk7] [ERROR] Failed to execute goal org.apache.maven.plugins:maven-enforcer-plugin:1.4.1:enforce
(enforce-bytecode-version) on project archetype-common: Some Enforcer rules have failed. Look
above for specific messages explaining why the rule failed. -> [Help 1]
[linux-jdk7] [ERROR] 
[linux-jdk7] [ERROR] To see the full stack trace of the errors, re-run Maven with the -e switch.
[linux-jdk7] [ERROR] Re-run Maven using the -X switch to enable full debug logging.
[linux-jdk7] [ERROR] 
[linux-jdk7] [ERROR] For more information about the errors and possible solutions, please
read the following articles:
[linux-jdk7] [ERROR] [Help 1] http://cwiki.apache.org/confluence/display/MAVEN/MojoExecutionException
[linux-jdk7] [ERROR] 
[linux-jdk7] [ERROR] After correcting the problems, you can resume the build with the command
[linux-jdk7] [ERROR]   mvn <goals> -rf :archetype-common
[Pipeline] [windows-jdk9] // dir
[Pipeline] [linux-jdk9] }
[Pipeline] [linux-jdk8] }
[linux-jdk8] [withMaven] junitPublisher - Archive test results for Maven artifact org.apache.maven.archetype:archetype-catalog:3.0.2-SNAPSHOT
generated by maven-surefire-plugin:test (default-test): m/archetype-models/archetype-catalog/target/surefire-reports/*.xml
[linux-jdk8] Recording test results
[linux-jdk8] None of the test reports contained any result
[linux-jdk8] [withMaven] junitPublisher - Archive test results for Maven artifact org.apache.maven.archetype:archetype-descriptor:3.0.2-SNAPSHOT
generated by maven-surefire-plugin:test (default-test): m/archetype-models/archetype-descriptor/target/surefire-reports/*.xml
[linux-jdk8] Recording test results
[linux-jdk8] None of the test reports contained any result
[linux-jdk8] [withMaven] junitPublisher - Archive test results for Maven artifact org.apache.maven.archetype:archetype-repository:3.0.2-SNAPSHOT
generated by maven-surefire-plugin:test (default-test): m/archetype-testing/archetype-repository/target/surefire-reports/*.xml
[linux-jdk8] Recording test results
[linux-jdk8] None of the test reports contained any result
[linux-jdk8] [withMaven] junitPublisher - Archive test results for Maven artifact org.apache.maven.archetype:archetype-proxy:3.0.2-SNAPSHOT
generated by maven-surefire-plugin:test (default-test): m/archetype-testing/archetype-proxy/target/surefire-reports/*.xml
[linux-jdk8] Recording test results
[linux-jdk8] None of the test reports contained any result
[Pipeline] [linux-jdk10] }
[linux-jdk10] [withMaven] junitPublisher - Archive test results for Maven artifact org.apache.maven.archetype:archetype-catalog:3.0.2-SNAPSHOT
generated by maven-surefire-plugin:test (default-test): m/archetype-models/archetype-catalog/target/surefire-reports/*.xml
[linux-jdk10] Recording test results
[linux-jdk10] None of the test reports contained any result
[linux-jdk10] [withMaven] junitPublisher - Archive test results for Maven artifact org.apache.maven.archetype:archetype-descriptor:3.0.2-SNAPSHOT
generated by maven-surefire-plugin:test (default-test): m/archetype-models/archetype-descriptor/target/surefire-reports/*.xml
[linux-jdk10] Recording test results
[linux-jdk10] None of the test reports contained any result
[linux-jdk10] [withMaven] junitPublisher - Archive test results for Maven artifact org.apache.maven.archetype:archetype-repository:3.0.2-SNAPSHOT
generated by maven-surefire-plugin:test (default-test): m/archetype-testing/archetype-repository/target/surefire-reports/*.xml
[linux-jdk10] Recording test results
[linux-jdk10] None of the test reports contained any result
[linux-jdk10] [withMaven] junitPublisher - Archive test results for Maven artifact org.apache.maven.archetype:archetype-proxy:3.0.2-SNAPSHOT
generated by maven-surefire-plugin:test (default-test): m/archetype-testing/archetype-proxy/target/surefire-reports/*.xml
[linux-jdk10] Recording test results
[linux-jdk10] None of the test reports contained any result
[Pipeline] [windows-jdk7] }
[Pipeline] [windows-jdk9] }
[Pipeline] [linux-jdk9] // node
[Pipeline] [linux-jdk8] // withMaven
[Pipeline] [linux-jdk10] // withMaven
[Pipeline] [windows-jdk7] // stage
[Pipeline] [windows-jdk9] // stage
[Pipeline] [linux-jdk9] }
[linux-jdk9] Failed in branch linux-jdk9
[Pipeline] [linux-jdk7] }
[Pipeline] [linux-jdk8] echo
[linux-jdk8] [FAIL FAST] linux-jdk9 had first failure, ignoring script returned exit code
1
[Pipeline] [linux-jdk8] }
[Pipeline] [linux-jdk10] echo
[linux-jdk10] [FAIL FAST] linux-jdk9 had first failure, ignoring script returned exit code
1
[Pipeline] [linux-jdk10] }
[Pipeline] [windows-jdk7] stage
[Pipeline] [windows-jdk7] { (Build windows-jdk7)
[Pipeline] [windows-jdk8] }
[Pipeline] [windows-jdk9] stage
[Pipeline] [windows-jdk9] { (Build windows-jdk9)
[Pipeline] [windows-jdk10] }
[Pipeline] [windows-jdk7] echo
[windows-jdk7] [FAIL FAST] linux-jdk9 has failed. Skipping windows-jdk7.
[Pipeline] [windows-jdk7] }
[Pipeline] [windows-jdk9] echo
[windows-jdk9] [FAIL FAST] linux-jdk9 has failed. Skipping windows-jdk9.
[Pipeline] [windows-jdk9] }
[Pipeline] [linux-jdk7] // dir
[Pipeline] [linux-jdk8] // stage
[Pipeline] [linux-jdk10] // stage
[Pipeline] [linux-jdk8] }
[Pipeline] [linux-jdk10] }
[Pipeline] [linux-jdk7] }
[linux-jdk7] [withMaven] artifactsPublisher - Archive artifact m/pom.xml under org/apache/maven/archetype/maven-archetype/3.0.2-SNAPSHOT/maven-archetype-3.0.2-SNAPSHOT.pom
[linux-jdk7] [withMaven] artifactsPublisher - Archive artifact m/target/maven-archetype-3.0.2-SNAPSHOT-site.xml
under org/apache/maven/archetype/maven-archetype/3.0.2-SNAPSHOT/maven-archetype-3.0.2-SNAPSHOT-site.xml
[linux-jdk7] [withMaven] artifactsPublisher - Archive artifact m/archetype-models/pom.xml
under org/apache/maven/archetype/archetype-models/3.0.2-SNAPSHOT/archetype-models-3.0.2-SNAPSHOT.pom
[linux-jdk7] [withMaven] artifactsPublisher - Archive artifact m/archetype-models/target/archetype-models-3.0.2-SNAPSHOT-site.xml
under org/apache/maven/archetype/archetype-models/3.0.2-SNAPSHOT/archetype-models-3.0.2-SNAPSHOT-site.xml
[linux-jdk7] [withMaven] artifactsPublisher - Archive artifact m/archetype-models/archetype-catalog/pom.xml
under org/apache/maven/archetype/archetype-catalog/3.0.2-SNAPSHOT/archetype-catalog-3.0.2-SNAPSHOT.pom
[linux-jdk7] [withMaven] artifactsPublisher - Archive artifact m/archetype-models/archetype-catalog/target/archetype-catalog-3.0.2-SNAPSHOT.jar
under org/apache/maven/archetype/archetype-catalog/3.0.2-SNAPSHOT/archetype-catalog-3.0.2-SNAPSHOT.jar
[linux-jdk7] [withMaven] artifactsPublisher - Archive artifact m/archetype-models/archetype-descriptor/pom.xml
under org/apache/maven/archetype/archetype-descriptor/3.0.2-SNAPSHOT/archetype-descriptor-3.0.2-SNAPSHOT.pom
[linux-jdk7] [withMaven] artifactsPublisher - Archive artifact m/archetype-models/archetype-descriptor/target/archetype-descriptor-3.0.2-SNAPSHOT.jar
under org/apache/maven/archetype/archetype-descriptor/3.0.2-SNAPSHOT/archetype-descriptor-3.0.2-SNAPSHOT.jar
[linux-jdk7] [withMaven] artifactsPublisher - Archive artifact m/archetype-testing/pom.xml
under org/apache/maven/archetype/archetype-testing/3.0.2-SNAPSHOT/archetype-testing-3.0.2-SNAPSHOT.pom
[linux-jdk7] [withMaven] artifactsPublisher - Archive artifact m/archetype-testing/target/archetype-testing-3.0.2-SNAPSHOT-site.xml
under org/apache/maven/archetype/archetype-testing/3.0.2-SNAPSHOT/archetype-testing-3.0.2-SNAPSHOT-site.xml
[linux-jdk7] [withMaven] artifactsPublisher - Archive artifact m/archetype-testing/archetype-repository/pom.xml
under org/apache/maven/archetype/archetype-repository/3.0.2-SNAPSHOT/archetype-repository-3.0.2-SNAPSHOT.pom
[linux-jdk7] [withMaven] artifactsPublisher - Archive artifact m/archetype-testing/archetype-repository/target/archetype-repository-3.0.2-SNAPSHOT.war
under org/apache/maven/archetype/archetype-repository/3.0.2-SNAPSHOT/archetype-repository-3.0.2-SNAPSHOT.war
[linux-jdk7] [withMaven] artifactsPublisher - Archive artifact m/archetype-testing/archetype-proxy/pom.xml
under org/apache/maven/archetype/archetype-proxy/3.0.2-SNAPSHOT/archetype-proxy-3.0.2-SNAPSHOT.pom
[linux-jdk7] [withMaven] artifactsPublisher - Archive artifact m/archetype-testing/archetype-proxy/target/archetype-proxy-3.0.2-SNAPSHOT.war
under org/apache/maven/archetype/archetype-proxy/3.0.2-SNAPSHOT/archetype-proxy-3.0.2-SNAPSHOT.war
[linux-jdk7] [Fast Archiver] No prior successful build to compare, so performing full copy
of artifacts
[linux-jdk7] [withMaven] junitPublisher - Archive test results for Maven artifact org.apache.maven.archetype:archetype-catalog:3.0.2-SNAPSHOT
generated by maven-surefire-plugin:test (default-test): m/archetype-models/archetype-catalog/target/surefire-reports/*.xml
[linux-jdk7] Recording test results
[linux-jdk7] None of the test reports contained any result
[linux-jdk7] [withMaven] junitPublisher - Archive test results for Maven artifact org.apache.maven.archetype:archetype-descriptor:3.0.2-SNAPSHOT
generated by maven-surefire-plugin:test (default-test): m/archetype-models/archetype-descriptor/target/surefire-reports/*.xml
[linux-jdk7] Recording test results
[linux-jdk7] None of the test reports contained any result
[linux-jdk7] [withMaven] junitPublisher - Archive test results for Maven artifact org.apache.maven.archetype:archetype-repository:3.0.2-SNAPSHOT
generated by maven-surefire-plugin:test (default-test): m/archetype-testing/archetype-repository/target/surefire-reports/*.xml
[linux-jdk7] Recording test results
[linux-jdk7] None of the test reports contained any result
[linux-jdk7] [withMaven] junitPublisher - Archive test results for Maven artifact org.apache.maven.archetype:archetype-proxy:3.0.2-SNAPSHOT
generated by maven-surefire-plugin:test (default-test): m/archetype-testing/archetype-proxy/target/surefire-reports/*.xml
[linux-jdk7] Recording test results
[linux-jdk7] None of the test reports contained any result
[linux-jdk7] [withMaven] openTasksPublisher - Scan Tasks for Maven artifact org.apache.maven.archetype:archetype-repository:3.0.2-SNAPSHOT
in source directory m/archetype-testing/archetype-repository/src/main/java
[linux-jdk7] [withMaven] openTasksPublisher - Scan Tasks for Maven artifact org.apache.maven.archetype:archetype-proxy:3.0.2-SNAPSHOT
in source directory m/archetype-testing/archetype-proxy/src/main/java
[linux-jdk7] [withMaven] openTasksPublisher - Scan Tasks for Maven artifact org.apache.maven.archetype:archetype-common:3.0.2-SNAPSHOT
in source directory m/archetype-common/src/main/java
[linux-jdk7] [TASKS] Scanning folder '/home/jenkins/jenkins-slave/workspace/ven-archetype_ARCHETYPE-551-HRU2Q2KOTZQ5SCJRJRFH54HWHKWPNEX6PLYZFXKJEPWSWHHELAOA'
for files matching the pattern 'm/archetype-testing/archetype-repository/src/main/java/**/*,m/archetype-testing/archetype-proxy/src/main/java/**/*,m/archetype-common/src/main/java/**/*'
- excludes: null
[linux-jdk7] [TASKS] Found 63 files to scan for tasks
[linux-jdk7] [TASKS] Found 24 open tasks.
[linux-jdk7] Skipping warnings blame since pipelines do not have an SCM link.%n
[Pipeline] [windows-jdk8] // dir
[Pipeline] [windows-jdk8] }
[Pipeline] [windows-jdk10] // dir
[Pipeline] [windows-jdk10] }
[Pipeline] [windows-jdk7] // stage
[Pipeline] [windows-jdk9] // stage
[Pipeline] [windows-jdk7] }
[Pipeline] [windows-jdk9] }
[Pipeline] [linux-jdk8] // node
[Pipeline] [linux-jdk10] // node
[Pipeline] [linux-jdk7] // withMaven
[Pipeline] [linux-jdk8] }
[Pipeline] [linux-jdk10] }
[Pipeline] [linux-jdk7] echo
[linux-jdk7] [FAIL FAST] linux-jdk9 had first failure, ignoring script returned exit code
1
[Pipeline] [linux-jdk7] }
[Pipeline] [windows-jdk8] // stage
[Pipeline] [windows-jdk8] stage
[Pipeline] [windows-jdk8] { (Build windows-jdk8)
[Pipeline] [windows-jdk10] // stage
[Pipeline] [windows-jdk10] stage
[Pipeline] [windows-jdk10] { (Build windows-jdk10)
[Pipeline] [windows-jdk8] echo
[windows-jdk8] [FAIL FAST] linux-jdk9 has failed. Skipping windows-jdk8.
[Pipeline] [windows-jdk8] }
[Pipeline] [windows-jdk7] // node
[Pipeline] [windows-jdk9] // node
[Pipeline] [windows-jdk7] }
[Pipeline] [windows-jdk9] }
[Pipeline] [windows-jdk10] echo
[windows-jdk10] [FAIL FAST] linux-jdk9 has failed. Skipping windows-jdk10.
[Pipeline] [windows-jdk10] }
[Pipeline] [linux-jdk7] // stage
[Pipeline] [linux-jdk7] }
[Pipeline] [windows-jdk8] // stage
[Pipeline] [windows-jdk8] }
[Pipeline] [windows-jdk10] // stage
[Pipeline] [windows-jdk10] }
[Pipeline] [linux-jdk7] // node
[Pipeline] [linux-jdk7] }
[Pipeline] [windows-jdk8] // node
[Pipeline] [windows-jdk8] }
[Pipeline] [windows-jdk10] // node
[Pipeline] [windows-jdk10] }
[Pipeline] // parallel
[Pipeline] echo
***** FAST FAILURE *****

Fast failure triggered by linux-jdk9

***** FAST FAILURE *****
[Pipeline] stage
[Pipeline] { (Notifications)
[Pipeline] echo
Build result: FAILURE
[Pipeline] jiraIssueSelector
[Pipeline] emailext
Mime
  • Unnamed multipart/mixed (inline, None, 0 bytes)
View raw message