maven-notifications mailing list archives

Site index · List index
Message view « Date » · « Thread »
Top « Date » · « Thread »
From Apache Jenkins Server <jenk...@builds.apache.org>
Subject Build failed in Jenkins: Maven TLP » maven-scm » SCM-763 #5
Date Tue, 03 Jul 2018 10:45:44 GMT
See https://builds.apache.org/job/maven-box/job/maven-scm/job/SCM-763/5/

Changes:

* Add Java 11-ea
* Add jdkForMaven and mavenForJdk methods Use reqexp for version matching
* regex in switch/case are full match, not partial match
* Update JDKs
* Looks like the API has changed.
* Try to fix it.
* auto deploy if we are currently on master branch
* revert as it seems to fail on jenkins asf
* revert this one as well
* enable TLS 1.2 for Java 7
* TLSv1.x being deactivated since June. So only TLSv1.2 is valid for
* Add asfMavenTlpPlgnBuild to run plugins with multiple Maven versions
* Add maven version to stageId
* Add removeFromCollection() due to RejectedAccessException on
* Scripts not permitted to use method java.util.Collection stream
* Pass 'first'
* Ensure at least minimum required Java version is used
* builds.a.o doesn't have a Maven 3.1.x
* Pass 'failfast'
* Pass 'failingFast'
* Set https.protocols for Java7
* Make failingFast global variable
* Introduce a shared taskContext to keep track of failures
* Make taskContext accessible for try-catch
* Ensure tasks on the same Jenkins instance don't block each others
* dir('m') was used twice
* Also run site goal
* Remove unused parameter
* Disable site plan, doesn't work with multimodules

23 tests failed.
FAILED:  org.apache.maven.scm.provider.git.gitexe.command.checkout.GitExeCheckOutCommandNoBranchTest.testCheckoutNoBranch

Error Message:
The check out result success flag was false.

Stack Trace:
junit.framework.AssertionFailedError: The check out result success flag was false.
	at org.apache.maven.scm.provider.git.gitexe.command.checkout.GitExeCheckOutCommandNoBranchTest.checkoutRepo(GitExeCheckOutCommandNoBranchTest.java:89)
	at org.apache.maven.scm.provider.git.gitexe.command.checkout.GitExeCheckOutCommandNoBranchTest.testCheckoutNoBranch(GitExeCheckOutCommandNoBranchTest.java:65)


FAILED:  org.apache.maven.scm.provider.git.gitexe.command.checkout.GitExeCheckOutCommandNoBranchTest.testDoubleCheckoutNoBranch

Error Message:
The check out result success flag was false.

Stack Trace:
junit.framework.AssertionFailedError: The check out result success flag was false.
	at org.apache.maven.scm.provider.git.gitexe.command.checkout.GitExeCheckOutCommandNoBranchTest.checkoutRepo(GitExeCheckOutCommandNoBranchTest.java:89)
	at org.apache.maven.scm.provider.git.gitexe.command.checkout.GitExeCheckOutCommandNoBranchTest.testDoubleCheckoutNoBranch(GitExeCheckOutCommandNoBranchTest.java:77)


FAILED:  org.apache.maven.scm.provider.git.jgit.command.branch.JGitBranchCommandTckTest.testBranchCommandTest

Error Message:
Exception while executing SCM command.

Stack Trace:
org.apache.maven.scm.ScmException: Exception while executing SCM command.
Caused by: org.apache.maven.scm.ScmException: JGit checkout failure!
Caused by: org.eclipse.jgit.api.errors.JGitInternalException: Exception caught during execution
of fetch command
Caused by: org.eclipse.jgit.errors.NotSupportedException: URI not supported: file://2/m/maven-scm-providers/maven-scm-providers-git/maven-scm-provider-jgit/target/scm-test/repository


FAILED:  org.apache.maven.scm.provider.git.jgit.command.changelog.JGitChangeLogCommandTckTest.testChangeLogCommand

Error Message:
Exception while executing SCM command.

Stack Trace:
org.apache.maven.scm.ScmException: Exception while executing SCM command.
Caused by: org.apache.maven.scm.ScmException: JGit checkout failure!
Caused by: org.eclipse.jgit.api.errors.JGitInternalException: Exception caught during execution
of fetch command
Caused by: org.eclipse.jgit.errors.NotSupportedException: URI not supported: file://2/m/maven-scm-providers/maven-scm-providers-git/maven-scm-provider-jgit/target/scm-test/repository


FAILED:  org.apache.maven.scm.provider.git.jgit.command.checkin.JGitCheckInCommandCommitterAuthorTckTest.testCheckInCommandTest

Error Message:
Exception while executing SCM command.

Stack Trace:
org.apache.maven.scm.ScmException: Exception while executing SCM command.
	at org.apache.maven.scm.provider.git.jgit.command.checkin.JGitCheckInCommandCommitterAuthorTckTest.setUp(JGitCheckInCommandCommitterAuthorTckTest.java:60)
Caused by: org.apache.maven.scm.ScmException: JGit checkout failure!
	at org.apache.maven.scm.provider.git.jgit.command.checkin.JGitCheckInCommandCommitterAuthorTckTest.setUp(JGitCheckInCommandCommitterAuthorTckTest.java:60)
Caused by: org.eclipse.jgit.api.errors.JGitInternalException: Exception caught during execution
of fetch command
	at org.apache.maven.scm.provider.git.jgit.command.checkin.JGitCheckInCommandCommitterAuthorTckTest.setUp(JGitCheckInCommandCommitterAuthorTckTest.java:60)
Caused by: org.eclipse.jgit.errors.NotSupportedException: URI not supported: file://2/m/maven-scm-providers/maven-scm-providers-git/maven-scm-provider-jgit/target/scm-test/repository
	at org.apache.maven.scm.provider.git.jgit.command.checkin.JGitCheckInCommandCommitterAuthorTckTest.setUp(JGitCheckInCommandCommitterAuthorTckTest.java:60)


FAILED:  org.apache.maven.scm.provider.git.jgit.command.checkin.JGitCheckInCommandCommitterAuthorTckTest.testCheckInCommandPartialFileset

Error Message:
Exception while executing SCM command.

Stack Trace:
org.apache.maven.scm.ScmException: Exception while executing SCM command.
	at org.apache.maven.scm.provider.git.jgit.command.checkin.JGitCheckInCommandCommitterAuthorTckTest.setUp(JGitCheckInCommandCommitterAuthorTckTest.java:60)
Caused by: org.apache.maven.scm.ScmException: JGit checkout failure!
	at org.apache.maven.scm.provider.git.jgit.command.checkin.JGitCheckInCommandCommitterAuthorTckTest.setUp(JGitCheckInCommandCommitterAuthorTckTest.java:60)
Caused by: org.eclipse.jgit.api.errors.JGitInternalException: Exception caught during execution
of fetch command
	at org.apache.maven.scm.provider.git.jgit.command.checkin.JGitCheckInCommandCommitterAuthorTckTest.setUp(JGitCheckInCommandCommitterAuthorTckTest.java:60)
Caused by: org.eclipse.jgit.errors.NotSupportedException: URI not supported: file://2/m/maven-scm-providers/maven-scm-providers-git/maven-scm-provider-jgit/target/scm-test/repository
	at org.apache.maven.scm.provider.git.jgit.command.checkin.JGitCheckInCommandCommitterAuthorTckTest.setUp(JGitCheckInCommandCommitterAuthorTckTest.java:60)


FAILED:  org.apache.maven.scm.provider.git.jgit.command.checkin.JGitCheckInCommandTckTest.testCheckInCommandTest

Error Message:
Exception while executing SCM command.

Stack Trace:
org.apache.maven.scm.ScmException: Exception while executing SCM command.
Caused by: org.apache.maven.scm.ScmException: JGit checkout failure!
Caused by: org.eclipse.jgit.api.errors.JGitInternalException: Exception caught during execution
of fetch command
Caused by: org.eclipse.jgit.errors.NotSupportedException: URI not supported: file://2/m/maven-scm-providers/maven-scm-providers-git/maven-scm-provider-jgit/target/scm-test/repository


FAILED:  org.apache.maven.scm.provider.git.jgit.command.checkin.JGitCheckInCommandTckTest.testCheckInCommandPartialFileset

Error Message:
Exception while executing SCM command.

Stack Trace:
org.apache.maven.scm.ScmException: Exception while executing SCM command.
Caused by: org.apache.maven.scm.ScmException: JGit checkout failure!
Caused by: org.eclipse.jgit.api.errors.JGitInternalException: Exception caught during execution
of fetch command
Caused by: org.eclipse.jgit.errors.NotSupportedException: URI not supported: file://2/m/maven-scm-providers/maven-scm-providers-git/maven-scm-provider-jgit/target/scm-test/repository


FAILED:  org.apache.maven.scm.provider.git.jgit.command.checkout.JGitCheckOutCommandTckTest.testCheckOutCommandTest

Error Message:
Exception while executing SCM command.

Stack Trace:
org.apache.maven.scm.ScmException: Exception while executing SCM command.
Caused by: org.apache.maven.scm.ScmException: JGit checkout failure!
Caused by: org.eclipse.jgit.api.errors.JGitInternalException: Exception caught during execution
of fetch command
Caused by: org.eclipse.jgit.errors.NotSupportedException: URI not supported: file://2/m/maven-scm-providers/maven-scm-providers-git/maven-scm-provider-jgit/target/scm-test/repository


FAILED:  org.apache.maven.scm.provider.git.jgit.command.diff.JGitDiffCommandTckTest.testDiffCommand

Error Message:
Exception while executing SCM command.

Stack Trace:
org.apache.maven.scm.ScmException: Exception while executing SCM command.
Caused by: org.apache.maven.scm.ScmException: JGit checkout failure!
Caused by: org.eclipse.jgit.api.errors.JGitInternalException: Exception caught during execution
of fetch command
Caused by: org.eclipse.jgit.errors.NotSupportedException: URI not supported: file://2/m/maven-scm-providers/maven-scm-providers-git/maven-scm-provider-jgit/target/scm-test/repository


FAILED:  org.apache.maven.scm.provider.git.jgit.command.remoteinfo.JGitRemoteInfoCommandTckTest.testRemoteInfoCommand

Error Message:
Exception while executing SCM command.

Stack Trace:
org.apache.maven.scm.ScmException: Exception while executing SCM command.
Caused by: org.apache.maven.scm.ScmException: JGit checkout failure!
Caused by: org.eclipse.jgit.api.errors.JGitInternalException: Exception caught during execution
of fetch command
Caused by: org.eclipse.jgit.errors.NotSupportedException: URI not supported: file://2/m/maven-scm-providers/maven-scm-providers-git/maven-scm-provider-jgit/target/scm-test/repository


FAILED:  org.apache.maven.scm.provider.git.jgit.command.status.JGitStatusCommandTckTest.testStatusCommand

Error Message:
Exception while executing SCM command.

Stack Trace:
org.apache.maven.scm.ScmException: Exception while executing SCM command.
Caused by: org.apache.maven.scm.ScmException: JGit checkout failure!
Caused by: org.eclipse.jgit.api.errors.JGitInternalException: Exception caught during execution
of fetch command
Caused by: org.eclipse.jgit.errors.NotSupportedException: URI not supported: file://2/m/maven-scm-providers/maven-scm-providers-git/maven-scm-provider-jgit/target/scm-test/repository


FAILED:  org.apache.maven.scm.provider.git.jgit.command.tag.JGitTagCommandTckTest.testTagCommandTest

Error Message:
Exception while executing SCM command.

Stack Trace:
org.apache.maven.scm.ScmException: Exception while executing SCM command.
Caused by: org.apache.maven.scm.ScmException: JGit checkout failure!
Caused by: org.eclipse.jgit.api.errors.JGitInternalException: Exception caught during execution
of fetch command
Caused by: org.eclipse.jgit.errors.NotSupportedException: URI not supported: file://2/m/maven-scm-providers/maven-scm-providers-git/maven-scm-provider-jgit/target/scm-test/repository


FAILED:  org.apache.maven.scm.provider.git.gitexe.command.checkin.GitCheckInCommandNoBranchTest.testCheckinNoBranch

Error Message:
The check out result success flag was false.

Stack Trace:
junit.framework.AssertionFailedError: The check out result success flag was false.
	at org.apache.maven.scm.provider.git.gitexe.command.checkin.GitCheckInCommandNoBranchTest.testCheckinNoBranch(GitCheckInCommandNoBranchTest.java:75)


FAILED:  org.apache.maven.scm.provider.git.gitexe.command.checkin.GitCheckInCommandNoBranchTest.testCheckinNoBranch

Error Message:
The check out result success flag was false.

Stack Trace:
junit.framework.AssertionFailedError: The check out result success flag was false.
	at org.apache.maven.scm.provider.git.gitexe.command.checkin.GitCheckInCommandNoBranchTest.testCheckinNoBranch(GitCheckInCommandNoBranchTest.java:75)


FAILED:  org.apache.maven.scm.provider.git.gitexe.command.checkin.GitCheckInCommandNoBranchTest.testCheckinNoBranch

Error Message:
The check out result success flag was false.

Stack Trace:
junit.framework.AssertionFailedError: The check out result success flag was false.
	at org.apache.maven.scm.provider.git.gitexe.command.checkin.GitCheckInCommandNoBranchTest.testCheckinNoBranch(GitCheckInCommandNoBranchTest.java:75)


FAILED:  org.apache.maven.scm.provider.git.gitexe.command.checkin.GitCheckInCommandNoBranchTest.testCheckinNoBranch

Error Message:
The check out result success flag was false.

Stack Trace:
junit.framework.AssertionFailedError: The check out result success flag was false.
	at org.apache.maven.scm.provider.git.gitexe.command.checkin.GitCheckInCommandNoBranchTest.checkoutRepo(GitCheckInCommandNoBranchTest.java:93)
	at org.apache.maven.scm.provider.git.gitexe.command.checkin.GitCheckInCommandNoBranchTest.testCheckinNoBranch(GitCheckInCommandNoBranchTest.java:79)


FAILED:  org.apache.maven.scm.provider.git.gitexe.command.checkin.GitCheckInCommandNoBranchTest.testCheckinNoBranch

Error Message:
The check out result success flag was false.

Stack Trace:
junit.framework.AssertionFailedError: The check out result success flag was false.
	at org.apache.maven.scm.provider.git.gitexe.command.checkin.GitCheckInCommandNoBranchTest.checkoutRepo(GitCheckInCommandNoBranchTest.java:93)
	at org.apache.maven.scm.provider.git.gitexe.command.checkin.GitCheckInCommandNoBranchTest.testCheckinNoBranch(GitCheckInCommandNoBranchTest.java:64)


FAILED:  org.apache.maven.scm.provider.git.gitexe.command.checkin.GitCheckInCommandTest.testCheckinAfterRename

Error Message:
The check out result success flag was false.

Stack Trace:
junit.framework.AssertionFailedError: The check out result success flag was false.
	at org.apache.maven.scm.provider.git.gitexe.command.checkin.GitCheckInCommandTest.testCheckinAfterRename(GitCheckInCommandTest.java:113)


FAILED:  org.apache.maven.scm.provider.git.gitexe.command.checkin.GitCheckInCommandTest.testCheckinAfterRename

Error Message:
The check out result success flag was false.

Stack Trace:
junit.framework.AssertionFailedError: The check out result success flag was false.
	at org.apache.maven.scm.provider.git.gitexe.command.checkin.GitCheckInCommandTest.testCheckinAfterRename(GitCheckInCommandTest.java:113)


FAILED:  org.apache.maven.scm.provider.git.gitexe.command.checkin.GitCheckInCommandTest.testCheckinAfterRename

Error Message:
The check out result success flag was false.

Stack Trace:
junit.framework.AssertionFailedError: The check out result success flag was false.
	at org.apache.maven.scm.provider.git.gitexe.command.checkin.GitCheckInCommandTest.testCheckinAfterRename(GitCheckInCommandTest.java:113)


FAILED:  org.apache.maven.scm.provider.git.gitexe.command.checkin.GitCheckInCommandTest.testCheckinAfterRename

Error Message:
The check out result success flag was false.

Stack Trace:
junit.framework.AssertionFailedError: The check out result success flag was false.
	at org.apache.maven.scm.provider.git.gitexe.command.checkin.GitCheckInCommandTest.checkoutRepoInto(GitCheckInCommandTest.java:143)
	at org.apache.maven.scm.provider.git.gitexe.command.checkin.GitCheckInCommandTest.testCheckinAfterRename(GitCheckInCommandTest.java:99)


FAILED:  org.apache.maven.scm.provider.git.gitexe.command.checkin.GitCheckInCommandTest.testCheckinAfterRename

Error Message:
The check out result success flag was false.

Stack Trace:
junit.framework.AssertionFailedError: The check out result success flag was false.
	at org.apache.maven.scm.provider.git.gitexe.command.checkin.GitCheckInCommandTest.checkoutRepoInto(GitCheckInCommandTest.java:143)
	at org.apache.maven.scm.provider.git.gitexe.command.checkin.GitCheckInCommandTest.testCheckinAfterRename(GitCheckInCommandTest.java:99)




Build log:
[...truncated 7.15 MB...]
[windows-jdk8] [INFO] Executing: cmd.exe /X /C "svn --non-interactive log -v -r "{2004-11-01
00:00:00 +0000}:{2004-11-04 00:00:00 +0000}" file:///F:/jenkins/jenkins-slave/workspace/maven-box_maven-scm_SCM-763-K5MXBWUDUPFRQDAWFKRWZOSCFD6FXLQJRNCCLK4WKCQ2JWDGKXFQ/m/maven-scm-plugin/target/repository"
[windows-jdk8] [INFO] Working directory: F:\jenkins\jenkins-slave\workspace\maven-box_maven-scm_SCM-763-K5MXBWUDUPFRQDAWFKRWZOSCFD6FXLQJRNCCLK4WKCQ2JWDGKXFQ\m\maven-scm-plugin
[windows-jdk8] [INFO] trygvis
[windows-jdk8] Sun Oct 31 23:01:47 UTC 2004
[windows-jdk8] [deleted]:/file, 3
[windows-jdk8] [copied]:/file_1, 3, originalName=/file, originalRevision=1
[windows-jdk8] [modified]:/file_2, 3
[windows-jdk8] 
[windows-jdk8] 
[windows-jdk8] [INFO] trygvis
[windows-jdk8] Mon Nov 01 07:34:03 UTC 2004
[windows-jdk8] [modified]:/file_2, 4
[windows-jdk8] o My log message
[windows-jdk8] 
[windows-jdk8] [INFO] trygvis
[windows-jdk8] Wed Nov 03 09:40:38 UTC 2004
[windows-jdk8] [deleted]:/file_1, 5
[windows-jdk8] [deleted]:/file_2, 5
[windows-jdk8] [added]:/pom.xml, 5
[windows-jdk8] [added]:/readme.txt, 5
[windows-jdk8] [added]:/src, 5
[windows-jdk8] [added]:/src/main, 5
[windows-jdk8] [added]:/src/main/java, 5
[windows-jdk8] [added]:/src/main/java/Application.java, 5
[windows-jdk8] [added]:/src/test, 5
[windows-jdk8] [added]:/src/test/java, 5
[windows-jdk8] [added]:/src/test/java/Test.java, 5
[windows-jdk8] [added]:/src/test/resources, 5
[windows-jdk8] o Making TCK update dump.
[windows-jdk8] 
[windows-jdk8] [INFO] trygvis
[windows-jdk8] Wed Nov 03 09:55:45 UTC 2004
[windows-jdk8] [modified]:/pom.xml, 6
[windows-jdk8] [modified]:/readme.txt, 6
[windows-jdk8] [modified]:/src/main/java/Application.java, 6
[windows-jdk8] [modified]:/src/test/java/Test.java, 6
[windows-jdk8] o Making TCK update dump, take 2.
[windows-jdk8] 
[windows-jdk8] [INFO] trygvis
[windows-jdk8] Wed Nov 03 09:57:42 UTC 2004
[windows-jdk8] [modified]:/pom.xml, 7
[windows-jdk8] [modified]:/readme.txt, 7
[windows-jdk8] [modified]:/src/main/java/Application.java, 7
[windows-jdk8] [modified]:/src/test/java/Test.java, 7
[windows-jdk8] o Making TCK update dump, take 3.
[windows-jdk8] 
[windows-jdk8] Test command line: cmd.exe /X /C "svnadmin create repository"
[windows-jdk8] [INFO] Executing: cmd.exe /X /C "svn --non-interactive log -v http://a.bad.host/repos/trunk"
[windows-jdk8] [INFO] Working directory: F:\jenkins\jenkins-slave\workspace\maven-box_maven-scm_SCM-763-K5MXBWUDUPFRQDAWFKRWZOSCFD6FXLQJRNCCLK4WKCQ2JWDGKXFQ\m\maven-scm-plugin
[windows-jdk8] [ERROR] Provider message:
[windows-jdk8] [ERROR] The svn command failed.
[windows-jdk8] [ERROR] Command output:
[windows-jdk8] [ERROR] svn: E731001: Unable to connect to a repository at URL 'http://a.bad.host/repos/trunk'
[windows-jdk8] svn: E731001: No such host is known.  
[windows-jdk8] 
[windows-jdk8] Test command line: cmd.exe /X /C "svnadmin create repository"
[windows-jdk9] Picked up JAVA_TOOL_OPTIONS: -Dmaven.ext.class.path="f:\jenkins\jenkins-slave\workspace\maven-box_maven-scm_SCM-763-K5MXBWUDUPFRQDAWFKRWZOSCFD6FXLQJRNCCLK4WKCQ2JWDGKXFQ@tmp\withMavendf542ee4\pipeline-maven-spy.jar"
-Dorg.jenkinsci.plugins.pipeline.maven.reportsFolder="f:\jenkins\jenkins-slave\workspace\maven-box_maven-scm_SCM-763-K5MXBWUDUPFRQDAWFKRWZOSCFD6FXLQJRNCCLK4WKCQ2JWDGKXFQ@tmp\withMavendf542ee4"

[windows-jdk9] Running org.apache.maven.scm.plugin.BootstrapMojoTest
[Pipeline] [windows-jdk10] // withMaven
[windows-jdk9] Tests run: 1, Failures: 0, Errors: 0, Skipped: 0, Time elapsed: 0.629 sec -
in org.apache.maven.scm.plugin.BootstrapMojoTest
[windows-jdk9] Running org.apache.maven.scm.plugin.BranchMojoTest
[windows-jdk9] Test command line: cmd.exe /X /C "svnadmin create repository"
[Pipeline] [windows-jdk10] echo
[windows-jdk10] [FAIL FAST] This is the first failure and likely root cause
[Pipeline] [windows-jdk10] }
[Pipeline] [windows-jdk10] // stage
[Pipeline] [windows-jdk10] }
[Pipeline] [windows-jdk10] // node
[Pipeline] [windows-jdk10] }
[windows-jdk9] [INFO] Removing F:\jenkins\jenkins-slave\workspace\maven-box_maven-scm_SCM-763-K5MXBWUDUPFRQDAWFKRWZOSCFD6FXLQJRNCCLK4WKCQ2JWDGKXFQ\m\maven-scm-plugin\target\checkout
[windows-jdk9] [INFO] Executing: cmd.exe /X /C "svn --non-interactive checkout file:///F:/jenkins/jenkins-slave/workspace/maven-box_maven-scm_SCM-763-K5MXBWUDUPFRQDAWFKRWZOSCFD6FXLQJRNCCLK4WKCQ2JWDGKXFQ/m/maven-scm-plugin/target/repository/trunk
F:\jenkins\jenkins-slave\workspace\maven-box_maven-scm_SCM-763-K5MXBWUDUPFRQDAWFKRWZOSCFD6FXLQJRNCCLK4WKCQ2JWDGKXFQ\m\maven-scm-plugin\target\checkout"
[windows-jdk9] [INFO] Working directory: F:\jenkins\jenkins-slave\workspace\maven-box_maven-scm_SCM-763-K5MXBWUDUPFRQDAWFKRWZOSCFD6FXLQJRNCCLK4WKCQ2JWDGKXFQ\m\maven-scm-plugin\target
[windows-jdk10] Failed in branch windows-jdk10
[windows-jdk8] Sending interrupt signal to process
[windows-jdk8] [INFO] Executing: cmd.exe /X /C "svn --non-interactive log -v file:///F:/jenkins/jenkins-slave/workspace/maven-box_maven-scm_SCM-763-K5MXBWUDUPFRQDAWFKRWZOSCFD6FXLQJRNCCLK4WKCQ2JWDGKXFQ/m/maven-scm-plugin/target/repository"
[windows-jdk8] [INFO] Working directory: F:\jenkins\jenkins-slave\workspace\maven-box_maven-scm_SCM-763-K5MXBWUDUPFRQDAWFKRWZOSCFD6FXLQJRNCCLK4WKCQ2JWDGKXFQ\m\maven-scm-plugin
[windows-jdk8] [INFO] Brett
[windows-jdk8] Mon Jan 03 06:01:13 UTC 2005
[windows-jdk8] [added]:/branches, 8
[windows-jdk8] [deleted]:/pom.xml, 8
[windows-jdk8] [deleted]:/readme.txt, 8
[windows-jdk8] [deleted]:/src, 8
[windows-jdk8] [added]:/tags, 8
[windows-jdk8] [added]:/trunk, 8
[windows-jdk8] [copied]:/trunk/pom.xml, 8, originalName=/pom.xml, originalRevision=7
[windows-jdk8] [copied]:/trunk/readme.txt, 8, originalName=/readme.txt, originalRevision=7
[windows-jdk8] [copied]:/trunk/src, 8, originalName=/src, originalRevision=7
[windows-jdk8] setup t/b/t structure
[windows-jdk8] 
[windows-jdk8] [INFO] trygvis
[windows-jdk8] Wed Nov 03 09:57:42 UTC 2004
[windows-jdk8] [modified]:/pom.xml, 7
[windows-jdk8] [modified]:/readme.txt, 7
[windows-jdk8] [modified]:/src/main/java/Application.java, 7
[windows-jdk8] [modified]:/src/test/java/Test.java, 7
[windows-jdk8] o Making TCK update dump, take 3.
[windows-jdk8] 
[windows-jdk8] [INFO] trygvis
[windows-jdk8] Wed Nov 03 09:55:45 UTC 2004
[windows-jdk8] [modified]:/pom.xml, 6
[windows-jdk8] [modified]:/readme.txt, 6
[windows-jdk8] [modified]:/src/main/java/Application.java, 6
[windows-jdk8] [modified]:/src/test/java/Test.java, 6
[windows-jdk8] o Making TCK update dump, take 2.
[windows-jdk8] 
[windows-jdk8] [INFO] trygvis
[windows-jdk8] Wed Nov 03 09:40:38 UTC 2004
[windows-jdk8] [deleted]:/file_1, 5
[windows-jdk8] [deleted]:/file_2, 5
[windows-jdk8] [added]:/pom.xml, 5
[windows-jdk8] [added]:/readme.txt, 5
[windows-jdk8] [added]:/src, 5
[windows-jdk8] [added]:/src/main, 5
[windows-jdk8] [added]:/src/main/java, 5
[windows-jdk8] [added]:/src/main/java/Application.java, 5
[windows-jdk8] [added]:/src/test, 5
[windows-jdk8] [added]:/src/test/java, 5
[windows-jdk8] [added]:/src/test/java/Test.java, 5
[windows-jdk8] [added]:/src/test/resources, 5
[windows-jdk8] o Making TCK update dump.
[windows-jdk8] 
[windows-jdk8] [INFO] trygvis
[windows-jdk8] Mon Nov 01 07:34:03 UTC 2004
[windows-jdk8] [modified]:/file_2, 4
[windows-jdk8] o My log message
[windows-jdk8] 
[windows-jdk8] [INFO] trygvis
[windows-jdk8] Sun Oct 31 23:01:47 UTC 2004
[windows-jdk8] [deleted]:/file, 3
[windows-jdk8] [copied]:/file_1, 3, originalName=/file, originalRevision=1
[windows-jdk8] [modified]:/file_2, 3
[windows-jdk8] 
[windows-jdk8] 
[windows-jdk8] [INFO] trygvis
[windows-jdk8] Sun Oct 31 23:01:07 UTC 2004
[windows-jdk8] [added]:/file_2, 2
[windows-jdk8] 
[windows-jdk8] 
[windows-jdk8] [INFO] trygvis
[windows-jdk8] Sun Oct 31 23:00:31 UTC 2004
[windows-jdk8] [added]:/file, 1
[windows-jdk8] 
[windows-jdk8] 
[windows-jdk8] Tests run: 4, Failures: 0, Errors: 0, Skipped: 0, Time elapsed: 3.168 sec -
in org.apache.maven.scm.plugin.ChangeLogMojoTest
[windows-jdk8] Running org.apache.maven.scm.plugin.CheckoutMojoTest
[windows-jdk9] [INFO] Final Branch Name: 'mybranch'
[windows-jdk9] [INFO] Executing: cmd.exe /X /C "svn --non-interactive copy --parents --file
C:\Users\jenkins\AppData\Local\Temp\1\maven-scm-1614981475.commit . file:///F:/jenkins/jenkins-slave/workspace/maven-box_maven-scm_SCM-763-K5MXBWUDUPFRQDAWFKRWZOSCFD6FXLQJRNCCLK4WKCQ2JWDGKXFQ/m/maven-scm-plugin/target/repository/branches/mybranch"
[windows-jdk9] [INFO] Executing: cmd.exe /X /C "svn --non-interactive copy --parents --file
C:\Users\jenkins\AppData\Local\Temp\1\maven-scm-1614981475.commit . file:///F:/jenkins/jenkins-slave/workspace/maven-box_maven-scm_SCM-763-K5MXBWUDUPFRQDAWFKRWZOSCFD6FXLQJRNCCLK4WKCQ2JWDGKXFQ/m/maven-scm-plugin/target/repository/branches/mybranch"
[windows-jdk9] [INFO] Working directory: F:\jenkins\jenkins-slave\workspace\maven-box_maven-scm_SCM-763-K5MXBWUDUPFRQDAWFKRWZOSCFD6FXLQJRNCCLK4WKCQ2JWDGKXFQ\m\maven-scm-plugin\target\checkout
[windows-jdk9] [INFO] Working directory: F:\jenkins\jenkins-slave\workspace\maven-box_maven-scm_SCM-763-K5MXBWUDUPFRQDAWFKRWZOSCFD6FXLQJRNCCLK4WKCQ2JWDGKXFQ\m\maven-scm-plugin\target\checkout
[windows-jdk9] [INFO] Removing F:\jenkins\jenkins-slave\workspace\maven-box_maven-scm_SCM-763-K5MXBWUDUPFRQDAWFKRWZOSCFD6FXLQJRNCCLK4WKCQ2JWDGKXFQ\m\maven-scm-plugin\target\branches\mybranch
[windows-jdk9] [INFO] Executing: cmd.exe /X /C "svn --non-interactive checkout file:///F:/jenkins/jenkins-slave/workspace/maven-box_maven-scm_SCM-763-K5MXBWUDUPFRQDAWFKRWZOSCFD6FXLQJRNCCLK4WKCQ2JWDGKXFQ/m/maven-scm-plugin/target/repository/branches/mybranch
F:\jenkins\jenkins-slave\workspace\maven-box_maven-scm_SCM-763-K5MXBWUDUPFRQDAWFKRWZOSCFD6FXLQJRNCCLK4WKCQ2JWDGKXFQ\m\maven-scm-plugin\target\branches\mybranch"
[windows-jdk9] [INFO] Executing: cmd.exe /X /C "svn --non-interactive checkout file:///F:/jenkins/jenkins-slave/workspace/maven-box_maven-scm_SCM-763-K5MXBWUDUPFRQDAWFKRWZOSCFD6FXLQJRNCCLK4WKCQ2JWDGKXFQ/m/maven-scm-plugin/target/repository/branches/mybranch
F:\jenkins\jenkins-slave\workspace\maven-box_maven-scm_SCM-763-K5MXBWUDUPFRQDAWFKRWZOSCFD6FXLQJRNCCLK4WKCQ2JWDGKXFQ\m\maven-scm-plugin\target\branches\mybranch"
[windows-jdk9] [INFO] Executing: cmd.exe /X /C "svn --non-interactive checkout file:///F:/jenkins/jenkins-slave/workspace/maven-box_maven-scm_SCM-763-K5MXBWUDUPFRQDAWFKRWZOSCFD6FXLQJRNCCLK4WKCQ2JWDGKXFQ/m/maven-scm-plugin/target/repository/branches/mybranch
F:\jenkins\jenkins-slave\workspace\maven-box_maven-scm_SCM-763-K5MXBWUDUPFRQDAWFKRWZOSCFD6FXLQJRNCCLK4WKCQ2JWDGKXFQ\m\maven-scm-plugin\target\branches\mybranch"
[windows-jdk9] [INFO] Working directory: F:\jenkins\jenkins-slave\workspace\maven-box_maven-scm_SCM-763-K5MXBWUDUPFRQDAWFKRWZOSCFD6FXLQJRNCCLK4WKCQ2JWDGKXFQ\m\maven-scm-plugin\target\branches
[windows-jdk9] [INFO] Working directory: F:\jenkins\jenkins-slave\workspace\maven-box_maven-scm_SCM-763-K5MXBWUDUPFRQDAWFKRWZOSCFD6FXLQJRNCCLK4WKCQ2JWDGKXFQ\m\maven-scm-plugin\target\branches
[windows-jdk9] [INFO] Working directory: F:\jenkins\jenkins-slave\workspace\maven-box_maven-scm_SCM-763-K5MXBWUDUPFRQDAWFKRWZOSCFD6FXLQJRNCCLK4WKCQ2JWDGKXFQ\m\maven-scm-plugin\target\branches
[windows-jdk9] Tests run: 1, Failures: 0, Errors: 0, Skipped: 0, Time elapsed: 1.615 sec -
in org.apache.maven.scm.plugin.BranchMojoTest
[windows-jdk9] Running org.apache.maven.scm.plugin.ChangeLogMojoTest
[windows-jdk9] Sending interrupt signal to process
[windows-jdk9] Test command line: cmd.exe /X /C "svnadmin create repository"
[windows-jdk9] 
[windows-jdk9] Results :
[windows-jdk9] 
[windows-jdk9] Tests run: 2, Failures: 0, Errors: 0, Skipped: 0
[windows-jdk9] 
[windows-jdk9] [INFO] ------------------------------------------------------------------------
[windows-jdk9] [INFO] Reactor Summary:
[windows-jdk9] [INFO] 
[windows-jdk9] [INFO] Maven SCM .......................................... SUCCESS [ 19.654
s]
[windows-jdk9] [INFO] Maven SCM API ...................................... SUCCESS [  9.967
s]
[windows-jdk9] [INFO] Maven SCM Managers ................................. SUCCESS [  1.063
s]
[windows-jdk9] [INFO] Maven SCM Manager for Plexus ....................... SUCCESS [  2.419
s]
[windows-jdk9] [INFO] Maven SCM Test ..................................... SUCCESS [  3.800
s]
[windows-jdk9] [INFO] Maven SCM Providers ................................ SUCCESS [  1.464
s]
[windows-jdk9] [INFO] Maven SCM AccuRev Provider ......................... SUCCESS [  8.695
s]
[windows-jdk9] [INFO] Maven SCM Bazaar Provider .......................... SUCCESS [  5.401
s]
[windows-jdk9] [INFO] Maven SCM Clearcase Provider ....................... SUCCESS [  5.318
s]
[windows-jdk9] [INFO] Maven SCM CVS Provider - Parent .................... SUCCESS [  0.869
s]
[windows-jdk9] [INFO] Maven SCM CVS Provider TCK tests ................... SUCCESS [  1.852
s]
[windows-jdk9] [INFO] Maven SCM CVS Provider - Common library ............ SUCCESS [  4.099
s]
[windows-jdk9] [INFO] Maven SCM CVS Provider - CVS Executable Impl. ...... SUCCESS [  3.582
s]
[windows-jdk9] [INFO] Maven SCM CVS Provider - CVS Java Impl. ............ SUCCESS [  4.128
s]
[windows-jdk9] [INFO] Maven SCM Mercurial (Hg) Provider .................. SUCCESS [  3.213
s]
[windows-jdk9] [INFO] Maven SCM Git Provider - Parent .................... SUCCESS [  1.354
s]
[windows-jdk9] [INFO] Maven SCM Git Provider - Common library ............ SUCCESS [  3.774
s]
[windows-jdk9] [INFO] Maven SCM Git Provider TCK Tests ................... SUCCESS [  1.760
s]
[windows-jdk9] [INFO] Maven SCM Git Provider - Git Executable Impl. ...... SUCCESS [  7.191
s]
[windows-jdk9] [INFO] Maven SCM Git Provider - JGit Impl. ................ SUCCESS [ 35.014
s]
[windows-jdk9] [INFO] Maven SCM Local Provider ........................... SUCCESS [  2.922
s]
[windows-jdk9] [INFO] Maven SCM Perforce Provider ........................ SUCCESS [  3.867
s]
[windows-jdk9] [INFO] Maven SCM Starteam Provider ........................ SUCCESS [  4.944
s]
[windows-jdk9] [INFO] Maven SCM Subversion Provider - Parent ............. SUCCESS [  0.841
s]
[windows-jdk9] [INFO] Maven SCM Subversion Provider - Common library ..... SUCCESS [  3.060
s]
[windows-jdk9] [INFO] Maven SCM Subversion Provider TCK Tests ............ SUCCESS [  1.105
s]
[windows-jdk9] [INFO] Maven SCM Subversion Provider - SVN Executable Impl. SUCCESS [  5.819
s]
[windows-jdk9] [INFO] Maven SCM Synergy Provider ......................... SUCCESS [  3.240
s]
[windows-jdk9] [INFO] Maven SCM Visual Source Safe Provider .............. SUCCESS [  4.087
s]
[windows-jdk9] [INFO] Maven SCM TFS Provider ............................. SUCCESS [  3.051
s]
[windows-jdk9] [INFO] Maven SCM MKS Integrity Provider ................... SUCCESS [  3.626
s]
[windows-jdk9] [INFO] Maven SCM Jazz/Rational Team Concert Provider ...... SUCCESS [  3.890
s]
[windows-jdk9] [INFO] Maven SCM Standard Providers ....................... SUCCESS [  2.041
s]
[windows-jdk9] [INFO] Maven SCM Client ................................... SUCCESS [  4.100
s]
[windows-jdk9] [INFO] Maven SCM Plugin ................................... FAILURE [  9.945
s]
[windows-jdk9] [INFO] ------------------------------------------------------------------------
[windows-jdk9] [INFO] BUILD FAILURE
[windows-jdk9] [INFO] ------------------------------------------------------------------------
[windows-jdk9] [INFO] Total time: 03:03 min
[windows-jdk9] [INFO] Finished at: 2018-07-03T10:45:32Z
[windows-jdk8] Test command line: cmd.exe /X /C "svnadmin create repository"
[windows-jdk8] After 10s process did not stop
[Pipeline] [windows-jdk8] }
[Pipeline] [windows-jdk8] // dir
[Pipeline] [windows-jdk8] }
[windows-jdk8] [withMaven] One or multiple Maven executions have been ignored by the Jenkins
Pipeline Maven Plugin because they have been interrupted before completion (1). See Pipeline
Maven Plugin FAQ for more details.
[Pipeline] [windows-jdk8] // withMaven
[Pipeline] [windows-jdk8] echo
[windows-jdk8] [FAIL FAST] windows-jdk10 had first failure, ignoring null
[Pipeline] [windows-jdk8] }
[Pipeline] [windows-jdk8] // stage
[Pipeline] [windows-jdk8] }
[Pipeline] [windows-jdk8] // node
[Pipeline] [windows-jdk8] }
[windows-jdk9] After 10s process did not stop
[Pipeline] [windows-jdk9] }
[Pipeline] [windows-jdk9] // dir
[Pipeline] [windows-jdk9] }
[windows-jdk9] [withMaven] One or multiple Maven executions have been ignored by the Jenkins
Pipeline Maven Plugin because they have been interrupted before completion (1). See Pipeline
Maven Plugin FAQ for more details.
[Pipeline] [windows-jdk9] // withMaven
[Pipeline] [windows-jdk9] echo
[windows-jdk9] [FAIL FAST] windows-jdk10 had first failure, ignoring null
[Pipeline] [windows-jdk9] }
[Pipeline] [windows-jdk9] // stage
[Pipeline] [windows-jdk9] }
[Pipeline] [windows-jdk9] // node
[Pipeline] [windows-jdk9] }
[Pipeline] // parallel
[Pipeline] echo
***** FAST FAILURE *****

Fast failure triggered by windows-jdk10

***** FAST FAILURE *****
[Pipeline] stage
[Pipeline] { (Notifications)
[Pipeline] echo
Build result: FAILURE
[Pipeline] jiraIssueSelector
[Pipeline] emailext
Mime
  • Unnamed multipart/mixed (inline, None, 0 bytes)
View raw message