maven-notifications mailing list archives

Site index · List index
Message view « Date » · « Thread »
Top « Date » · « Thread »
From Apache Jenkins Server <jenk...@builds.apache.org>
Subject Build unstable in Jenkins: Maven TLP » maven-plugin-testing » master #3
Date Mon, 02 Jul 2018 15:42:56 GMT
See https://builds.apache.org/job/maven-box/job/maven-plugin-testing/job/master/3/

Changes:

* Add jdkForMaven and mavenForJdk methods Use reqexp for version matching
* regex in switch/case are full match, not partial match
* Update JDKs
* Looks like the API has changed.
* Try to fix it.
* enable TLS 1.2 for Java 7
* TLSv1.x being deactivated since June. So only TLSv1.2 is valid for
* Add asfMavenTlpPlgnBuild to run plugins with multiple Maven versions
* Add maven version to stageId
* Add removeFromCollection() due to RejectedAccessException on
* Scripts not permitted to use method java.util.Collection stream
* Pass 'first'
* Ensure at least minimum required Java version is used
* builds.a.o doesn't have a Maven 3.1.x
* Pass 'failfast'
* Pass 'failingFast'
* Set https.protocols for Java7
* Make failingFast global variable
* Introduce a shared taskContext to keep track of failures
* Make taskContext accessible for try-catch
* Ensure tasks on the same Jenkins instance don't block each others
* dir('m') was used twice
* Also run site goal
* Remove unused parameter
* Disable site plan, doesn't work with multimodules

5 tests failed.
FAILED:  org.apache.maven.plugin.testing.PluginArtifactFileTest.testArtifact

Error Message:
null

Stack Trace:
junit.framework.AssertionFailedError: null
	at junit.framework.Assert.fail(Assert.java:55)
	at junit.framework.Assert.assertTrue(Assert.java:22)
	at junit.framework.Assert.assertTrue(Assert.java:31)
	at junit.framework.TestCase.assertTrue(TestCase.java:201)
	at org.apache.maven.plugin.testing.PluginArtifactFileTest.testArtifact(PluginArtifactFileTest.java:45)


FAILED:  org.apache.maven.shared.test.plugin.ProjectToolTest.testPackageProjectArtifact_ShouldPopulateWithCorrectArtifactAndMetadata

Error Message:
Missing target\unit\projects\basic\target\it-build-target\maven-it-plugin-test.jar

Stack Trace:
junit.framework.AssertionFailedError: Missing target\unit\projects\basic\target\it-build-target\maven-it-plugin-test.jar
	at junit.framework.Assert.fail(Assert.java:57)
	at junit.framework.Assert.assertTrue(Assert.java:22)
	at junit.framework.TestCase.assertTrue(TestCase.java:192)
	at org.apache.maven.shared.test.plugin.ProjectToolTest.testPackageProjectArtifact_ShouldPopulateWithCorrectArtifactAndMetadata(ProjectToolTest.java:99)


FAILED:  org.apache.maven.shared.test.plugin.ProjectToolTest.testPackageProjectArtifact_ShouldPopulateWithCorrectArtifactAndMetadata

Error Message:
Missing target\unit\projects\basic\target\it-build-target\maven-it-plugin-test.jar

Stack Trace:
junit.framework.AssertionFailedError: Missing target\unit\projects\basic\target\it-build-target\maven-it-plugin-test.jar
	at junit.framework.Assert.fail(Assert.java:57)
	at junit.framework.Assert.assertTrue(Assert.java:22)
	at junit.framework.TestCase.assertTrue(TestCase.java:192)
	at org.apache.maven.shared.test.plugin.ProjectToolTest.testPackageProjectArtifact_ShouldPopulateWithCorrectArtifactAndMetadata(ProjectToolTest.java:99)


FAILED:  org.apache.maven.shared.test.plugin.ProjectToolTest.testPackageProjectArtifact_ShouldPopulateWithCorrectArtifactAndMetadata

Error Message:
Missing target/unit/projects/basic/target/it-build-target/maven-it-plugin-test.jar

Stack Trace:
junit.framework.AssertionFailedError: Missing target/unit/projects/basic/target/it-build-target/maven-it-plugin-test.jar
	at junit.framework.Assert.fail(Assert.java:57)
	at junit.framework.Assert.assertTrue(Assert.java:22)
	at junit.framework.TestCase.assertTrue(TestCase.java:192)
	at org.apache.maven.shared.test.plugin.ProjectToolTest.testPackageProjectArtifact_ShouldPopulateWithCorrectArtifactAndMetadata(ProjectToolTest.java:99)


FAILED:  org.apache.maven.shared.test.plugin.ProjectToolTest.testPackageProjectArtifact_ShouldPopulateWithCorrectArtifactAndMetadata

Error Message:
Missing target/unit/projects/basic/target/it-build-target/maven-it-plugin-test.jar

Stack Trace:
junit.framework.AssertionFailedError: Missing target/unit/projects/basic/target/it-build-target/maven-it-plugin-test.jar
	at junit.framework.Assert.fail(Assert.java:57)
	at junit.framework.Assert.assertTrue(Assert.java:22)
	at junit.framework.TestCase.assertTrue(TestCase.java:192)
	at org.apache.maven.shared.test.plugin.ProjectToolTest.testPackageProjectArtifact_ShouldPopulateWithCorrectArtifactAndMetadata(ProjectToolTest.java:99)




Build log:
[...truncated 1.88 MB...]
[linux-jdk9] [INFO] Downloaded from central: https://repo.maven.apache.org/maven2/commons-lang/commons-lang/1.0/commons-lang-1.0.pom
(2.5 kB at 205 kB/s)
[linux-jdk9] [INFO] Downloading from central: https://repo.maven.apache.org/maven2/asm/asm/3.1/asm-3.1.pom
[linux-jdk9] [INFO] Downloaded from central: https://repo.maven.apache.org/maven2/asm/asm/3.1/asm-3.1.pom
(278 B at 23 kB/s)
[linux-jdk9] [INFO] Downloading from central: https://repo.maven.apache.org/maven2/asm/asm-parent/3.1/asm-parent-3.1.pom
[linux-jdk9] [INFO] Downloaded from central: https://repo.maven.apache.org/maven2/asm/asm-parent/3.1/asm-parent-3.1.pom
(4.2 kB at 346 kB/s)
[linux-jdk9] [INFO] Downloading from central: https://repo.maven.apache.org/maven2/org/codehaus/plexus/plexus-utils/1.4.5/plexus-utils-1.4.5.jar
[linux-jdk9] [INFO] Downloading from central: https://repo.maven.apache.org/maven2/com/thoughtworks/qdox/qdox/1.9.2/qdox-1.9.2.jar
[linux-jdk9] [INFO] Downloading from central: https://repo.maven.apache.org/maven2/jdom/jdom/1.0/jdom-1.0.jar
[linux-jdk9] [INFO] Downloading from central: https://repo.maven.apache.org/maven2/org/codehaus/plexus/plexus-cli/1.2/plexus-cli-1.2.jar
[linux-jdk9] [INFO] Downloading from central: https://repo.maven.apache.org/maven2/commons-logging/commons-logging/1.0/commons-logging-1.0.jar
[linux-jdk9] [INFO] Downloaded from central: https://repo.maven.apache.org/maven2/org/codehaus/plexus/plexus-cli/1.2/plexus-cli-1.2.jar
(7.7 kB at 479 kB/s)
[linux-jdk9] [INFO] Downloading from central: https://repo.maven.apache.org/maven2/commons-lang/commons-lang/1.0/commons-lang-1.0.jar
[linux-jdk9] [INFO] Downloaded from central: https://repo.maven.apache.org/maven2/commons-logging/commons-logging/1.0/commons-logging-1.0.jar
(22 kB at 1.4 MB/s)
[linux-jdk9] [INFO] Downloading from central: https://repo.maven.apache.org/maven2/asm/asm/3.1/asm-3.1.jar
[linux-jdk9] [INFO] Downloaded from central: https://repo.maven.apache.org/maven2/com/thoughtworks/qdox/qdox/1.9.2/qdox-1.9.2.jar
(170 kB at 8.1 MB/s)
[linux-jdk9] [INFO] Downloaded from central: https://repo.maven.apache.org/maven2/jdom/jdom/1.0/jdom-1.0.jar
(153 kB at 7.3 MB/s)
[linux-jdk9] [INFO] Downloaded from central: https://repo.maven.apache.org/maven2/org/codehaus/plexus/plexus-utils/1.4.5/plexus-utils-1.4.5.jar
(205 kB at 8.2 MB/s)
[linux-jdk9] [INFO] Downloaded from central: https://repo.maven.apache.org/maven2/asm/asm/3.1/asm-3.1.jar
(43 kB at 1.3 MB/s)
[linux-jdk9] [INFO] Downloaded from central: https://repo.maven.apache.org/maven2/commons-lang/commons-lang/1.0/commons-lang-1.0.jar
(64 kB at 1.9 MB/s)
[linux-jdk9] [INFO] Discovered 5 component descriptors(s)
[linux-jdk9] [INFO] 
[linux-jdk9] [INFO] --- maven-resources-plugin:2.6:testResources (default-testResources) @
maven-plugin-testing-tools ---
[linux-jdk9] [INFO] Using 'UTF-8' encoding to copy filtered resources.
[linux-jdk9] [INFO] Copying 2 resources
[linux-jdk9] [INFO] Copying 3 resources
[linux-jdk9] [INFO] 
[linux-jdk9] [INFO] --- maven-compiler-plugin:3.1:testCompile (default-testCompile) @ maven-plugin-testing-tools
---
[linux-jdk9] [INFO] Changes detected - recompiling the module!
[linux-jdk9] [INFO] Compiling 2 source files to /home/jenkins/jenkins-slave/workspace/maven-plugin-testing_master-DVW6YN5BVVM46OW7TA3KT7FW4MNQLXDPGDLTWG6QD4JLKCSIG7YQ/m/maven-plugin-testing-tools/target/test-classes
[linux-jdk9] [WARNING] /home/jenkins/jenkins-slave/workspace/maven-plugin-testing_master-DVW6YN5BVVM46OW7TA3KT7FW4MNQLXDPGDLTWG6QD4JLKCSIG7YQ/m/maven-plugin-testing-tools/src/test/java/org/apache/maven/shared/test/plugin/ProjectToolTest.java:
Some input files use or override a deprecated API.
[linux-jdk9] [WARNING] /home/jenkins/jenkins-slave/workspace/maven-plugin-testing_master-DVW6YN5BVVM46OW7TA3KT7FW4MNQLXDPGDLTWG6QD4JLKCSIG7YQ/m/maven-plugin-testing-tools/src/test/java/org/apache/maven/shared/test/plugin/ProjectToolTest.java:
Recompile with -Xlint:deprecation for details.
[linux-jdk9] [INFO] 
[linux-jdk9] [INFO] --- maven-surefire-plugin:2.16:test (default-test) @ maven-plugin-testing-tools
---
[linux-jdk9] [INFO] Surefire report directory: /home/jenkins/jenkins-slave/workspace/maven-plugin-testing_master-DVW6YN5BVVM46OW7TA3KT7FW4MNQLXDPGDLTWG6QD4JLKCSIG7YQ/m/maven-plugin-testing-tools/target/surefire-reports
[linux-jdk9] 
[linux-jdk9] -------------------------------------------------------
[linux-jdk9]  T E S T S
[linux-jdk9] -------------------------------------------------------
[linux-jdk9] Picked up JAVA_TOOL_OPTIONS: -Dmaven.ext.class.path="/home/jenkins/jenkins-slave/workspace/maven-plugin-testing_master-DVW6YN5BVVM46OW7TA3KT7FW4MNQLXDPGDLTWG6QD4JLKCSIG7YQ@tmp/withMavened6dd291/pipeline-maven-spy.jar"
-Dorg.jenkinsci.plugins.pipeline.maven.reportsFolder="/home/jenkins/jenkins-slave/workspace/maven-plugin-testing_master-DVW6YN5BVVM46OW7TA3KT7FW4MNQLXDPGDLTWG6QD4JLKCSIG7YQ@tmp/withMavened6dd291"

[linux-jdk9] Running org.apache.maven.shared.test.plugin.ProjectToolTest
[Pipeline] [linux-jdk7] }
[linux-jdk10] Using IT Plugin Jar: /home/jenkins/jenkins-slave/workspace/maven-plugin-testing_master-DVW6YN5BVVM46OW7TA3KT7FW4MNQLXDPGDLTWG6QD4JLKCSIG7YQ@2/m/maven-plugin-testing-tools/target/unit/projects/basic/target/it-build-target/maven-it-plugin-test.jar
[linux-jdk10] Using target/it-build-target and target/it-build-target/classes to build IT
version of plugin
[linux-jdk10] Now Building test version of the plugin...
[linux-jdk10] Using staged plugin-pom: /home/jenkins/jenkins-slave/workspace/maven-plugin-testing_master-DVW6YN5BVVM46OW7TA3KT7FW4MNQLXDPGDLTWG6QD4JLKCSIG7YQ@2/m/maven-plugin-testing-tools/target/unit/projects/basic/pom-test.xml
[linux-jdk7] [withMaven] artifactsPublisher - Archive artifact m/pom.xml under org/apache/maven/plugin-testing/maven-plugin-testing/3.3.1-SNAPSHOT/maven-plugin-testing-3.3.1-SNAPSHOT.pom
[linux-jdk7] [withMaven] artifactsPublisher - Archive artifact m/target/maven-plugin-testing-3.3.1-SNAPSHOT-site.xml
under org/apache/maven/plugin-testing/maven-plugin-testing/3.3.1-SNAPSHOT/maven-plugin-testing-3.3.1-SNAPSHOT-site.xml
[linux-jdk7] [withMaven] artifactsPublisher - Archive artifact m/maven-plugin-testing-harness/pom.xml
under org/apache/maven/plugin-testing/maven-plugin-testing-harness/3.3.1-SNAPSHOT/maven-plugin-testing-harness-3.3.1-SNAPSHOT.pom
[linux-jdk7] [withMaven] artifactsPublisher - Archive artifact m/maven-plugin-testing-harness/target/maven-plugin-testing-harness-3.3.1-SNAPSHOT.jar
under org/apache/maven/plugin-testing/maven-plugin-testing-harness/3.3.1-SNAPSHOT/maven-plugin-testing-harness-3.3.1-SNAPSHOT.jar
[linux-jdk7] [withMaven] artifactsPublisher - Archive artifact m/maven-plugin-testing-harness/target/maven-plugin-testing-harness-3.3.1-SNAPSHOT-sources.jar
under org/apache/maven/plugin-testing/maven-plugin-testing-harness/3.3.1-SNAPSHOT/maven-plugin-testing-harness-3.3.1-SNAPSHOT-sources.jar
[linux-jdk7] [withMaven] artifactsPublisher - Archive artifact m/maven-test-tools/pom.xml
under org/apache/maven/plugin-testing/maven-test-tools/3.3.1-SNAPSHOT/maven-test-tools-3.3.1-SNAPSHOT.pom
[linux-jdk7] [withMaven] artifactsPublisher - Archive artifact m/maven-test-tools/target/maven-test-tools-3.3.1-SNAPSHOT.jar
under org/apache/maven/plugin-testing/maven-test-tools/3.3.1-SNAPSHOT/maven-test-tools-3.3.1-SNAPSHOT.jar
[linux-jdk7] [withMaven] artifactsPublisher - Archive artifact m/maven-plugin-testing-tools/pom.xml
under org/apache/maven/plugin-testing/maven-plugin-testing-tools/3.3.1-SNAPSHOT/maven-plugin-testing-tools-3.3.1-SNAPSHOT.pom
[linux-jdk7] [withMaven] artifactsPublisher - Archive artifact m/maven-plugin-testing-tools/target/maven-plugin-testing-tools-3.3.1-SNAPSHOT.jar
under org/apache/maven/plugin-testing/maven-plugin-testing-tools/3.3.1-SNAPSHOT/maven-plugin-testing-tools-3.3.1-SNAPSHOT.jar
[linux-jdk7] [withMaven] junitPublisher - Archive test results for Maven artifact org.apache.maven.plugin-testing:maven-plugin-testing-harness:3.3.1-SNAPSHOT
generated by maven-surefire-plugin:test (default-test): m/maven-plugin-testing-harness/target/surefire-reports/*.xml
[linux-jdk7] Recording test results
[linux-jdk7] [withMaven] junitPublisher - Archive test results for Maven artifact org.apache.maven.plugin-testing:maven-test-tools:3.3.1-SNAPSHOT
generated by maven-surefire-plugin:test (default-test): m/maven-test-tools/target/surefire-reports/*.xml
[linux-jdk7] Recording test results
[linux-jdk7] None of the test reports contained any result
[linux-jdk7] [withMaven] junitPublisher - Archive test results for Maven artifact org.apache.maven.plugin-testing:maven-plugin-testing-tools:3.3.1-SNAPSHOT
generated by maven-surefire-plugin:test (default-test): m/maven-plugin-testing-tools/target/surefire-reports/*.xml
[linux-jdk7] Recording test results
[linux-jdk7] [withMaven] openTasksPublisher - Scan Tasks for Maven artifact org.apache.maven.plugin-testing:maven-plugin-testing-harness:3.3.1-SNAPSHOT
in source directory m/maven-plugin-testing-harness/src/main/java
[linux-jdk7] [withMaven] openTasksPublisher - Scan Tasks for Maven artifact org.apache.maven.plugin-testing:maven-test-tools:3.3.1-SNAPSHOT
in source directory m/maven-test-tools/src/main/java
[linux-jdk7] [withMaven] openTasksPublisher - Scan Tasks for Maven artifact org.apache.maven.plugin-testing:maven-plugin-testing-tools:3.3.1-SNAPSHOT
in source directory m/maven-plugin-testing-tools/src/main/java
[linux-jdk7] [TASKS] Scanning folder '/home/jenkins/jenkins-slave/workspace/maven-plugin-testing_master-DVW6YN5BVVM46OW7TA3KT7FW4MNQLXDPGDLTWG6QD4JLKCSIG7YQ'
for files matching the pattern 'm/maven-plugin-testing-harness/src/main/java/**/*,m/maven-test-tools/src/main/java/**/*,m/maven-plugin-testing-tools/src/main/java/**/*'
- excludes: null
[linux-jdk7] [TASKS] Found 25 files to scan for tasks
[linux-jdk7] [TASKS] Found 13 open tasks.
[linux-jdk7] Skipping warnings blame since pipelines do not have an SCM link.%n
[linux-jdk7] [TASKS] Computing warning deltas based on reference build #2
[linux-jdk7] [withMaven] artifactsPublisher - FAILURE to archive m/maven-plugin-testing-tools/target/unit/projects/basic/pom-test.xml
under org/apache/maven/its/plugins/maven-it-plugin/test/maven-it-plugin-test.pom, file not
found in workspace /home/jenkins/jenkins-slave/workspace/maven-plugin-testing_master-DVW6YN5BVVM46OW7TA3KT7FW4MNQLXDPGDLTWG6QD4JLKCSIG7YQ
[linux-jdk7] [withMaven] artifactsPublisher - Archive artifact m/maven-plugin-testing-tools/target/unit/projects/basic/target/it-build-target/maven-it-plugin-test.jar
under org/apache/maven/its/plugins/maven-it-plugin/test/maven-it-plugin-test.jar
[linux-jdk7] [withMaven] junitPublisher - Archive test results for Maven artifact org.apache.maven.its.plugins:maven-it-plugin:test
generated by maven-surefire-plugin:test (default-test): m/maven-plugin-testing-tools/target/unit/projects/basic/target/it-build-target/surefire-reports/*.xml
[linux-jdk7] Recording test results
[linux-jdk7] None of the test reports contained any result
[linux-jdk7] [withMaven] openTasksPublisher - Scan Tasks for Maven artifact org.apache.maven.its.plugins:maven-it-plugin:test
in source directory m/maven-plugin-testing-tools/target/unit/projects/basic/src/main/java
[linux-jdk7] [TASKS] Scanning folder '/home/jenkins/jenkins-slave/workspace/maven-plugin-testing_master-DVW6YN5BVVM46OW7TA3KT7FW4MNQLXDPGDLTWG6QD4JLKCSIG7YQ'
for files matching the pattern 'm/maven-plugin-testing-tools/target/unit/projects/basic/src/main/java/**/*'
- excludes: null
[linux-jdk7] [TASKS] Found 1 files to scan for tasks
[linux-jdk7] [TASKS] Found 0 open tasks.
[linux-jdk7] Skipping warnings blame since pipelines do not have an SCM link.%n
[linux-jdk7] [TASKS] Computing warning deltas based on reference build #2
[linux-jdk7] [withMaven] artifactsPublisher - FAILURE to archive m/maven-plugin-testing-tools/target/unit/projects/basic/pom-test.xml
under org/apache/maven/its/plugins/maven-it-plugin/test/maven-it-plugin-test.pom, file not
found in workspace /home/jenkins/jenkins-slave/workspace/maven-plugin-testing_master-DVW6YN5BVVM46OW7TA3KT7FW4MNQLXDPGDLTWG6QD4JLKCSIG7YQ
[linux-jdk7] [withMaven] artifactsPublisher - Archive artifact m/maven-plugin-testing-tools/target/unit/projects/basic/target/it-build-target/maven-it-plugin-test.jar
under org/apache/maven/its/plugins/maven-it-plugin/test/maven-it-plugin-test.jar
[linux-jdk7] [withMaven] junitPublisher - Archive test results for Maven artifact org.apache.maven.its.plugins:maven-it-plugin:test
generated by maven-surefire-plugin:test (default-test): m/maven-plugin-testing-tools/target/unit/projects/basic/target/it-build-target/surefire-reports/*.xml
[linux-jdk7] Recording test results
[linux-jdk7] None of the test reports contained any result
[linux-jdk7] [withMaven] openTasksPublisher - Scan Tasks for Maven artifact org.apache.maven.its.plugins:maven-it-plugin:test
in source directory m/maven-plugin-testing-tools/target/unit/projects/basic/src/main/java
[linux-jdk7] [TASKS] Scanning folder '/home/jenkins/jenkins-slave/workspace/maven-plugin-testing_master-DVW6YN5BVVM46OW7TA3KT7FW4MNQLXDPGDLTWG6QD4JLKCSIG7YQ'
for files matching the pattern 'm/maven-plugin-testing-tools/target/unit/projects/basic/src/main/java/**/*'
- excludes: null
[linux-jdk7] [TASKS] Found 1 files to scan for tasks
[linux-jdk7] [TASKS] Found 0 open tasks.
[linux-jdk7] Skipping warnings blame since pipelines do not have an SCM link.%n
[linux-jdk7] [TASKS] Computing warning deltas based on reference build #2
[Pipeline] [linux-jdk7] // withMaven
[Pipeline] [linux-jdk7] }
[Pipeline] [linux-jdk8] }
[Pipeline] [linux-jdk7] // stage
[Pipeline] [linux-jdk8] // dir
[linux-jdk9] Using target/it-build-target and target/it-build-target/classes to build IT version
of plugin
[linux-jdk9] Now Building test version of the plugin...
[linux-jdk9] Using staged plugin-pom: /home/jenkins/jenkins-slave/workspace/maven-plugin-testing_master-DVW6YN5BVVM46OW7TA3KT7FW4MNQLXDPGDLTWG6QD4JLKCSIG7YQ/m/maven-plugin-testing-tools/target/unit/projects/basic/pom-test.xml
[linux-jdk10] Using IT Plugin Jar: /home/jenkins/jenkins-slave/workspace/maven-plugin-testing_master-DVW6YN5BVVM46OW7TA3KT7FW4MNQLXDPGDLTWG6QD4JLKCSIG7YQ@2/m/maven-plugin-testing-tools/target/unit/projects/basic/target/it-build-target/maven-it-plugin-test.jar
[linux-jdk10] Using target/it-build-target and target/it-build-target/classes to build IT
version of plugin
[linux-jdk10] Tests run: 3, Failures: 1, Errors: 0, Skipped: 0, Time elapsed: 7.49 sec <<<
FAILURE! - in org.apache.maven.shared.test.plugin.ProjectToolTest
[linux-jdk10] testPackageProjectArtifact_ShouldPopulateWithCorrectArtifactAndMetadata(org.apache.maven.shared.test.plugin.ProjectToolTest)
 Time elapsed: 3.213 sec  <<< FAILURE!
[linux-jdk10] junit.framework.AssertionFailedError: Missing target/unit/projects/basic/target/it-build-target/maven-it-plugin-test.jar
[linux-jdk10] 	at junit.framework.Assert.fail(Assert.java:57)
[linux-jdk10] 	at junit.framework.Assert.assertTrue(Assert.java:22)
[linux-jdk10] 	at junit.framework.TestCase.assertTrue(TestCase.java:192)
[linux-jdk10] 	at org.apache.maven.shared.test.plugin.ProjectToolTest.testPackageProjectArtifact_ShouldPopulateWithCorrectArtifactAndMetadata(ProjectToolTest.java:99)
[linux-jdk10] 
[linux-jdk10] Running org.apache.maven.shared.test.plugin.RepositoryToolTest
[linux-jdk10] Tests run: 1, Failures: 0, Errors: 0, Skipped: 0, Time elapsed: 0.161 sec -
in org.apache.maven.shared.test.plugin.RepositoryToolTest
[linux-jdk10] 
[linux-jdk10] Results :
[linux-jdk10] 
[linux-jdk10] Failed tests: 
[linux-jdk10]   ProjectToolTest.testPackageProjectArtifact_ShouldPopulateWithCorrectArtifactAndMetadata:99
Missing target/unit/projects/basic/target/it-build-target/maven-it-plugin-test.jar
[linux-jdk10] 
[linux-jdk10] Tests run: 4, Failures: 1, Errors: 0, Skipped: 0
[linux-jdk10] 
[linux-jdk10] [ERROR] There are test failures.
[linux-jdk10] 
[linux-jdk10] Please refer to /home/jenkins/jenkins-slave/workspace/maven-plugin-testing_master-DVW6YN5BVVM46OW7TA3KT7FW4MNQLXDPGDLTWG6QD4JLKCSIG7YQ@2/m/maven-plugin-testing-tools/target/surefire-reports
for the individual test results.
[linux-jdk10] [INFO] 
[linux-jdk10] [INFO] --- maven-jar-plugin:2.4:jar (default-jar) @ maven-plugin-testing-tools
---
[linux-jdk10] [INFO] Building jar: /home/jenkins/jenkins-slave/workspace/maven-plugin-testing_master-DVW6YN5BVVM46OW7TA3KT7FW4MNQLXDPGDLTWG6QD4JLKCSIG7YQ@2/m/maven-plugin-testing-tools/target/maven-plugin-testing-tools-3.3.1-SNAPSHOT.jar
[linux-jdk10] [INFO] ------------------------------------------------------------------------
[linux-jdk10] [INFO] Reactor Summary:
[linux-jdk10] [INFO] 
[linux-jdk10] [INFO] Maven Plugin Testing ............................... SUCCESS [  6.694
s]
[linux-jdk10] [INFO] Maven Plugin Testing Mechanism ..................... SUCCESS [  8.639
s]
[linux-jdk10] [INFO] Maven Testing Tools ................................ SUCCESS [  0.255
s]
[linux-jdk10] [INFO] Maven Plugin Testing Tools ......................... SUCCESS [  9.062
s]
[linux-jdk10] [INFO] ------------------------------------------------------------------------
[linux-jdk10] [INFO] BUILD SUCCESS
[linux-jdk10] [INFO] ------------------------------------------------------------------------
[linux-jdk10] [INFO] Total time: 25.569 s
[linux-jdk10] [INFO] Finished at: 2018-07-02T15:42:25Z
[linux-jdk10] [INFO] Final Memory: 36M/228M
[linux-jdk10] [INFO] ------------------------------------------------------------------------
[linux-jdk10] [WARNING] The requested profile "run-its" could not be activated because it
does not exist.
[linux-jdk10] [INFO] [jenkins-event-spy] Generated /home/jenkins/jenkins-slave/workspace/maven-plugin-testing_master-DVW6YN5BVVM46OW7TA3KT7FW4MNQLXDPGDLTWG6QD4JLKCSIG7YQ@2@tmp/withMavene5d39bd0/maven-spy-20180702-154159-87916973595800154546772.log
[linux-jdk9] Using IT Plugin Jar: /home/jenkins/jenkins-slave/workspace/maven-plugin-testing_master-DVW6YN5BVVM46OW7TA3KT7FW4MNQLXDPGDLTWG6QD4JLKCSIG7YQ/m/maven-plugin-testing-tools/target/unit/projects/basic/target/it-build-target/maven-it-plugin-test.jar
[linux-jdk9] Using target/it-build-target and target/it-build-target/classes to build IT version
of plugin
[linux-jdk9] Now Building test version of the plugin...
[linux-jdk9] Using staged plugin-pom: /home/jenkins/jenkins-slave/workspace/maven-plugin-testing_master-DVW6YN5BVVM46OW7TA3KT7FW4MNQLXDPGDLTWG6QD4JLKCSIG7YQ/m/maven-plugin-testing-tools/target/unit/projects/basic/pom-test.xml
[linux-jdk9] Using IT Plugin Jar: /home/jenkins/jenkins-slave/workspace/maven-plugin-testing_master-DVW6YN5BVVM46OW7TA3KT7FW4MNQLXDPGDLTWG6QD4JLKCSIG7YQ/m/maven-plugin-testing-tools/target/unit/projects/basic/target/it-build-target/maven-it-plugin-test.jar
[linux-jdk9] Using target/it-build-target and target/it-build-target/classes to build IT version
of plugin
[linux-jdk9] Tests run: 3, Failures: 1, Errors: 0, Skipped: 0, Time elapsed: 10.505 sec <<<
FAILURE! - in org.apache.maven.shared.test.plugin.ProjectToolTest
[linux-jdk9] testPackageProjectArtifact_ShouldPopulateWithCorrectArtifactAndMetadata(org.apache.maven.shared.test.plugin.ProjectToolTest)
 Time elapsed: 4.404 sec  <<< FAILURE!
[linux-jdk9] junit.framework.AssertionFailedError: Missing target/unit/projects/basic/target/it-build-target/maven-it-plugin-test.jar
[linux-jdk9] 	at junit.framework.Assert.fail(Assert.java:57)
[linux-jdk9] 	at junit.framework.Assert.assertTrue(Assert.java:22)
[linux-jdk9] 	at junit.framework.TestCase.assertTrue(TestCase.java:192)
[linux-jdk9] 	at org.apache.maven.shared.test.plugin.ProjectToolTest.testPackageProjectArtifact_ShouldPopulateWithCorrectArtifactAndMetadata(ProjectToolTest.java:99)
[linux-jdk9] 
[linux-jdk9] Running org.apache.maven.shared.test.plugin.RepositoryToolTest
[linux-jdk9] Tests run: 1, Failures: 0, Errors: 0, Skipped: 0, Time elapsed: 0.199 sec - in
org.apache.maven.shared.test.plugin.RepositoryToolTest
[linux-jdk9] 
[linux-jdk9] Results :
[linux-jdk9] 
[linux-jdk9] Failed tests: 
[linux-jdk9]   ProjectToolTest.testPackageProjectArtifact_ShouldPopulateWithCorrectArtifactAndMetadata:99
Missing target/unit/projects/basic/target/it-build-target/maven-it-plugin-test.jar
[linux-jdk9] 
[linux-jdk9] Tests run: 4, Failures: 1, Errors: 0, Skipped: 0
[linux-jdk9] 
[linux-jdk9] [ERROR] There are test failures.
[linux-jdk9] 
[linux-jdk9] Please refer to /home/jenkins/jenkins-slave/workspace/maven-plugin-testing_master-DVW6YN5BVVM46OW7TA3KT7FW4MNQLXDPGDLTWG6QD4JLKCSIG7YQ/m/maven-plugin-testing-tools/target/surefire-reports
for the individual test results.
[linux-jdk9] [INFO] 
[linux-jdk9] [INFO] --- maven-jar-plugin:2.4:jar (default-jar) @ maven-plugin-testing-tools
---
[linux-jdk9] [INFO] Building jar: /home/jenkins/jenkins-slave/workspace/maven-plugin-testing_master-DVW6YN5BVVM46OW7TA3KT7FW4MNQLXDPGDLTWG6QD4JLKCSIG7YQ/m/maven-plugin-testing-tools/target/maven-plugin-testing-tools-3.3.1-SNAPSHOT.jar
[linux-jdk9] [INFO] ------------------------------------------------------------------------
[linux-jdk9] [INFO] Reactor Summary:
[linux-jdk9] [INFO] 
[linux-jdk9] [INFO] Maven Plugin Testing ............................... SUCCESS [  8.266
s]
[linux-jdk9] [INFO] Maven Plugin Testing Mechanism ..................... SUCCESS [ 11.375
s]
[linux-jdk9] [INFO] Maven Testing Tools ................................ SUCCESS [  0.480
s]
[linux-jdk9] [INFO] Maven Plugin Testing Tools ......................... SUCCESS [ 12.613
s]
[linux-jdk9] [INFO] ------------------------------------------------------------------------
[linux-jdk9] [INFO] BUILD SUCCESS
[linux-jdk9] [INFO] ------------------------------------------------------------------------
[linux-jdk9] [INFO] Total time: 34.160 s
[linux-jdk9] [INFO] Finished at: 2018-07-02T15:42:32Z
[linux-jdk9] [INFO] Final Memory: 49M/164M
[linux-jdk9] [INFO] ------------------------------------------------------------------------
[linux-jdk9] [WARNING] The requested profile "run-its" could not be activated because it does
not exist.
[linux-jdk9] [INFO] [jenkins-event-spy] Generated /home/jenkins/jenkins-slave/workspace/maven-plugin-testing_master-DVW6YN5BVVM46OW7TA3KT7FW4MNQLXDPGDLTWG6QD4JLKCSIG7YQ@tmp/withMavened6dd291/maven-spy-20180702-154158-33610089840110513221514.log
[Pipeline] [linux-jdk7] }
[Pipeline] [linux-jdk8] }
[linux-jdk8] [withMaven] junitPublisher - Archive test results for Maven artifact org.apache.maven.plugin-testing:maven-plugin-testing-harness:3.3.1-SNAPSHOT
generated by maven-surefire-plugin:test (default-test): m/maven-plugin-testing-harness/target/surefire-reports/*.xml
[linux-jdk8] Recording test results
[linux-jdk8] [withMaven] junitPublisher - Archive test results for Maven artifact org.apache.maven.plugin-testing:maven-test-tools:3.3.1-SNAPSHOT
generated by maven-surefire-plugin:test (default-test): m/maven-test-tools/target/surefire-reports/*.xml
[linux-jdk8] Recording test results
[linux-jdk8] None of the test reports contained any result
[linux-jdk8] [withMaven] junitPublisher - Archive test results for Maven artifact org.apache.maven.plugin-testing:maven-plugin-testing-tools:3.3.1-SNAPSHOT
generated by maven-surefire-plugin:test (default-test): m/maven-plugin-testing-tools/target/surefire-reports/*.xml
[linux-jdk8] Recording test results
[linux-jdk8] [withMaven] junitPublisher - Archive test results for Maven artifact org.apache.maven.its.plugins:maven-it-plugin:test
generated by maven-surefire-plugin:test (default-test): m/maven-plugin-testing-tools/target/unit/projects/basic/target/it-build-target/surefire-reports/*.xml
[linux-jdk8] Recording test results
[linux-jdk8] None of the test reports contained any result
[linux-jdk8] [withMaven] junitPublisher - Archive test results for Maven artifact org.apache.maven.its.plugins:maven-it-plugin:test
generated by maven-surefire-plugin:test (default-test): m/maven-plugin-testing-tools/target/unit/projects/basic/target/it-build-target/surefire-reports/*.xml
[linux-jdk8] Recording test results
[linux-jdk8] None of the test reports contained any result
[Pipeline] [linux-jdk7] // node
[Pipeline] [linux-jdk8] // withMaven
[Pipeline] [linux-jdk7] }
[Pipeline] [linux-jdk8] }
[Pipeline] [linux-jdk9] }
[Pipeline] [linux-jdk10] }
[Pipeline] [linux-jdk8] // stage
[Pipeline] [linux-jdk9] // dir
[Pipeline] [linux-jdk10] // dir
[Pipeline] [linux-jdk8] }
[Pipeline] [linux-jdk9] }
[linux-jdk9] [withMaven] junitPublisher - Archive test results for Maven artifact org.apache.maven.plugin-testing:maven-plugin-testing-harness:3.3.1-SNAPSHOT
generated by maven-surefire-plugin:test (default-test): m/maven-plugin-testing-harness/target/surefire-reports/*.xml
[linux-jdk9] Recording test results
[linux-jdk9] [withMaven] junitPublisher - Archive test results for Maven artifact org.apache.maven.plugin-testing:maven-test-tools:3.3.1-SNAPSHOT
generated by maven-surefire-plugin:test (default-test): m/maven-test-tools/target/surefire-reports/*.xml
[linux-jdk9] Recording test results
[linux-jdk9] None of the test reports contained any result
[linux-jdk9] [withMaven] junitPublisher - Archive test results for Maven artifact org.apache.maven.plugin-testing:maven-plugin-testing-tools:3.3.1-SNAPSHOT
generated by maven-surefire-plugin:test (default-test): m/maven-plugin-testing-tools/target/surefire-reports/*.xml
[linux-jdk9] Recording test results
[Pipeline] [linux-jdk10] }
[linux-jdk10] [withMaven] junitPublisher - Archive test results for Maven artifact org.apache.maven.plugin-testing:maven-plugin-testing-harness:3.3.1-SNAPSHOT
generated by maven-surefire-plugin:test (default-test): m/maven-plugin-testing-harness/target/surefire-reports/*.xml
[linux-jdk10] Recording test results
[linux-jdk10] [withMaven] junitPublisher - Archive test results for Maven artifact org.apache.maven.plugin-testing:maven-test-tools:3.3.1-SNAPSHOT
generated by maven-surefire-plugin:test (default-test): m/maven-test-tools/target/surefire-reports/*.xml
[linux-jdk10] Recording test results
[linux-jdk10] None of the test reports contained any result
[linux-jdk10] [withMaven] junitPublisher - Archive test results for Maven artifact org.apache.maven.plugin-testing:maven-plugin-testing-tools:3.3.1-SNAPSHOT
generated by maven-surefire-plugin:test (default-test): m/maven-plugin-testing-tools/target/surefire-reports/*.xml
[linux-jdk10] Recording test results
[Pipeline] [linux-jdk8] // node
[Pipeline] [linux-jdk9] // withMaven
[Pipeline] [linux-jdk10] // withMaven
[Pipeline] [linux-jdk8] }
[Pipeline] [linux-jdk9] }
[Pipeline] [linux-jdk10] }
[Pipeline] [linux-jdk9] // stage
[Pipeline] [linux-jdk10] // stage
[Pipeline] [linux-jdk9] }
[Pipeline] [linux-jdk10] }
[Pipeline] [linux-jdk9] // node
[Pipeline] [linux-jdk10] // node
[Pipeline] [linux-jdk9] }
[Pipeline] [linux-jdk10] }
[Pipeline] // parallel
[Pipeline] stage
[Pipeline] { (Notifications)
[Pipeline] echo
Build result: UNSTABLE
[Pipeline] jiraIssueSelector
[Pipeline] emailext
Mime
  • Unnamed multipart/mixed (inline, None, 0 bytes)
View raw message