maven-notifications mailing list archives

Site index · List index
Message view « Date » · « Thread »
Top « Date » · « Thread »
From Apache Jenkins Server <jenk...@builds.apache.org>
Subject Build failed in Jenkins: Maven TLP » maven-javadoc-plugin » Jenkins_investigation #2
Date Tue, 03 Jul 2018 04:03:35 GMT
See https://builds.apache.org/job/maven-box/job/maven-javadoc-plugin/job/Jenkins_investigation/2/

Changes:

* Stop commenting on INFRA tickets
* Add JDK 10 b37 (early access build) (Windows Only)
* Add JDK 10 (latest)
* Change JDK10 on Windows to 'JDK 10 b46 (Windows Only)'
* Add Java 11-ea
* Add jdkForMaven and mavenForJdk methods Use reqexp for version matching
* regex in switch/case are full match, not partial match
* Update JDKs
* Looks like the API has changed.
* Try to fix it.
* Add JDK 10 to the jdk default
* auto deploy if we are currently on master branch
* revert as it seems to fail on jenkins asf
* revert this one as well
* enable TLS 1.2 for Java 7
* TLSv1.x being deactivated since June. So only TLSv1.2 is valid for
* Add asfMavenTlpPlgnBuild to run plugins with multiple Maven versions
* Add maven version to stageId
* Add removeFromCollection() due to RejectedAccessException on
* Scripts not permitted to use method java.util.Collection stream
* Pass 'first'
* Ensure at least minimum required Java version is used
* builds.a.o doesn't have a Maven 3.1.x
* Pass 'failfast'
* Pass 'failingFast'
* Set https.protocols for Java7
* Make failingFast global variable
* Introduce a shared taskContext to keep track of failures
* Make taskContext accessible for try-catch
* Ensure tasks on the same Jenkins instance don't block each others
* dir('m') was used twice
* Also run site goal
* Remove unused parameter
* Disable site plan, doesn't work with multimodules

3 tests failed.
FAILED:  org.apache.maven.plugins.javadoc.FixJavadocMojoTest.testFix

Error Message:
Error when invoking Maven, consult the invoker log file: f:\jenkins\jenkins-slave\workspace\lugin_Jenkins_investigation-XMH53YEN2PKRRDIEGSSOM3JEJOBRY257ATPQFDZAASG7YO2URE4Q\m\target\invoker\FixJavadocMojoTest1718796143.txt

Stack Trace:
org.apache.maven.shared.invoker.MavenInvocationException: Error when invoking Maven, consult
the invoker log file: f:\jenkins\jenkins-slave\workspace\lugin_Jenkins_investigation-XMH53YEN2PKRRDIEGSSOM3JEJOBRY257ATPQFDZAASG7YO2URE4Q\m\target\invoker\FixJavadocMojoTest1718796143.txt
	at org.apache.maven.plugins.javadoc.FixJavadocMojoTest.invokeCompileGoal(FixJavadocMojoTest.java:662)
	at org.apache.maven.plugins.javadoc.FixJavadocMojoTest.executeMojoAndTest(FixJavadocMojoTest.java:619)
	at org.apache.maven.plugins.javadoc.FixJavadocMojoTest.testFix(FixJavadocMojoTest.java:141)


FAILED:  org.apache.maven.plugins.javadoc.FixJavadocMojoTest.testFixJdk5

Error Message:
Error when invoking Maven, consult the invoker log file: f:\jenkins\jenkins-slave\workspace\lugin_Jenkins_investigation-XMH53YEN2PKRRDIEGSSOM3JEJOBRY257ATPQFDZAASG7YO2URE4Q\m\target\invoker\FixJavadocMojoTest1657621076.txt

Stack Trace:
org.apache.maven.shared.invoker.MavenInvocationException: Error when invoking Maven, consult
the invoker log file: f:\jenkins\jenkins-slave\workspace\lugin_Jenkins_investigation-XMH53YEN2PKRRDIEGSSOM3JEJOBRY257ATPQFDZAASG7YO2URE4Q\m\target\invoker\FixJavadocMojoTest1657621076.txt
	at org.apache.maven.plugins.javadoc.FixJavadocMojoTest.invokeCompileGoal(FixJavadocMojoTest.java:662)
	at org.apache.maven.plugins.javadoc.FixJavadocMojoTest.executeMojoAndTest(FixJavadocMojoTest.java:619)
	at org.apache.maven.plugins.javadoc.FixJavadocMojoTest.testFixJdk5(FixJavadocMojoTest.java:159)


FAILED:  org.apache.maven.plugins.javadoc.FixJavadocMojoTest.testFixJdk6

Error Message:
Error when invoking Maven, consult the invoker log file: f:\jenkins\jenkins-slave\workspace\lugin_Jenkins_investigation-XMH53YEN2PKRRDIEGSSOM3JEJOBRY257ATPQFDZAASG7YO2URE4Q\m\target\invoker\FixJavadocMojoTest1763581774.txt

Stack Trace:
org.apache.maven.shared.invoker.MavenInvocationException: Error when invoking Maven, consult
the invoker log file: f:\jenkins\jenkins-slave\workspace\lugin_Jenkins_investigation-XMH53YEN2PKRRDIEGSSOM3JEJOBRY257ATPQFDZAASG7YO2URE4Q\m\target\invoker\FixJavadocMojoTest1763581774.txt
	at org.apache.maven.plugins.javadoc.FixJavadocMojoTest.invokeCompileGoal(FixJavadocMojoTest.java:662)
	at org.apache.maven.plugins.javadoc.FixJavadocMojoTest.executeMojoAndTest(FixJavadocMojoTest.java:619)
	at org.apache.maven.plugins.javadoc.FixJavadocMojoTest.testFixJdk6(FixJavadocMojoTest.java:170)




Build log:
[...truncated 1.04 MB...]
[windows-jdk7] [INFO] ..SKIPPED due to JRE version
[windows-jdk7] [INFO] Building: MJAVADOC-498_modulepath\pom.xml
[windows-jdk7] [INFO] ..SKIPPED due to JRE version
[windows-jdk7] [INFO] Building: MJAVADOC-508\pom.xml
[windows-jdk9] [WARNING] Javadoc Warnings
[windows-jdk9] [WARNING] Picked up JAVA_TOOL_OPTIONS: -Dmaven.ext.class.path="f:\jenkins\jenkins-slave\workspace\lugin_Jenkins_investigation-XMH53YEN2PKRRDIEGSSOM3JEJOBRY257ATPQFDZAASG7YO2URE4Q@tmp\withMaven8c8642c1\pipeline-maven-spy.jar"
-Dorg.jenkinsci.plugins.pipeline.maven.reportsFolder="f:\jenkins\jenkins-slave\workspace\lugin_Jenkins_investigation-XMH53YEN2PKRRDIEGSSOM3JEJOBRY257ATPQFDZAASG7YO2URE4Q@tmp\withMaven8c8642c1"
[windows-jdk9] [INFO] Building jar: f:\jenkins\jenkins-slave\workspace\lugin_Jenkins_investigation-XMH53YEN2PKRRDIEGSSOM3JEJOBRY257ATPQFDZAASG7YO2URE4Q\m\target\test\unit\javadocjar-failonerror\target\javadocjar-failonerror-javadoc.jar
[windows-jdk9] stderr: Picked up JAVA_TOOL_OPTIONS: -Dmaven.ext.class.path="f:\jenkins\jenkins-slave\workspace\lugin_Jenkins_investigation-XMH53YEN2PKRRDIEGSSOM3JEJOBRY257ATPQFDZAASG7YO2URE4Q@tmp\withMaven8c8642c1\pipeline-maven-spy.jar"
-Dorg.jenkinsci.plugins.pipeline.maven.reportsFolder="f:\jenkins\jenkins-slave\workspace\lugin_Jenkins_investigation-XMH53YEN2PKRRDIEGSSOM3JEJOBRY257ATPQFDZAASG7YO2URE4Q@tmp\withMaven8c8642c1"

[windows-jdk9] java version "9.0.1"
[windows-jdk9] Java(TM) SE Runtime Environment (build 9.0.1+11)
[windows-jdk9] Java HotSpot(TM) 64-Bit Server VM (build 9.0.1+11, mixed mode)
[windows-jdk9] [WARNING] Javadoc Warnings
[windows-jdk9] [WARNING] Picked up JAVA_TOOL_OPTIONS: -Dmaven.ext.class.path="f:\jenkins\jenkins-slave\workspace\lugin_Jenkins_investigation-XMH53YEN2PKRRDIEGSSOM3JEJOBRY257ATPQFDZAASG7YO2URE4Q@tmp\withMaven8c8642c1\pipeline-maven-spy.jar"
-Dorg.jenkinsci.plugins.pipeline.maven.reportsFolder="f:\jenkins\jenkins-slave\workspace\lugin_Jenkins_investigation-XMH53YEN2PKRRDIEGSSOM3JEJOBRY257ATPQFDZAASG7YO2URE4Q@tmp\withMaven8c8642c1"
[windows-jdk9] [INFO] Building jar: f:\jenkins\jenkins-slave\workspace\lugin_Jenkins_investigation-XMH53YEN2PKRRDIEGSSOM3JEJOBRY257ATPQFDZAASG7YO2URE4Q\m\target\test\unit\javadocjar-archive-config\target\javadocjar-archive-config-javadoc.jar
[windows-jdk9] stderr: Picked up JAVA_TOOL_OPTIONS: -Dmaven.ext.class.path="f:\jenkins\jenkins-slave\workspace\lugin_Jenkins_investigation-XMH53YEN2PKRRDIEGSSOM3JEJOBRY257ATPQFDZAASG7YO2URE4Q@tmp\withMaven8c8642c1\pipeline-maven-spy.jar"
-Dorg.jenkinsci.plugins.pipeline.maven.reportsFolder="f:\jenkins\jenkins-slave\workspace\lugin_Jenkins_investigation-XMH53YEN2PKRRDIEGSSOM3JEJOBRY257ATPQFDZAASG7YO2URE4Q@tmp\withMaven8c8642c1"

[windows-jdk9] java version "9.0.1"
[windows-jdk9] Java(TM) SE Runtime Environment (build 9.0.1+11)
[windows-jdk9] Java HotSpot(TM) 64-Bit Server VM (build 9.0.1+11, mixed mode)
[windows-jdk8] [INFO] run script verify.bsh
[windows-jdk8] [INFO] ..SUCCESS (26.1 s)
[windows-jdk8] [INFO] Building: dependencySource-3\pom.xml
[windows-jdk9] [WARNING] Javadoc Warnings
[windows-jdk9] [WARNING] Picked up JAVA_TOOL_OPTIONS: -Dmaven.ext.class.path="f:\jenkins\jenkins-slave\workspace\lugin_Jenkins_investigation-XMH53YEN2PKRRDIEGSSOM3JEJOBRY257ATPQFDZAASG7YO2URE4Q@tmp\withMaven8c8642c1\pipeline-maven-spy.jar"
-Dorg.jenkinsci.plugins.pipeline.maven.reportsFolder="f:\jenkins\jenkins-slave\workspace\lugin_Jenkins_investigation-XMH53YEN2PKRRDIEGSSOM3JEJOBRY257ATPQFDZAASG7YO2URE4Q@tmp\withMaven8c8642c1"
[windows-jdk9] Tests run: 4, Failures: 0, Errors: 0, Skipped: 0, Time elapsed: 10.981 sec
- in org.apache.maven.plugins.javadoc.JavadocJarTest
[windows-jdk9] Running org.apache.maven.plugins.javadoc.JavadocReportTest
[windows-jdk9] stderr: Picked up JAVA_TOOL_OPTIONS: -Dmaven.ext.class.path="f:\jenkins\jenkins-slave\workspace\lugin_Jenkins_investigation-XMH53YEN2PKRRDIEGSSOM3JEJOBRY257ATPQFDZAASG7YO2URE4Q@tmp\withMaven8c8642c1\pipeline-maven-spy.jar"
-Dorg.jenkinsci.plugins.pipeline.maven.reportsFolder="f:\jenkins\jenkins-slave\workspace\lugin_Jenkins_investigation-XMH53YEN2PKRRDIEGSSOM3JEJOBRY257ATPQFDZAASG7YO2URE4Q@tmp\withMaven8c8642c1"

[windows-jdk9] java version "9.0.1"
[windows-jdk9] Java(TM) SE Runtime Environment (build 9.0.1+11)
[windows-jdk9] Java HotSpot(TM) 64-Bit Server VM (build 9.0.1+11, mixed mode)
[windows-jdk7] [INFO] ..SUCCESS (7.0 s)
[windows-jdk7] [INFO] Building: site-failOnError\pom.xml
[windows-jdk9] [WARNING] Javadoc Warnings
[windows-jdk9] [WARNING] Picked up JAVA_TOOL_OPTIONS: -Dmaven.ext.class.path="f:\jenkins\jenkins-slave\workspace\lugin_Jenkins_investigation-XMH53YEN2PKRRDIEGSSOM3JEJOBRY257ATPQFDZAASG7YO2URE4Q@tmp\withMaven8c8642c1\pipeline-maven-spy.jar"
-Dorg.jenkinsci.plugins.pipeline.maven.reportsFolder="f:\jenkins\jenkins-slave\workspace\lugin_Jenkins_investigation-XMH53YEN2PKRRDIEGSSOM3JEJOBRY257ATPQFDZAASG7YO2URE4Q@tmp\withMaven8c8642c1"
[windows-jdk9] [WARNING] javadoc: warning - The old Doclet and Taglet APIs in the packages
[windows-jdk9] [WARNING] com.sun.javadoc, com.sun.tools.doclets and their implementations
[windows-jdk9] [WARNING] are planned to be removed in a future JDK release. These
[windows-jdk9] [WARNING] components have been superseded by the new APIs in jdk.javadoc.doclet.
[windows-jdk9] [WARNING] Users are strongly recommended to migrate to the new APIs.
[windows-jdk9] stderr: Picked up JAVA_TOOL_OPTIONS: -Dmaven.ext.class.path="f:\jenkins\jenkins-slave\workspace\lugin_Jenkins_investigation-XMH53YEN2PKRRDIEGSSOM3JEJOBRY257ATPQFDZAASG7YO2URE4Q@tmp\withMaven8c8642c1\pipeline-maven-spy.jar"
-Dorg.jenkinsci.plugins.pipeline.maven.reportsFolder="f:\jenkins\jenkins-slave\workspace\lugin_Jenkins_investigation-XMH53YEN2PKRRDIEGSSOM3JEJOBRY257ATPQFDZAASG7YO2URE4Q@tmp\withMaven8c8642c1"

[windows-jdk9] java version "9.0.1"
[windows-jdk9] Java(TM) SE Runtime Environment (build 9.0.1+11)
[windows-jdk9] Java HotSpot(TM) 64-Bit Server VM (build 9.0.1+11, mixed mode)
[windows-jdk7] [INFO] ..FAILED (5.7 s)
[windows-jdk7] [INFO]   The build exited with code 1. See f:\jenkins\jenkins-slave\workspace\lugin_Jenkins_investigation-XMH53YEN2PKRRDIEGSSOM3JEJOBRY257ATPQFDZAASG7YO2URE4Q\m\target\it\site-failOnError\build.log
for details.
[windows-jdk7] [INFO] 
[windows-jdk7] [INFO] --- mrm-maven-plugin:1.1.0:stop (repository) @ maven-javadoc-plugin
---
[windows-jdk7] [INFO] Stopping Mock Repository Manager on http://localhost:65460
[windows-jdk7] [INFO] Stopped SocketConnector@0.0.0.0:65460
[windows-jdk7] [INFO] Mock Repository Manager http://localhost:65460 is stopped.
[windows-jdk7] [INFO] 
[windows-jdk7] [INFO] --- mrm-maven-plugin:1.1.0:stop (3rdparty) @ maven-javadoc-plugin ---
[windows-jdk7] [INFO] Stopping Mock Repository Manager on http://localhost:65461
[windows-jdk7] [INFO] Stopped SocketConnector@0.0.0.0:65461
[windows-jdk7] [INFO] Mock Repository Manager http://localhost:65461 is stopped.
[windows-jdk7] [INFO] 
[windows-jdk7] [INFO] --- maven-checkstyle-plugin:2.15:check (checkstyle-check) @ maven-javadoc-plugin
---
[windows-jdk7] [INFO] Downloading: https://repo.maven.apache.org/maven2/org/apache/maven/shared/maven-shared-resources/2/maven-shared-resources-2.pom
[windows-jdk7] [INFO] Downloaded: https://repo.maven.apache.org/maven2/org/apache/maven/shared/maven-shared-resources/2/maven-shared-resources-2.pom
(3.0 kB at 328 kB/s)
[windows-jdk7] [INFO] Downloading: https://repo.maven.apache.org/maven2/org/codehaus/plexus/plexus-utils/3.0.10/plexus-utils-3.0.10.pom
[windows-jdk7] [INFO] Downloaded: https://repo.maven.apache.org/maven2/org/codehaus/plexus/plexus-utils/3.0.10/plexus-utils-3.0.10.pom
(3.1 kB at 393 kB/s)
[windows-jdk7] [INFO] Downloading: https://repo.maven.apache.org/maven2/org/apache/maven/doxia/doxia-integration-tools/1.6/doxia-integration-tools-1.6.pom
[windows-jdk7] [INFO] Downloaded: https://repo.maven.apache.org/maven2/org/apache/maven/doxia/doxia-integration-tools/1.6/doxia-integration-tools-1.6.pom
(7.0 kB at 994 kB/s)
[windows-jdk7] [INFO] Downloading: https://repo.maven.apache.org/maven2/org/apache/maven/doxia/doxia-tools/3/doxia-tools-3.pom
[windows-jdk7] [INFO] Downloaded: https://repo.maven.apache.org/maven2/org/apache/maven/doxia/doxia-tools/3/doxia-tools-3.pom
(9.9 kB at 709 kB/s)
[windows-jdk7] [INFO] Downloading: https://repo.maven.apache.org/maven2/org/apache/maven/doxia/doxia-logging-api/1.6/doxia-logging-api-1.6.pom
[windows-jdk7] [INFO] Downloaded: https://repo.maven.apache.org/maven2/org/apache/maven/doxia/doxia-logging-api/1.6/doxia-logging-api-1.6.pom
(1.5 kB at 192 kB/s)
[windows-jdk7] [INFO] Downloading: https://repo.maven.apache.org/maven2/org/apache/maven/doxia/doxia/1.6/doxia-1.6.pom
[windows-jdk7] [INFO] Downloaded: https://repo.maven.apache.org/maven2/org/apache/maven/doxia/doxia/1.6/doxia-1.6.pom
(19 kB at 2.7 MB/s)
[windows-jdk9] [WARNING] Javadoc Warnings
[windows-jdk9] [WARNING] Picked up JAVA_TOOL_OPTIONS: -Dmaven.ext.class.path="f:\jenkins\jenkins-slave\workspace\lugin_Jenkins_investigation-XMH53YEN2PKRRDIEGSSOM3JEJOBRY257ATPQFDZAASG7YO2URE4Q@tmp\withMaven8c8642c1\pipeline-maven-spy.jar"
-Dorg.jenkinsci.plugins.pipeline.maven.reportsFolder="f:\jenkins\jenkins-slave\workspace\lugin_Jenkins_investigation-XMH53YEN2PKRRDIEGSSOM3JEJOBRY257ATPQFDZAASG7YO2URE4Q@tmp\withMaven8c8642c1"
[windows-jdk9] [WARNING] javadoc: warning - The old Doclet and Taglet APIs in the packages
[windows-jdk9] [WARNING] com.sun.javadoc, com.sun.tools.doclets and their implementations
[windows-jdk9] [WARNING] are planned to be removed in a future JDK release. These
[windows-jdk9] [WARNING] components have been superseded by the new APIs in jdk.javadoc.doclet.
[windows-jdk9] [WARNING] Users are strongly recommended to migrate to the new APIs.
[windows-jdk9] stderr: Picked up JAVA_TOOL_OPTIONS: -Dmaven.ext.class.path="f:\jenkins\jenkins-slave\workspace\lugin_Jenkins_investigation-XMH53YEN2PKRRDIEGSSOM3JEJOBRY257ATPQFDZAASG7YO2URE4Q@tmp\withMaven8c8642c1\pipeline-maven-spy.jar"
-Dorg.jenkinsci.plugins.pipeline.maven.reportsFolder="f:\jenkins\jenkins-slave\workspace\lugin_Jenkins_investigation-XMH53YEN2PKRRDIEGSSOM3JEJOBRY257ATPQFDZAASG7YO2URE4Q@tmp\withMaven8c8642c1"

[windows-jdk9] java version "9.0.1"
[windows-jdk9] Java(TM) SE Runtime Environment (build 9.0.1+11)
[windows-jdk9] Java HotSpot(TM) 64-Bit Server VM (build 9.0.1+11, mixed mode)
[windows-jdk7] [INFO] Downloading: https://repo.maven.apache.org/maven2/org/apache/maven/doxia/doxia-decoration-model/1.6/doxia-decoration-model-1.6.pom
[windows-jdk7] [INFO] Downloaded: https://repo.maven.apache.org/maven2/org/apache/maven/doxia/doxia-decoration-model/1.6/doxia-decoration-model-1.6.pom
(3.0 kB at 333 kB/s)
[windows-jdk7] [INFO] Downloading: https://repo.maven.apache.org/maven2/org/apache/maven/doxia/doxia-sitetools/1.6/doxia-sitetools-1.6.pom
[windows-jdk7] [INFO] Downloaded: https://repo.maven.apache.org/maven2/org/apache/maven/doxia/doxia-sitetools/1.6/doxia-sitetools-1.6.pom
(18 kB at 2.6 MB/s)
[windows-jdk7] [INFO] Downloading: https://repo.maven.apache.org/maven2/org/codehaus/plexus/plexus-resources/1.0.1/plexus-resources-1.0.1.pom
[windows-jdk7] [INFO] Downloaded: https://repo.maven.apache.org/maven2/org/codehaus/plexus/plexus-resources/1.0.1/plexus-resources-1.0.1.pom
(1.3 kB at 165 kB/s)
[windows-jdk7] [INFO] Downloading: https://repo.maven.apache.org/maven2/com/puppycrawl/tools/checkstyle/6.1.1/checkstyle-6.1.1.pom
[windows-jdk7] [INFO] Downloaded: https://repo.maven.apache.org/maven2/com/puppycrawl/tools/checkstyle/6.1.1/checkstyle-6.1.1.pom
(30 kB at 2.3 MB/s)
[windows-jdk7] [INFO] Downloading: https://repo.maven.apache.org/maven2/org/sonatype/oss/oss-parent/7/oss-parent-7.pom
[windows-jdk7] [INFO] Downloaded: https://repo.maven.apache.org/maven2/org/sonatype/oss/oss-parent/7/oss-parent-7.pom
(4.8 kB at 689 kB/s)
[windows-jdk7] [INFO] Downloading: https://repo.maven.apache.org/maven2/org/antlr/antlr4-runtime/4.3/antlr4-runtime-4.3.pom
[windows-jdk7] [INFO] Downloaded: https://repo.maven.apache.org/maven2/org/antlr/antlr4-runtime/4.3/antlr4-runtime-4.3.pom
(4.8 kB at 599 kB/s)
[windows-jdk7] [INFO] Downloading: https://repo.maven.apache.org/maven2/org/antlr/antlr4-master/4.3/antlr4-master-4.3.pom
[windows-jdk7] [INFO] Downloaded: https://repo.maven.apache.org/maven2/org/antlr/antlr4-master/4.3/antlr4-master-4.3.pom
(7.9 kB at 396 kB/s)
[windows-jdk7] [INFO] Downloading: https://repo.maven.apache.org/maven2/org/abego/treelayout/org.abego.treelayout.core/1.0.1/org.abego.treelayout.core-1.0.1.pom
[windows-jdk7] [INFO] Downloaded: https://repo.maven.apache.org/maven2/org/abego/treelayout/org.abego.treelayout.core/1.0.1/org.abego.treelayout.core-1.0.1.pom
(3.1 kB at 239 kB/s)
[windows-jdk7] [INFO] Downloading: https://repo.maven.apache.org/maven2/org/antlr/antlr4-annotations/4.3/antlr4-annotations-4.3.pom
[windows-jdk7] [INFO] Downloaded: https://repo.maven.apache.org/maven2/org/antlr/antlr4-annotations/4.3/antlr4-annotations-4.3.pom
(1.3 kB at 159 kB/s)
[windows-jdk7] [INFO] Downloading: https://repo.maven.apache.org/maven2/commons-beanutils/commons-beanutils-core/1.8.3/commons-beanutils-core-1.8.3.pom
[windows-jdk7] [INFO] Downloaded: https://repo.maven.apache.org/maven2/commons-beanutils/commons-beanutils-core/1.8.3/commons-beanutils-core-1.8.3.pom
(1.6 kB at 182 kB/s)
[windows-jdk7] [INFO] Downloading: https://repo.maven.apache.org/maven2/com/google/guava/guava/18.0/guava-18.0.pom
[windows-jdk7] [INFO] Downloaded: https://repo.maven.apache.org/maven2/com/google/guava/guava/18.0/guava-18.0.pom
(5.7 kB at 333 kB/s)
[windows-jdk7] [INFO] Downloading: https://repo.maven.apache.org/maven2/com/google/guava/guava-parent/18.0/guava-parent-18.0.pom
[windows-jdk7] [INFO] Downloaded: https://repo.maven.apache.org/maven2/com/google/guava/guava-parent/18.0/guava-parent-18.0.pom
(7.7 kB at 961 kB/s)
[windows-jdk7] [INFO] Downloading: https://repo.maven.apache.org/maven2/com/puppycrawl/tools/checkstyle/6.1.1/checkstyle-6.1.1.jar
[windows-jdk7] [INFO] Downloading: https://repo.maven.apache.org/maven2/org/codehaus/plexus/plexus-resources/1.0.1/plexus-resources-1.0.1.jar
[windows-jdk7] [INFO] Downloading: https://repo.maven.apache.org/maven2/org/apache/maven/doxia/doxia-integration-tools/1.6/doxia-integration-tools-1.6.jar
[windows-jdk7] [INFO] Downloading: https://repo.maven.apache.org/maven2/org/antlr/antlr4-runtime/4.3/antlr4-runtime-4.3.jar
[windows-jdk7] [INFO] Downloading: https://repo.maven.apache.org/maven2/org/apache/maven/shared/maven-shared-resources/2/maven-shared-resources-2.jar
[windows-jdk7] [INFO] Downloaded: https://repo.maven.apache.org/maven2/org/apache/maven/shared/maven-shared-resources/2/maven-shared-resources-2.jar
(13 kB at 192 kB/s)
[windows-jdk7] [INFO] Downloading: https://repo.maven.apache.org/maven2/org/abego/treelayout/org.abego.treelayout.core/1.0.1/org.abego.treelayout.core-1.0.1.jar
[windows-jdk7] [INFO] Downloaded: https://repo.maven.apache.org/maven2/org/antlr/antlr4-runtime/4.3/antlr4-runtime-4.3.jar
(345 kB at 5.1 MB/s)
[windows-jdk7] [INFO] Downloading: https://repo.maven.apache.org/maven2/org/antlr/antlr4-annotations/4.3/antlr4-annotations-4.3.jar
[windows-jdk7] [INFO] Downloaded: https://repo.maven.apache.org/maven2/org/apache/maven/doxia/doxia-integration-tools/1.6/doxia-integration-tools-1.6.jar
(45 kB at 629 kB/s)
[windows-jdk7] [INFO] Downloading: https://repo.maven.apache.org/maven2/commons-beanutils/commons-beanutils-core/1.8.3/commons-beanutils-core-1.8.3.jar
[windows-jdk7] [INFO] Downloaded: https://repo.maven.apache.org/maven2/org/abego/treelayout/org.abego.treelayout.core/1.0.1/org.abego.treelayout.core-1.0.1.jar
(26 kB at 300 kB/s)
[windows-jdk7] [INFO] Downloading: https://repo.maven.apache.org/maven2/com/google/guava/guava/18.0/guava-18.0.jar
[windows-jdk7] [INFO] Downloaded: https://repo.maven.apache.org/maven2/org/codehaus/plexus/plexus-resources/1.0.1/plexus-resources-1.0.1.jar
(22 kB at 206 kB/s)
[windows-jdk7] [INFO] Downloading: https://repo.maven.apache.org/maven2/commons-lang/commons-lang/2.1/commons-lang-2.1.jar
[windows-jdk7] [INFO] Downloaded: https://repo.maven.apache.org/maven2/commons-lang/commons-lang/2.1/commons-lang-2.1.jar
(208 kB at 1.5 MB/s)
[windows-jdk7] [INFO] Downloaded: https://repo.maven.apache.org/maven2/org/antlr/antlr4-annotations/4.3/antlr4-annotations-4.3.jar
(10 kB at 71 kB/s)
[windows-jdk7] [INFO] Downloaded: https://repo.maven.apache.org/maven2/com/puppycrawl/tools/checkstyle/6.1.1/checkstyle-6.1.1.jar
(1.0 MB at 7.0 MB/s)
[windows-jdk7] [INFO] Downloaded: https://repo.maven.apache.org/maven2/com/google/guava/guava/18.0/guava-18.0.jar
(2.3 MB at 15 MB/s)
[windows-jdk7] [INFO] Downloaded: https://repo.maven.apache.org/maven2/commons-beanutils/commons-beanutils-core/1.8.3/commons-beanutils-core-1.8.3.jar
(207 kB at 1.4 MB/s)
[windows-jdk9] [WARNING] Javadoc Warnings
[windows-jdk9] [WARNING] Picked up JAVA_TOOL_OPTIONS: -Dmaven.ext.class.path="f:\jenkins\jenkins-slave\workspace\lugin_Jenkins_investigation-XMH53YEN2PKRRDIEGSSOM3JEJOBRY257ATPQFDZAASG7YO2URE4Q@tmp\withMaven8c8642c1\pipeline-maven-spy.jar"
-Dorg.jenkinsci.plugins.pipeline.maven.reportsFolder="f:\jenkins\jenkins-slave\workspace\lugin_Jenkins_investigation-XMH53YEN2PKRRDIEGSSOM3JEJOBRY257ATPQFDZAASG7YO2URE4Q@tmp\withMaven8c8642c1"
[windows-jdk9] stderr: Picked up JAVA_TOOL_OPTIONS: -Dmaven.ext.class.path="f:\jenkins\jenkins-slave\workspace\lugin_Jenkins_investigation-XMH53YEN2PKRRDIEGSSOM3JEJOBRY257ATPQFDZAASG7YO2URE4Q@tmp\withMaven8c8642c1\pipeline-maven-spy.jar"
-Dorg.jenkinsci.plugins.pipeline.maven.reportsFolder="f:\jenkins\jenkins-slave\workspace\lugin_Jenkins_investigation-XMH53YEN2PKRRDIEGSSOM3JEJOBRY257ATPQFDZAASG7YO2URE4Q@tmp\withMaven8c8642c1"

[windows-jdk9] java version "9.0.1"
[windows-jdk9] Java(TM) SE Runtime Environment (build 9.0.1+11)
[windows-jdk9] Java HotSpot(TM) 64-Bit Server VM (build 9.0.1+11, mixed mode)
[windows-jdk7] [INFO] There are 8 errors reported by Checkstyle 6.1.1 with config/maven_checks.xml
ruleset.
[windows-jdk7] [ERROR] src\main\java\org\apache\maven\plugins\javadoc\JavadocUtil.java[543:30]
(whitespace) WhitespaceAround: '=' is not preceded with whitespace.
[windows-jdk7] [ERROR] src\main\java\org\apache\maven\plugins\javadoc\JavadocUtil.java[545:13]
(blocks) AvoidNestedBlocks: Avoid nested blocks.
[windows-jdk7] [ERROR] src\main\java\org\apache\maven\plugins\javadoc\JavadocUtil.java[552:30]
(whitespace) WhitespaceAround: '=' is not preceded with whitespace.
[windows-jdk7] [ERROR] src\main\java\org\apache\maven\plugins\javadoc\JavadocUtil.java[554:13]
(blocks) AvoidNestedBlocks: Avoid nested blocks.
[windows-jdk7] [INFO] Ignored 4 errors, 4 violations remaining.
[windows-jdk7] [INFO] ------------------------------------------------------------------------
[windows-jdk7] [INFO] BUILD FAILURE
[windows-jdk7] [INFO] ------------------------------------------------------------------------
[windows-jdk7] [INFO] Total time: 05:52 min
[windows-jdk7] [INFO] Finished at: 2018-07-03T04:03:18Z
[windows-jdk9] [WARNING] Javadoc Warnings
[windows-jdk9] [WARNING] Picked up JAVA_TOOL_OPTIONS: -Dmaven.ext.class.path="f:\jenkins\jenkins-slave\workspace\lugin_Jenkins_investigation-XMH53YEN2PKRRDIEGSSOM3JEJOBRY257ATPQFDZAASG7YO2URE4Q@tmp\withMaven8c8642c1\pipeline-maven-spy.jar"
-Dorg.jenkinsci.plugins.pipeline.maven.reportsFolder="f:\jenkins\jenkins-slave\workspace\lugin_Jenkins_investigation-XMH53YEN2PKRRDIEGSSOM3JEJOBRY257ATPQFDZAASG7YO2URE4Q@tmp\withMaven8c8642c1"
[windows-jdk7] [INFO] Final Memory: 58M/1161M
[windows-jdk7] [INFO] ------------------------------------------------------------------------
[windows-jdk7] [INFO] [jenkins-event-spy] Generated F:\jenkins\jenkins-slave\workspace\lugin_Jenkins_investigation-XMH53YEN2PKRRDIEGSSOM3JEJOBRY257ATPQFDZAASG7YO2URE4Q@tmp\withMaven779fad7b\maven-spy-20180703-035724-7384447287789931769500.log
[windows-jdk7] [ERROR] Failed to execute goal org.apache.maven.plugins:maven-checkstyle-plugin:2.15:check
(checkstyle-check) on project maven-javadoc-plugin: You have 4 Checkstyle violations. ->
[Help 1]
[windows-jdk7] [ERROR] 
[windows-jdk7] [ERROR] To see the full stack trace of the errors, re-run Maven with the -e
switch.
[windows-jdk7] [ERROR] Re-run Maven using the -X switch to enable full debug logging.
[windows-jdk7] [ERROR] 
[windows-jdk7] [ERROR] For more information about the errors and possible solutions, please
read the following articles:
[windows-jdk7] [ERROR] [Help 1] http://cwiki.apache.org/confluence/display/MAVEN/MojoFailureException
[windows-jdk7] Picked up JAVA_TOOL_OPTIONS: -Dmaven.ext.class.path="f:\jenkins\jenkins-slave\workspace\lugin_Jenkins_investigation-XMH53YEN2PKRRDIEGSSOM3JEJOBRY257ATPQFDZAASG7YO2URE4Q@tmp\withMaven779fad7b\pipeline-maven-spy.jar"
-Dorg.jenkinsci.plugins.pipeline.maven.reportsFolder="f:\jenkins\jenkins-slave\workspace\lugin_Jenkins_investigation-XMH53YEN2PKRRDIEGSSOM3JEJOBRY257ATPQFDZAASG7YO2URE4Q@tmp\withMaven779fad7b"

[windows-jdk9] stderr: Picked up JAVA_TOOL_OPTIONS: -Dmaven.ext.class.path="f:\jenkins\jenkins-slave\workspace\lugin_Jenkins_investigation-XMH53YEN2PKRRDIEGSSOM3JEJOBRY257ATPQFDZAASG7YO2URE4Q@tmp\withMaven8c8642c1\pipeline-maven-spy.jar"
-Dorg.jenkinsci.plugins.pipeline.maven.reportsFolder="f:\jenkins\jenkins-slave\workspace\lugin_Jenkins_investigation-XMH53YEN2PKRRDIEGSSOM3JEJOBRY257ATPQFDZAASG7YO2URE4Q@tmp\withMaven8c8642c1"

[windows-jdk9] java version "9.0.1"
[windows-jdk9] Java(TM) SE Runtime Environment (build 9.0.1+11)
[windows-jdk9] Java HotSpot(TM) 64-Bit Server VM (build 9.0.1+11, mixed mode)
[windows-jdk9] [ERROR] ProjectBuildingException for Mock for Artifact, hashCode: 2006395236:
Error resolving project artifact: Could not find artifact commons-logging:commons-logging:pom:1.1.1
for project null
[Pipeline] [windows-jdk7] }
[Pipeline] [windows-jdk7] // dir
[windows-jdk9] [WARNING] Javadoc Warnings
[windows-jdk9] [WARNING] Picked up JAVA_TOOL_OPTIONS: -Dmaven.ext.class.path="f:\jenkins\jenkins-slave\workspace\lugin_Jenkins_investigation-XMH53YEN2PKRRDIEGSSOM3JEJOBRY257ATPQFDZAASG7YO2URE4Q@tmp\withMaven8c8642c1\pipeline-maven-spy.jar"
-Dorg.jenkinsci.plugins.pipeline.maven.reportsFolder="f:\jenkins\jenkins-slave\workspace\lugin_Jenkins_investigation-XMH53YEN2PKRRDIEGSSOM3JEJOBRY257ATPQFDZAASG7YO2URE4Q@tmp\withMaven8c8642c1"
[windows-jdk9] SLF4J: Failed to load class "org.slf4j.impl.StaticLoggerBinder".
[windows-jdk9] SLF4J: Defaulting to no-operation (NOP) logger implementation
[windows-jdk9] SLF4J: See http://www.slf4j.org/codes.html#StaticLoggerBinder for further details.
[windows-jdk9] stderr: Picked up JAVA_TOOL_OPTIONS: -Dmaven.ext.class.path="f:\jenkins\jenkins-slave\workspace\lugin_Jenkins_investigation-XMH53YEN2PKRRDIEGSSOM3JEJOBRY257ATPQFDZAASG7YO2URE4Q@tmp\withMaven8c8642c1\pipeline-maven-spy.jar"
-Dorg.jenkinsci.plugins.pipeline.maven.reportsFolder="f:\jenkins\jenkins-slave\workspace\lugin_Jenkins_investigation-XMH53YEN2PKRRDIEGSSOM3JEJOBRY257ATPQFDZAASG7YO2URE4Q@tmp\withMaven8c8642c1"

[windows-jdk9] java version "9.0.1"
[windows-jdk9] Java(TM) SE Runtime Environment (build 9.0.1+11)
[windows-jdk9] Java HotSpot(TM) 64-Bit Server VM (build 9.0.1+11, mixed mode)
[windows-jdk9] [ERROR] ProjectBuildingException for Mock for Artifact, hashCode: 1682100030:
Error resolving project artifact: Could not find artifact commons-logging:commons-logging:pom:1.1.1
for project null
[Pipeline] [windows-jdk7] }
[windows-jdk9] [WARNING] Javadoc Warnings
[windows-jdk9] [WARNING] Picked up JAVA_TOOL_OPTIONS: -Dmaven.ext.class.path="f:\jenkins\jenkins-slave\workspace\lugin_Jenkins_investigation-XMH53YEN2PKRRDIEGSSOM3JEJOBRY257ATPQFDZAASG7YO2URE4Q@tmp\withMaven8c8642c1\pipeline-maven-spy.jar"
-Dorg.jenkinsci.plugins.pipeline.maven.reportsFolder="f:\jenkins\jenkins-slave\workspace\lugin_Jenkins_investigation-XMH53YEN2PKRRDIEGSSOM3JEJOBRY257ATPQFDZAASG7YO2URE4Q@tmp\withMaven8c8642c1"
[windows-jdk9] stderr: Picked up JAVA_TOOL_OPTIONS: -Dmaven.ext.class.path="f:\jenkins\jenkins-slave\workspace\lugin_Jenkins_investigation-XMH53YEN2PKRRDIEGSSOM3JEJOBRY257ATPQFDZAASG7YO2URE4Q@tmp\withMaven8c8642c1\pipeline-maven-spy.jar"
-Dorg.jenkinsci.plugins.pipeline.maven.reportsFolder="f:\jenkins\jenkins-slave\workspace\lugin_Jenkins_investigation-XMH53YEN2PKRRDIEGSSOM3JEJOBRY257ATPQFDZAASG7YO2URE4Q@tmp\withMaven8c8642c1"

[windows-jdk9] java version "9.0.1"
[windows-jdk9] Java(TM) SE Runtime Environment (build 9.0.1+11)
[windows-jdk9] Java HotSpot(TM) 64-Bit Server VM (build 9.0.1+11, mixed mode)
[windows-jdk9] [ERROR] ProjectBuildingException for Mock for Artifact, hashCode: 283430552:
Error resolving project artifact: Could not find artifact commons-logging:commons-logging:pom:1.1.1
for project null
[windows-jdk7] [withMaven] invokerPublisher - Archive invoker results for Maven artifact MavenArtifact{org.apache.maven.plugins:maven-javadoc-plugin::3.0.1-SNAPSHOT(version:
3.0.1-SNAPSHOT, snapshot:false) } generated by PluginInvocation{org.apache.maven.plugins:maven-invoker-plugin:2.0.0@integration-test
 integration-test}: m\target\invoker-reports\*.xml
[windows-jdk7] performing MavenInvokerRecorder, reportsFilenamePattern:'**/m\target\invoker-reports/BUILD*.xml',
invokerBuildDir:'**/m\target\it'
[windows-jdk7] Found reports:[f:\jenkins\jenkins-slave\workspace\lugin_Jenkins_investigation-XMH53YEN2PKRRDIEGSSOM3JEJOBRY257ATPQFDZAASG7YO2URE4Q\m\target\invoker-reports\BUILD-MJAVADOC-110.xml,
f:\jenkins\jenkins-slave\workspace\lugin_Jenkins_investigation-XMH53YEN2PKRRDIEGSSOM3JEJOBRY257ATPQFDZAASG7YO2URE4Q\m\target\invoker-reports\BUILD-MJAVADOC-126.xml,
f:\jenkins\jenkins-slave\workspace\lugin_Jenkins_investigation-XMH53YEN2PKRRDIEGSSOM3JEJOBRY257ATPQFDZAASG7YO2URE4Q\m\target\invoker-reports\BUILD-MJAVADOC-137.xml,
f:\jenkins\jenkins-slave\workspace\lugin_Jenkins_investigation-XMH53YEN2PKRRDIEGSSOM3JEJOBRY257ATPQFDZAASG7YO2URE4Q\m\target\invoker-reports\BUILD-MJAVADOC-172.xml,
f:\jenkins\jenkins-slave\workspace\lugin_Jenkins_investigation-XMH53YEN2PKRRDIEGSSOM3JEJOBRY257ATPQFDZAASG7YO2URE4Q\m\target\invoker-reports\BUILD-MJAVADOC-180.xml,
f:\jenkins\jenkins-slave\workspace\lugin_Jenkins_investigation-XMH53YEN2PKRRDIEGSSOM3JEJOBRY257ATPQFDZAASG7YO2URE4Q\m\target\invoker-reports\BUILD-MJAVADOC-194.xml,
f:\jenkins\jenkins-slave\workspace\lugin_Jenkins_investigation-XMH53YEN2PKRRDIEGSSOM3JEJOBRY257ATPQFDZAASG7YO2URE4Q\m\target\invoker-reports\BUILD-MJAVADOC-250.xml,
f:\jenkins\jenkins-slave\workspace\lugin_Jenkins_investigation-XMH53YEN2PKRRDIEGSSOM3JEJOBRY257ATPQFDZAASG7YO2URE4Q\m\target\invoker-reports\BUILD-MJAVADOC-257.xml,
f:\jenkins\jenkins-slave\workspace\lugin_Jenkins_investigation-XMH53YEN2PKRRDIEGSSOM3JEJOBRY257ATPQFDZAASG7YO2URE4Q\m\target\invoker-reports\BUILD-MJAVADOC-259.xml,
f:\jenkins\jenkins-slave\workspace\lugin_Jenkins_investigation-XMH53YEN2PKRRDIEGSSOM3JEJOBRY257ATPQFDZAASG7YO2URE4Q\m\target\invoker-reports\BUILD-MJAVADOC-262.xml,
f:\jenkins\jenkins-slave\workspace\lugin_Jenkins_investigation-XMH53YEN2PKRRDIEGSSOM3JEJOBRY257ATPQFDZAASG7YO2URE4Q\m\target\invoker-reports\BUILD-MJAVADOC-275.xml,
f:\jenkins\jenkins-slave\workspace\lugin_Jenkins_investigation-XMH53YEN2PKRRDIEGSSOM3JEJOBRY257ATPQFDZAASG7YO2URE4Q\m\target\invoker-reports\BUILD-MJAVADOC-278.xml,
f:\jenkins\jenkins-slave\workspace\lugin_Jenkins_investigation-XMH53YEN2PKRRDIEGSSOM3JEJOBRY257ATPQFDZAASG7YO2URE4Q\m\target\invoker-reports\BUILD-MJAVADOC-320.xml,
f:\jenkins\jenkins-slave\workspace\lugin_Jenkins_investigation-XMH53YEN2PKRRDIEGSSOM3JEJOBRY257ATPQFDZAASG7YO2URE4Q\m\target\invoker-reports\BUILD-MJAVADOC-325.xml,
f:\jenkins\jenkins-slave\workspace\lugin_Jenkins_investigation-XMH53YEN2PKRRDIEGSSOM3JEJOBRY257ATPQFDZAASG7YO2URE4Q\m\target\invoker-reports\BUILD-MJAVADOC-365.xml,
f:\jenkins\jenkins-slave\workspace\lugin_Jenkins_investigation-XMH53YEN2PKRRDIEGSSOM3JEJOBRY257ATPQFDZAASG7YO2URE4Q\m\target\invoker-reports\BUILD-MJAVADOC-369.xml,
f:\jenkins\jenkins-slave\workspace\lugin_Jenkins_investigation-XMH53YEN2PKRRDIEGSSOM3JEJOBRY257ATPQFDZAASG7YO2URE4Q\m\target\invoker-reports\BUILD-MJAVADOC-384.xml,
f:\jenkins\jenkins-slave\workspace\lugin_Jenkins_investigation-XMH53YEN2PKRRDIEGSSOM3JEJOBRY257ATPQFDZAASG7YO2URE4Q\m\target\invoker-reports\BUILD-MJAVADOC-407.xml,
f:\jenkins\jenkins-slave\workspace\lugin_Jenkins_investigation-XMH53YEN2PKRRDIEGSSOM3JEJOBRY257ATPQFDZAASG7YO2URE4Q\m\target\invoker-reports\BUILD-MJAVADOC-414.xml,
f:\jenkins\jenkins-slave\workspace\lugin_Jenkins_investigation-XMH53YEN2PKRRDIEGSSOM3JEJOBRY257ATPQFDZAASG7YO2URE4Q\m\target\invoker-reports\BUILD-MJAVADOC-437.xml,
f:\jenkins\jenkins-slave\workspace\lugin_Jenkins_investigation-XMH53YEN2PKRRDIEGSSOM3JEJOBRY257ATPQFDZAASG7YO2URE4Q\m\target\invoker-reports\BUILD-MJAVADOC-494_aggregate-repositories.xml,
f:\jenkins\jenkins-slave\workspace\lugin_Jenkins_investigation-XMH53YEN2PKRRDIEGSSOM3JEJOBRY257ATPQFDZAASG7YO2URE4Q\m\target\invoker-reports\BUILD-MJAVADOC-497.xml,
f:\jenkins\jenkins-slave\workspace\lugin_Jenkins_investigation-XMH53YEN2PKRRDIEGSSOM3JEJOBRY257ATPQFDZAASG7YO2URE4Q\m\target\invoker-reports\BUILD-MJAVADOC-498_aggr_modulepath.xml,
f:\jenkins\jenkins-slave\workspace\lugin_Jenkins_investigation-XMH53YEN2PKRRDIEGSSOM3JEJOBRY257ATPQFDZAASG7YO2URE4Q\m\target\invoker-reports\BUILD-MJAVADOC-498_mm_modulepath.xml,
f:\jenkins\jenkins-slave\workspace\lugin_Jenkins_investigation-XMH53YEN2PKRRDIEGSSOM3JEJOBRY257ATPQFDZAASG7YO2URE4Q\m\target\invoker-reports\BUILD-MJAVADOC-498_modulepath.xml,
f:\jenkins\jenkins-slave\workspace\lugin_Jenkins_investigation-XMH53YEN2PKRRDIEGSSOM3JEJOBRY257ATPQFDZAASG7YO2URE4Q\m\target\invoker-reports\BUILD-MJAVADOC-508.xml,
f:\jenkins\jenkins-slave\workspace\lugin_Jenkins_investigation-XMH53YEN2PKRRDIEGSSOM3JEJOBRY257ATPQFDZAASG7YO2URE4Q\m\target\invoker-reports\BUILD-additional-dependencies-non-aggregate.xml,
f:\jenkins\jenkins-slave\workspace\lugin_Jenkins_investigation-XMH53YEN2PKRRDIEGSSOM3JEJOBRY257ATPQFDZAASG7YO2URE4Q\m\target\invoker-reports\BUILD-additional-dependencies.xml,
f:\jenkins\jenkins-slave\workspace\lugin_Jenkins_investigation-XMH53YEN2PKRRDIEGSSOM3JEJOBRY257ATPQFDZAASG7YO2URE4Q\m\target\invoker-reports\BUILD-dependencySource-1.xml,
f:\jenkins\jenkins-slave\workspace\lugin_Jenkins_investigation-XMH53YEN2PKRRDIEGSSOM3JEJOBRY257ATPQFDZAASG7YO2URE4Q\m\target\invoker-reports\BUILD-dependencySource-2.xml,
f:\jenkins\jenkins-slave\workspace\lugin_Jenkins_investigation-XMH53YEN2PKRRDIEGSSOM3JEJOBRY257ATPQFDZAASG7YO2URE4Q\m\target\invoker-reports\BUILD-dependencySource-3.xml,
f:\jenkins\jenkins-slave\workspace\lugin_Jenkins_investigation-XMH53YEN2PKRRDIEGSSOM3JEJOBRY257ATPQFDZAASG7YO2URE4Q\m\target\invoker-reports\BUILD-dependencySource-4.xml,
f:\jenkins\jenkins-slave\workspace\lugin_Jenkins_investigation-XMH53YEN2PKRRDIEGSSOM3JEJOBRY257ATPQFDZAASG7YO2URE4Q\m\target\invoker-reports\BUILD-detectLinks.xml,
f:\jenkins\jenkins-slave\workspace\lugin_Jenkins_investigation-XMH53YEN2PKRRDIEGSSOM3JEJOBRY257ATPQFDZAASG7YO2URE4Q\m\target\invoker-reports\BUILD-javadoc-fix.xml,
f:\jenkins\jenkins-slave\workspace\lugin_Jenkins_investigation-XMH53YEN2PKRRDIEGSSOM3JEJOBRY257ATPQFDZAASG7YO2URE4Q\m\target\invoker-reports\BUILD-site-failOnError.xml]
[windows-jdk7] Found logs:[f:\jenkins\jenkins-slave\workspace\lugin_Jenkins_investigation-XMH53YEN2PKRRDIEGSSOM3JEJOBRY257ATPQFDZAASG7YO2URE4Q\m\target\it\MJAVADOC-110\build.log,
f:\jenkins\jenkins-slave\workspace\lugin_Jenkins_investigation-XMH53YEN2PKRRDIEGSSOM3JEJOBRY257ATPQFDZAASG7YO2URE4Q\m\target\it\MJAVADOC-126\build.log,
f:\jenkins\jenkins-slave\workspace\lugin_Jenkins_investigation-XMH53YEN2PKRRDIEGSSOM3JEJOBRY257ATPQFDZAASG7YO2URE4Q\m\target\it\MJAVADOC-137\build.log,
f:\jenkins\jenkins-slave\workspace\lugin_Jenkins_investigation-XMH53YEN2PKRRDIEGSSOM3JEJOBRY257ATPQFDZAASG7YO2URE4Q\m\target\it\MJAVADOC-172\build.log,
f:\jenkins\jenkins-slave\workspace\lugin_Jenkins_investigation-XMH53YEN2PKRRDIEGSSOM3JEJOBRY257ATPQFDZAASG7YO2URE4Q\m\target\it\MJAVADOC-180\build.log,
f:\jenkins\jenkins-slave\workspace\lugin_Jenkins_investigation-XMH53YEN2PKRRDIEGSSOM3JEJOBRY257ATPQFDZAASG7YO2URE4Q\m\target\it\MJAVADOC-194\build.log,
f:\jenkins\jenkins-slave\workspace\lugin_Jenkins_investigation-XMH53YEN2PKRRDIEGSSOM3JEJOBRY257ATPQFDZAASG7YO2URE4Q\m\target\it\MJAVADOC-250\build.log,
f:\jenkins\jenkins-slave\workspace\lugin_Jenkins_investigation-XMH53YEN2PKRRDIEGSSOM3JEJOBRY257ATPQFDZAASG7YO2URE4Q\m\target\it\MJAVADOC-257\build.log,
f:\jenkins\jenkins-slave\workspace\lugin_Jenkins_investigation-XMH53YEN2PKRRDIEGSSOM3JEJOBRY257ATPQFDZAASG7YO2URE4Q\m\target\it\MJAVADOC-259\build.log,
f:\jenkins\jenkins-slave\workspace\lugin_Jenkins_investigation-XMH53YEN2PKRRDIEGSSOM3JEJOBRY257ATPQFDZAASG7YO2URE4Q\m\target\it\MJAVADOC-262\build.log,
f:\jenkins\jenkins-slave\workspace\lugin_Jenkins_investigation-XMH53YEN2PKRRDIEGSSOM3JEJOBRY257ATPQFDZAASG7YO2URE4Q\m\target\it\MJAVADOC-275\build.log,
f:\jenkins\jenkins-slave\workspace\lugin_Jenkins_investigation-XMH53YEN2PKRRDIEGSSOM3JEJOBRY257ATPQFDZAASG7YO2URE4Q\m\target\it\MJAVADOC-278\build.log,
f:\jenkins\jenkins-slave\workspace\lugin_Jenkins_investigation-XMH53YEN2PKRRDIEGSSOM3JEJOBRY257ATPQFDZAASG7YO2URE4Q\m\target\it\MJAVADOC-320\build.log,
f:\jenkins\jenkins-slave\workspace\lugin_Jenkins_investigation-XMH53YEN2PKRRDIEGSSOM3JEJOBRY257ATPQFDZAASG7YO2URE4Q\m\target\it\MJAVADOC-325\build.log,
f:\jenkins\jenkins-slave\workspace\lugin_Jenkins_investigation-XMH53YEN2PKRRDIEGSSOM3JEJOBRY257ATPQFDZAASG7YO2URE4Q\m\target\it\MJAVADOC-365\build.log,
f:\jenkins\jenkins-slave\workspace\lugin_Jenkins_investigation-XMH53YEN2PKRRDIEGSSOM3JEJOBRY257ATPQFDZAASG7YO2URE4Q\m\target\it\MJAVADOC-369\build.log,
f:\jenkins\jenkins-slave\workspace\lugin_Jenkins_investigation-XMH53YEN2PKRRDIEGSSOM3JEJOBRY257ATPQFDZAASG7YO2URE4Q\m\target\it\MJAVADOC-384\build.log,
f:\jenkins\jenkins-slave\workspace\lugin_Jenkins_investigation-XMH53YEN2PKRRDIEGSSOM3JEJOBRY257ATPQFDZAASG7YO2URE4Q\m\target\it\MJAVADOC-407\build.log,
f:\jenkins\jenkins-slave\workspace\lugin_Jenkins_investigation-XMH53YEN2PKRRDIEGSSOM3JEJOBRY257ATPQFDZAASG7YO2URE4Q\m\target\it\MJAVADOC-414\build.log,
f:\jenkins\jenkins-slave\workspace\lugin_Jenkins_investigation-XMH53YEN2PKRRDIEGSSOM3JEJOBRY257ATPQFDZAASG7YO2URE4Q\m\target\it\MJAVADOC-437\build.log,
f:\jenkins\jenkins-slave\workspace\lugin_Jenkins_investigation-XMH53YEN2PKRRDIEGSSOM3JEJOBRY257ATPQFDZAASG7YO2URE4Q\m\target\it\MJAVADOC-494_aggregate-repositories\build.log,
f:\jenkins\jenkins-slave\workspace\lugin_Jenkins_investigation-XMH53YEN2PKRRDIEGSSOM3JEJOBRY257ATPQFDZAASG7YO2URE4Q\m\target\it\MJAVADOC-497\build.log,
f:\jenkins\jenkins-slave\workspace\lugin_Jenkins_investigation-XMH53YEN2PKRRDIEGSSOM3JEJOBRY257ATPQFDZAASG7YO2URE4Q\m\target\it\MJAVADOC-508\build.log,
f:\jenkins\jenkins-slave\workspace\lugin_Jenkins_investigation-XMH53YEN2PKRRDIEGSSOM3JEJOBRY257ATPQFDZAASG7YO2URE4Q\m\target\it\additional-dependencies-non-aggregate\build.log,
f:\jenkins\jenkins-slave\workspace\lugin_Jenkins_investigation-XMH53YEN2PKRRDIEGSSOM3JEJOBRY257ATPQFDZAASG7YO2URE4Q\m\target\it\additional-dependencies\build.log,
f:\jenkins\jenkins-slave\workspace\lugin_Jenkins_investigation-XMH53YEN2PKRRDIEGSSOM3JEJOBRY257ATPQFDZAASG7YO2URE4Q\m\target\it\dependencySource-1\build.log,
f:\jenkins\jenkins-slave\workspace\lugin_Jenkins_investigation-XMH53YEN2PKRRDIEGSSOM3JEJOBRY257ATPQFDZAASG7YO2URE4Q\m\target\it\dependencySource-2\build.log,
f:\jenkins\jenkins-slave\workspace\lugin_Jenkins_investigation-XMH53YEN2PKRRDIEGSSOM3JEJOBRY257ATPQFDZAASG7YO2URE4Q\m\target\it\dependencySource-3\build.log,
f:\jenkins\jenkins-slave\workspace\lugin_Jenkins_investigation-XMH53YEN2PKRRDIEGSSOM3JEJOBRY257ATPQFDZAASG7YO2URE4Q\m\target\it\dependencySource-4\build.log,
f:\jenkins\jenkins-slave\workspace\lugin_Jenkins_investigation-XMH53YEN2PKRRDIEGSSOM3JEJOBRY257ATPQFDZAASG7YO2URE4Q\m\target\it\detectLinks\build.log,
f:\jenkins\jenkins-slave\workspace\lugin_Jenkins_investigation-XMH53YEN2PKRRDIEGSSOM3JEJOBRY257ATPQFDZAASG7YO2URE4Q\m\target\it\javadoc-fix\build.log,
f:\jenkins\jenkins-slave\workspace\lugin_Jenkins_investigation-XMH53YEN2PKRRDIEGSSOM3JEJOBRY257ATPQFDZAASG7YO2URE4Q\m\target\it\site-failOnError\build.log]
[windows-jdk7] Finished parsing Maven Invoker results (found 35)
[windows-jdk7] [withMaven] junitPublisher - Archive test results for Maven artifact org.apache.maven.plugins:maven-javadoc-plugin:3.0.1-SNAPSHOT
generated by maven-surefire-plugin:test (default-test): m\target\surefire-reports\*.xml
[windows-jdk7] Recording test results
[Pipeline] [windows-jdk7] // withMaven
[Pipeline] [windows-jdk7] echo
[windows-jdk7] [FAIL FAST] This is the first failure and likely root cause
[Pipeline] [windows-jdk7] }
[Pipeline] [windows-jdk7] // stage
[Pipeline] [windows-jdk7] }
[Pipeline] [windows-jdk7] // node
[Pipeline] [windows-jdk7] }
[windows-jdk8] Sending interrupt signal to process
[windows-jdk7] Failed in branch windows-jdk7
[windows-jdk9] Sending interrupt signal to process
[windows-jdk8] [INFO] ..FAILED (21.5 s)
[windows-jdk8] [INFO]   The build exited with code -1. See f:\jenkins\jenkins-slave\workspace\lugin_Jenkins_investigation-XMH53YEN2PKRRDIEGSSOM3JEJOBRY257ATPQFDZAASG7YO2URE4Q\m\target\it\dependencySource-3\build.log
for details.
[windows-jdk8] [INFO] Building: dependencySource-4\pom.xml
[Pipeline] [linux-jdk7] // node
[Pipeline] [linux-jdk8] // node
[Pipeline] [linux-jdk9] // node
[Pipeline] [linux-jdk10] // node
[Pipeline] [windows-jdk10] // node
[Pipeline] [linux-jdk7] }
[linux-jdk7] Failed in branch linux-jdk7
[Pipeline] [linux-jdk8] }
[linux-jdk8] Failed in branch linux-jdk8
[Pipeline] [linux-jdk9] }
[linux-jdk9] Failed in branch linux-jdk9
[Pipeline] [linux-jdk10] }
[linux-jdk10] Failed in branch linux-jdk10
[Pipeline] [windows-jdk10] }
[windows-jdk10] Failed in branch windows-jdk10
[Pipeline] [windows-jdk9] }
[Pipeline] [windows-jdk9] // dir
[Pipeline] [windows-jdk9] }
[windows-jdk9] [withMaven] One or multiple Maven executions have been ignored by the Jenkins
Pipeline Maven Plugin because they have been interrupted before completion (1). See Pipeline
Maven Plugin FAQ for more details.
[Pipeline] [windows-jdk9] // withMaven
[Pipeline] [windows-jdk9] }
[Pipeline] [windows-jdk9] // stage
[Pipeline] [windows-jdk9] }
[Pipeline] [windows-jdk9] // node
[Pipeline] [windows-jdk9] }
[windows-jdk8] After 10s process did not stop
[Pipeline] [windows-jdk8] }
[Pipeline] [windows-jdk8] // dir
[Pipeline] [windows-jdk8] }
[windows-jdk8] [withMaven] One or multiple Maven executions have been ignored by the Jenkins
Pipeline Maven Plugin because they have been interrupted before completion (1). See Pipeline
Maven Plugin FAQ for more details.
[Pipeline] [windows-jdk8] // withMaven
[Pipeline] [windows-jdk8] echo
[windows-jdk8] [FAIL FAST] windows-jdk7 had first failure, ignoring null
[Pipeline] [windows-jdk8] }
[Pipeline] [windows-jdk8] // stage
[Pipeline] [windows-jdk8] }
[Pipeline] [windows-jdk8] // node
[Pipeline] [windows-jdk8] }
[Pipeline] // parallel
[Pipeline] echo
***** FAST FAILURE *****

Fast failure triggered by windows-jdk7

***** FAST FAILURE *****
[Pipeline] stage
[Pipeline] { (Notifications)
[Pipeline] echo
Build result: FAILURE
[Pipeline] jiraIssueSelector
Mime
  • Unnamed multipart/mixed (inline, None, 0 bytes)
View raw message