maven-notifications mailing list archives

Site index · List index
Message view « Date » · « Thread »
Top « Date » · « Thread »
From Apache Jenkins Server <jenk...@builds.apache.org>
Subject Build unstable in Jenkins: Maven TLP » maven-archetype » master #8
Date Tue, 03 Jul 2018 03:45:16 GMT
See https://builds.apache.org/job/maven-box/job/maven-archetype/job/master/8/

Changes:

* Add jdkForMaven and mavenForJdk methods Use reqexp for version matching
* regex in switch/case are full match, not partial match
* Update JDKs
* Looks like the API has changed.
* Try to fix it.
* TLSv1.x being deactivated since June. So only TLSv1.2 is valid for
* Add asfMavenTlpPlgnBuild to run plugins with multiple Maven versions
* Add maven version to stageId
* Add removeFromCollection() due to RejectedAccessException on
* Scripts not permitted to use method java.util.Collection stream
* Pass 'first'
* Ensure at least minimum required Java version is used
* builds.a.o doesn't have a Maven 3.1.x
* Pass 'failfast'
* Pass 'failingFast'
* Set https.protocols for Java7
* Make failingFast global variable
* Introduce a shared taskContext to keep track of failures
* Make taskContext accessible for try-catch
* Ensure tasks on the same Jenkins instance don't block each others
* dir('m') was used twice
* Also run site goal
* Remove unused parameter
* Disable site plan, doesn't work with multimodules

28 tests failed.
FAILED:  org.apache.maven.archetype.creator.DefaultArchetypeCreatorIT.testIncludeFileWithNoExtension

Error Message:
Invoker process ended with result different than 0!

Stack Trace:
java.lang.Exception: Invoker process ended with result different than 0!
	at org.apache.maven.archetype.creator.DefaultArchetypeCreatorIT.createFilesetArchetype(DefaultArchetypeCreatorIT.java:136)
	at org.apache.maven.archetype.creator.DefaultArchetypeCreatorIT.testIncludeFileWithNoExtension(DefaultArchetypeCreatorIT.java:189)


FAILED:  org.apache.maven.archetype.creator.DefaultArchetypeCreatorIT.testSystemPropertiesAreIncluded

Error Message:
Invoker process ended with result different than 0!

Stack Trace:
java.lang.Exception: Invoker process ended with result different than 0!
	at org.apache.maven.archetype.creator.DefaultArchetypeCreatorIT.createFilesetArchetype(DefaultArchetypeCreatorIT.java:136)
	at org.apache.maven.archetype.creator.DefaultArchetypeCreatorIT.testSystemPropertiesAreIncluded(DefaultArchetypeCreatorIT.java:200)


FAILED:  org.apache.maven.archetype.creator.DefaultArchetypeCreatorIT.testCreateFilesetArchetype1

Error Message:
Invoker process ended with result different than 0!

Stack Trace:
java.lang.Exception: Invoker process ended with result different than 0!
	at org.apache.maven.archetype.creator.DefaultArchetypeCreatorIT.createFilesetArchetype(DefaultArchetypeCreatorIT.java:136)
	at org.apache.maven.archetype.creator.DefaultArchetypeCreatorIT.testCreateFilesetArchetype1(DefaultArchetypeCreatorIT.java:211)


FAILED:  org.apache.maven.archetype.creator.DefaultArchetypeCreatorIT.testCreateFilesetArchetype2

Error Message:
Invoker process ended with result different than 0!

Stack Trace:
java.lang.Exception: Invoker process ended with result different than 0!
	at org.apache.maven.archetype.creator.DefaultArchetypeCreatorIT.createFilesetArchetype(DefaultArchetypeCreatorIT.java:136)
	at org.apache.maven.archetype.creator.DefaultArchetypeCreatorIT.testCreateFilesetArchetype2(DefaultArchetypeCreatorIT.java:225)


FAILED:  org.apache.maven.archetype.creator.DefaultArchetypeCreatorIT.testCreateFilesetArchetype3

Error Message:
Invoker process ended with result different than 0!

Stack Trace:
java.lang.Exception: Invoker process ended with result different than 0!
	at org.apache.maven.archetype.creator.DefaultArchetypeCreatorIT.createFilesetArchetype(DefaultArchetypeCreatorIT.java:136)
	at org.apache.maven.archetype.creator.DefaultArchetypeCreatorIT.testCreateFilesetArchetype3(DefaultArchetypeCreatorIT.java:233)


FAILED:  org.apache.maven.archetype.creator.DefaultArchetypeCreatorIT.testCreateFilesetArchetype4

Error Message:
Invoker process ended with result different than 0!

Stack Trace:
java.lang.Exception: Invoker process ended with result different than 0!
	at org.apache.maven.archetype.creator.DefaultArchetypeCreatorIT.createFilesetArchetype(DefaultArchetypeCreatorIT.java:136)
	at org.apache.maven.archetype.creator.DefaultArchetypeCreatorIT.testCreateFilesetArchetype4(DefaultArchetypeCreatorIT.java:398)


FAILED:  org.apache.maven.archetype.creator.DefaultArchetypeCreatorIT.testCreateFilesetArchetype5

Error Message:
Invoker process ended with result different than 0!

Stack Trace:
java.lang.Exception: Invoker process ended with result different than 0!
	at org.apache.maven.archetype.creator.DefaultArchetypeCreatorIT.createFilesetArchetype(DefaultArchetypeCreatorIT.java:136)
	at org.apache.maven.archetype.creator.DefaultArchetypeCreatorIT.testCreateFilesetArchetype5(DefaultArchetypeCreatorIT.java:429)


FAILED:  org.apache.maven.archetype.creator.DefaultArchetypeCreatorIT.testCreateFilesetArchetype6

Error Message:
Invoker process ended with result different than 0!

Stack Trace:
java.lang.Exception: Invoker process ended with result different than 0!
	at org.apache.maven.archetype.creator.DefaultArchetypeCreatorIT.createFilesetArchetype(DefaultArchetypeCreatorIT.java:136)
	at org.apache.maven.archetype.creator.DefaultArchetypeCreatorIT.testCreateFilesetArchetype6(DefaultArchetypeCreatorIT.java:445)


FAILED:  org.apache.maven.archetype.creator.DefaultArchetypeCreatorIT.testExcludePatternsMustExcludeDirectory

Error Message:
Invoker process ended with result different than 0!

Stack Trace:
java.lang.Exception: Invoker process ended with result different than 0!
	at org.apache.maven.archetype.creator.DefaultArchetypeCreatorIT.createFilesetArchetype(DefaultArchetypeCreatorIT.java:136)
	at org.apache.maven.archetype.creator.DefaultArchetypeCreatorIT.testExcludePatternsMustExcludeDirectory(DefaultArchetypeCreatorIT.java:163)


FAILED:  org.apache.maven.archetype.creator.DefaultArchetypeCreatorIT.testExcludePatternsContainingFilesSameExtension

Error Message:
Invoker process ended with result different than 0!

Stack Trace:
java.lang.Exception: Invoker process ended with result different than 0!
	at org.apache.maven.archetype.creator.DefaultArchetypeCreatorIT.createFilesetArchetype(DefaultArchetypeCreatorIT.java:136)
	at org.apache.maven.archetype.creator.DefaultArchetypeCreatorIT.testExcludePatternsContainingFilesSameExtension(DefaultArchetypeCreatorIT.java:177)


FAILED:  org.apache.maven.archetype.creator.DefaultArchetypeCreatorIT.testChangeJavaFilenameWhenCustomPropertyEqualsClassName

Error Message:
Invoker process ended with result different than 0!

Stack Trace:
java.lang.Exception: Invoker process ended with result different than 0!
	at org.apache.maven.archetype.creator.DefaultArchetypeCreatorIT.createFilesetArchetype(DefaultArchetypeCreatorIT.java:136)
	at org.apache.maven.archetype.creator.DefaultArchetypeCreatorIT.testChangeJavaFilenameWhenCustomPropertyEqualsClassName(DefaultArchetypeCreatorIT.java:151)


FAILED:  org.apache.maven.archetype.creator.DefaultArchetypeCreatorIT.testIncludeFileWithNoExtension

Error Message:
Invoker process ended with result different than 0!

Stack Trace:
java.lang.Exception: Invoker process ended with result different than 0!
	at org.apache.maven.archetype.creator.DefaultArchetypeCreatorIT.createFilesetArchetype(DefaultArchetypeCreatorIT.java:136)
	at org.apache.maven.archetype.creator.DefaultArchetypeCreatorIT.testIncludeFileWithNoExtension(DefaultArchetypeCreatorIT.java:189)


FAILED:  org.apache.maven.archetype.creator.DefaultArchetypeCreatorIT.testSystemPropertiesAreIncluded

Error Message:
Invoker process ended with result different than 0!

Stack Trace:
java.lang.Exception: Invoker process ended with result different than 0!
	at org.apache.maven.archetype.creator.DefaultArchetypeCreatorIT.createFilesetArchetype(DefaultArchetypeCreatorIT.java:136)
	at org.apache.maven.archetype.creator.DefaultArchetypeCreatorIT.testSystemPropertiesAreIncluded(DefaultArchetypeCreatorIT.java:200)


FAILED:  org.apache.maven.archetype.creator.DefaultArchetypeCreatorIT.testCreateFilesetArchetype1

Error Message:
Invoker process ended with result different than 0!

Stack Trace:
java.lang.Exception: Invoker process ended with result different than 0!
	at org.apache.maven.archetype.creator.DefaultArchetypeCreatorIT.createFilesetArchetype(DefaultArchetypeCreatorIT.java:136)
	at org.apache.maven.archetype.creator.DefaultArchetypeCreatorIT.testCreateFilesetArchetype1(DefaultArchetypeCreatorIT.java:211)


FAILED:  org.apache.maven.archetype.creator.DefaultArchetypeCreatorIT.testCreateFilesetArchetype2

Error Message:
Invoker process ended with result different than 0!

Stack Trace:
java.lang.Exception: Invoker process ended with result different than 0!
	at org.apache.maven.archetype.creator.DefaultArchetypeCreatorIT.createFilesetArchetype(DefaultArchetypeCreatorIT.java:136)
	at org.apache.maven.archetype.creator.DefaultArchetypeCreatorIT.testCreateFilesetArchetype2(DefaultArchetypeCreatorIT.java:225)


FAILED:  org.apache.maven.archetype.creator.DefaultArchetypeCreatorIT.testCreateFilesetArchetype3

Error Message:
Invoker process ended with result different than 0!

Stack Trace:
java.lang.Exception: Invoker process ended with result different than 0!
	at org.apache.maven.archetype.creator.DefaultArchetypeCreatorIT.createFilesetArchetype(DefaultArchetypeCreatorIT.java:136)
	at org.apache.maven.archetype.creator.DefaultArchetypeCreatorIT.testCreateFilesetArchetype3(DefaultArchetypeCreatorIT.java:233)


FAILED:  org.apache.maven.archetype.creator.DefaultArchetypeCreatorIT.testCreateFilesetArchetype4

Error Message:
Invoker process ended with result different than 0!

Stack Trace:
java.lang.Exception: Invoker process ended with result different than 0!
	at org.apache.maven.archetype.creator.DefaultArchetypeCreatorIT.createFilesetArchetype(DefaultArchetypeCreatorIT.java:136)
	at org.apache.maven.archetype.creator.DefaultArchetypeCreatorIT.testCreateFilesetArchetype4(DefaultArchetypeCreatorIT.java:398)


FAILED:  org.apache.maven.archetype.creator.DefaultArchetypeCreatorIT.testCreateFilesetArchetype5

Error Message:
Invoker process ended with result different than 0!

Stack Trace:
java.lang.Exception: Invoker process ended with result different than 0!
	at org.apache.maven.archetype.creator.DefaultArchetypeCreatorIT.createFilesetArchetype(DefaultArchetypeCreatorIT.java:136)
	at org.apache.maven.archetype.creator.DefaultArchetypeCreatorIT.testCreateFilesetArchetype5(DefaultArchetypeCreatorIT.java:429)


FAILED:  org.apache.maven.archetype.creator.DefaultArchetypeCreatorIT.testCreateFilesetArchetype6

Error Message:
Invoker process ended with result different than 0!

Stack Trace:
java.lang.Exception: Invoker process ended with result different than 0!
	at org.apache.maven.archetype.creator.DefaultArchetypeCreatorIT.createFilesetArchetype(DefaultArchetypeCreatorIT.java:136)
	at org.apache.maven.archetype.creator.DefaultArchetypeCreatorIT.testCreateFilesetArchetype6(DefaultArchetypeCreatorIT.java:445)


FAILED:  org.apache.maven.archetype.creator.DefaultArchetypeCreatorIT.testExcludePatternsMustExcludeDirectory

Error Message:
Invoker process ended with result different than 0!

Stack Trace:
java.lang.Exception: Invoker process ended with result different than 0!
	at org.apache.maven.archetype.creator.DefaultArchetypeCreatorIT.createFilesetArchetype(DefaultArchetypeCreatorIT.java:136)
	at org.apache.maven.archetype.creator.DefaultArchetypeCreatorIT.testExcludePatternsMustExcludeDirectory(DefaultArchetypeCreatorIT.java:163)


FAILED:  org.apache.maven.archetype.creator.DefaultArchetypeCreatorIT.testExcludePatternsContainingFilesSameExtension

Error Message:
Invoker process ended with result different than 0!

Stack Trace:
java.lang.Exception: Invoker process ended with result different than 0!
	at org.apache.maven.archetype.creator.DefaultArchetypeCreatorIT.createFilesetArchetype(DefaultArchetypeCreatorIT.java:136)
	at org.apache.maven.archetype.creator.DefaultArchetypeCreatorIT.testExcludePatternsContainingFilesSameExtension(DefaultArchetypeCreatorIT.java:177)


FAILED:  org.apache.maven.archetype.creator.DefaultArchetypeCreatorIT.testChangeJavaFilenameWhenCustomPropertyEqualsClassName

Error Message:
Invoker process ended with result different than 0!

Stack Trace:
java.lang.Exception: Invoker process ended with result different than 0!
	at org.apache.maven.archetype.creator.DefaultArchetypeCreatorIT.createFilesetArchetype(DefaultArchetypeCreatorIT.java:136)
	at org.apache.maven.archetype.creator.DefaultArchetypeCreatorIT.testChangeJavaFilenameWhenCustomPropertyEqualsClassName(DefaultArchetypeCreatorIT.java:151)


FAILED:  org.apache.maven.archetype.test.ArchetyperRoundtripIT.testArchetyper

Error Message:
Invoker process ended with result different than 0!

Stack Trace:
java.lang.Exception: Invoker process ended with result different than 0!
	at org.apache.maven.archetype.test.ArchetyperRoundtripIT.testArchetyper(ArchetyperRoundtripIT.java:121)


FAILED:  org.apache.maven.archetype.test.ArchetyperRoundtripIT.testArchetyper

Error Message:
Invoker process ended with result different than 0!

Stack Trace:
java.lang.Exception: Invoker process ended with result different than 0!
	at org.apache.maven.archetype.test.ArchetyperRoundtripIT.testArchetyper(ArchetyperRoundtripIT.java:121)


FAILED:  org.apache.maven.archetype.test.ArchetyperRoundtripWithProxyIT.testArchetyper

Error Message:
Invoker process ended with result different than 0!

Stack Trace:
java.lang.Exception: Invoker process ended with result different than 0!
	at org.apache.maven.archetype.test.ArchetyperRoundtripWithProxyIT.testArchetyper(ArchetyperRoundtripWithProxyIT.java:126)


FAILED:  org.apache.maven.archetype.test.ArchetyperRoundtripWithProxyIT.testArchetyper

Error Message:
Invoker process ended with result different than 0!

Stack Trace:
java.lang.Exception: Invoker process ended with result different than 0!
	at org.apache.maven.archetype.test.ArchetyperRoundtripWithProxyIT.testArchetyper(ArchetyperRoundtripWithProxyIT.java:126)


FAILED:  org.apache.maven.archetype.test.RoundtripMultiModuleIT.testArchetyper

Error Message:
Invoker process ended with result different than 0!

Stack Trace:
java.lang.Exception: Invoker process ended with result different than 0!
	at org.apache.maven.archetype.test.RoundtripMultiModuleIT.testArchetyper(RoundtripMultiModuleIT.java:126)


FAILED:  org.apache.maven.archetype.test.RoundtripMultiModuleIT.testArchetyper

Error Message:
Invoker process ended with result different than 0!

Stack Trace:
java.lang.Exception: Invoker process ended with result different than 0!
	at org.apache.maven.archetype.test.RoundtripMultiModuleIT.testArchetyper(RoundtripMultiModuleIT.java:126)




Build log:
[...truncated 4.96 MB...]
[windows-jdk9] [INFO] Reactor Summary:
[windows-jdk9] [INFO] 
[windows-jdk9] [INFO] Maven Archetype .................................... SUCCESS [ 13.264 s]
[windows-jdk9] [INFO] Maven Archetype Models ............................. SUCCESS [  0.688 s]
[windows-jdk9] [INFO] Maven Archetype Catalog Model ...................... SUCCESS [  4.586 s]
[windows-jdk9] [INFO] Maven Archetype Descriptor Model ................... SUCCESS [  1.134 s]
[windows-jdk9] [INFO] Maven Archetype Testing ............................ SUCCESS [  0.760 s]
[windows-jdk9] [INFO] Maven Archetype Webapp Repository .................. SUCCESS [  2.063 s]
[windows-jdk9] [INFO] Maven Archetype Webapp Proxy ....................... SUCCESS [  0.914 s]
[windows-jdk9] [INFO] Maven Archetype Common ............................. SUCCESS [ 18.633 s]
[windows-jdk9] [INFO] Maven Archetype Packaging .......................... SUCCESS [  0.666 s]
[windows-jdk9] [INFO] Maven Archetype Plugin ............................. SUCCESS [02:38 min]
[windows-jdk9] [INFO] Maven Archetype Testing Final ...................... SUCCESS [01:20 min]
[windows-jdk9] [INFO] ------------------------------------------------------------------------
[windows-jdk9] [INFO] BUILD SUCCESS
[windows-jdk9] [INFO] ------------------------------------------------------------------------
[windows-jdk9] [INFO] Total time: 04:42 min
[windows-jdk9] [INFO] Finished at: 2018-07-03T03:44:10Z
[windows-jdk9] [INFO] Final Memory: 61M/204M
[windows-jdk9] [INFO] ------------------------------------------------------------------------
[windows-jdk9] [INFO] [jenkins-event-spy] Generated F:\jenkins\jenkins-slave\workspace\-box_maven-archetype_master-7AVMJNUR3VZV7RPVUBCE43H65NYTRWAOYFWSDDPCNSCWDYBAGBVQ@tmp\withMavenc5c72c24\maven-spy-20180703-033927-9379556738806637959692.log
[Pipeline] [linux-jdk7] }
[Pipeline] [linux-jdk9] }
[linux-jdk9] [withMaven] invokerPublisher - Archive invoker results for Maven artifact MavenArtifact{org.apache.maven.plugins:maven-archetype-plugin::3.0.2-SNAPSHOT(version: 3.0.2-SNAPSHOT, snapshot:false) } generated by PluginInvocation{org.apache.maven.plugins:maven-invoker-plugin:3.0.1@run  integration-test}: m/maven-archetype-plugin/target/invoker-reports/*.xml
[linux-jdk9] performing MavenInvokerRecorder, reportsFilenamePattern:'**/m/maven-archetype-plugin/target/invoker-reports/BUILD*.xml', invokerBuildDir:'**/m/maven-archetype-plugin/target/it/projects'
[linux-jdk9] Found reports:[/home/jenkins/jenkins-slave/workspace/-box_maven-archetype_master-7AVMJNUR3VZV7RPVUBCE43H65NYTRWAOYFWSDDPCNSCWDYBAGBVQ/m/maven-archetype-plugin/target/invoker-reports/BUILD-ARCHETYPE-241_filter-directory.xml, /home/jenkins/jenkins-slave/workspace/-box_maven-archetype_master-7AVMJNUR3VZV7RPVUBCE43H65NYTRWAOYFWSDDPCNSCWDYBAGBVQ/m/maven-archetype-plugin/target/invoker-reports/BUILD-ARCHETYPE-517_failing-goals.xml, /home/jenkins/jenkins-slave/workspace/-box_maven-archetype_master-7AVMJNUR3VZV7RPVUBCE43H65NYTRWAOYFWSDDPCNSCWDYBAGBVQ/m/maven-archetype-plugin/target/invoker-reports/BUILD-ARCHETYPE-520_mirror.xml, /home/jenkins/jenkins-slave/workspace/-box_maven-archetype_master-7AVMJNUR3VZV7RPVUBCE43H65NYTRWAOYFWSDDPCNSCWDYBAGBVQ/m/maven-archetype-plugin/target/invoker-reports/BUILD-ARCHETYPE-521_archetype-repo.xml, /home/jenkins/jenkins-slave/workspace/-box_maven-archetype_master-7AVMJNUR3VZV7RPVUBCE43H65NYTRWAOYFWSDDPCNSCWDYBAGBVQ/m/maven-archetype-plugin/target/invoker-reports/BUILD-build-archetype-and-run-its-with-existing-parent.xml, /home/jenkins/jenkins-slave/workspace/-box_maven-archetype_master-7AVMJNUR3VZV7RPVUBCE43H65NYTRWAOYFWSDDPCNSCWDYBAGBVQ/m/maven-archetype-plugin/target/invoker-reports/BUILD-build-archetype-ignore-eol-encoding.xml, /home/jenkins/jenkins-slave/workspace/-box_maven-archetype_master-7AVMJNUR3VZV7RPVUBCE43H65NYTRWAOYFWSDDPCNSCWDYBAGBVQ/m/maven-archetype-plugin/target/invoker-reports/BUILD-build-archetype.xml, /home/jenkins/jenkins-slave/workspace/-box_maven-archetype_master-7AVMJNUR3VZV7RPVUBCE43H65NYTRWAOYFWSDDPCNSCWDYBAGBVQ/m/maven-archetype-plugin/target/invoker-reports/BUILD-create-from-project-exclude-patterns.xml, /home/jenkins/jenkins-slave/workspace/-box_maven-archetype_master-7AVMJNUR3VZV7RPVUBCE43H65NYTRWAOYFWSDDPCNSCWDYBAGBVQ/m/maven-archetype-plugin/target/invoker-reports/BUILD-create-from-project.xml, /home/jenkins/jenkins-slave/workspace/-box_maven-archetype_master-7AVMJNUR3VZV7RPVUBCE43H65NYTRWAOYFWSDDPCNSCWDYBAGBVQ/m/maven-archetype-plugin/target/invoker-reports/BUILD-generate-basic.xml, /home/jenkins/jenkins-slave/workspace/-box_maven-archetype_master-7AVMJNUR3VZV7RPVUBCE43H65NYTRWAOYFWSDDPCNSCWDYBAGBVQ/m/maven-archetype-plugin/target/invoker-reports/BUILD-property-setting-cli.xml]
[linux-jdk9] Found logs:[/home/jenkins/jenkins-slave/workspace/-box_maven-archetype_master-7AVMJNUR3VZV7RPVUBCE43H65NYTRWAOYFWSDDPCNSCWDYBAGBVQ/m/maven-archetype-plugin/target/it/projects/ARCHETYPE-241_filter-directory/build.log, /home/jenkins/jenkins-slave/workspace/-box_maven-archetype_master-7AVMJNUR3VZV7RPVUBCE43H65NYTRWAOYFWSDDPCNSCWDYBAGBVQ/m/maven-archetype-plugin/target/it/projects/ARCHETYPE-517_failing-goals/build.log, /home/jenkins/jenkins-slave/workspace/-box_maven-archetype_master-7AVMJNUR3VZV7RPVUBCE43H65NYTRWAOYFWSDDPCNSCWDYBAGBVQ/m/maven-archetype-plugin/target/it/projects/ARCHETYPE-520_mirror/build.log, /home/jenkins/jenkins-slave/workspace/-box_maven-archetype_master-7AVMJNUR3VZV7RPVUBCE43H65NYTRWAOYFWSDDPCNSCWDYBAGBVQ/m/maven-archetype-plugin/target/it/projects/ARCHETYPE-521_archetype-repo/build.log, /home/jenkins/jenkins-slave/workspace/-box_maven-archetype_master-7AVMJNUR3VZV7RPVUBCE43H65NYTRWAOYFWSDDPCNSCWDYBAGBVQ/m/maven-archetype-plugin/target/it/projects/build-archetype-and-run-its-with-existing-parent/build.log, /home/jenkins/jenkins-slave/workspace/-box_maven-archetype_master-7AVMJNUR3VZV7RPVUBCE43H65NYTRWAOYFWSDDPCNSCWDYBAGBVQ/m/maven-archetype-plugin/target/it/projects/build-archetype-and-run-its-with-existing-parent/target/test-classes/projects/basic/project/project/basic/build.log, /home/jenkins/jenkins-slave/workspace/-box_maven-archetype_master-7AVMJNUR3VZV7RPVUBCE43H65NYTRWAOYFWSDDPCNSCWDYBAGBVQ/m/maven-archetype-plugin/target/it/projects/build-archetype-ignore-eol-encoding/build.log, /home/jenkins/jenkins-slave/workspace/-box_maven-archetype_master-7AVMJNUR3VZV7RPVUBCE43H65NYTRWAOYFWSDDPCNSCWDYBAGBVQ/m/maven-archetype-plugin/target/it/projects/build-archetype-ignore-eol-encoding/target/test-classes/projects/basic/project/basic/build.log, /home/jenkins/jenkins-slave/workspace/-box_maven-archetype_master-7AVMJNUR3VZV7RPVUBCE43H65NYTRWAOYFWSDDPCNSCWDYBAGBVQ/m/maven-archetype-plugin/target/it/projects/build-archetype/build.log, /home/jenkins/jenkins-slave/workspace/-box_maven-archetype_master-7AVMJNUR3VZV7RPVUBCE43H65NYTRWAOYFWSDDPCNSCWDYBAGBVQ/m/maven-archetype-plugin/target/it/projects/build-archetype/target/test-classes/projects/basic/project/basic/build.log, /home/jenkins/jenkins-slave/workspace/-box_maven-archetype_master-7AVMJNUR3VZV7RPVUBCE43H65NYTRWAOYFWSDDPCNSCWDYBAGBVQ/m/maven-archetype-plugin/target/it/projects/create-from-project-exclude-patterns/build.log, /home/jenkins/jenkins-slave/workspace/-box_maven-archetype_master-7AVMJNUR3VZV7RPVUBCE43H65NYTRWAOYFWSDDPCNSCWDYBAGBVQ/m/maven-archetype-plugin/target/it/projects/create-from-project-exclude-patterns/target/generated-sources/archetype/src/main/resources/archetype-resources/build.log, /home/jenkins/jenkins-slave/workspace/-box_maven-archetype_master-7AVMJNUR3VZV7RPVUBCE43H65NYTRWAOYFWSDDPCNSCWDYBAGBVQ/m/maven-archetype-plugin/target/it/projects/create-from-project-exclude-patterns/target/generated-sources/archetype/target/classes/archetype-resources/build.log, /home/jenkins/jenkins-slave/workspace/-box_maven-archetype_master-7AVMJNUR3VZV7RPVUBCE43H65NYTRWAOYFWSDDPCNSCWDYBAGBVQ/m/maven-archetype-plugin/target/it/projects/create-from-project/build.log, /home/jenkins/jenkins-slave/workspace/-box_maven-archetype_master-7AVMJNUR3VZV7RPVUBCE43H65NYTRWAOYFWSDDPCNSCWDYBAGBVQ/m/maven-archetype-plugin/target/it/projects/create-from-project/target/generated-sources/archetype/src/main/resources/archetype-resources/build.log, /home/jenkins/jenkins-slave/workspace/-box_maven-archetype_master-7AVMJNUR3VZV7RPVUBCE43H65NYTRWAOYFWSDDPCNSCWDYBAGBVQ/m/maven-archetype-plugin/target/it/projects/create-from-project/target/generated-sources/archetype/target/classes/archetype-resources/build.log, /home/jenkins/jenkins-slave/workspace/-box_maven-archetype_master-7AVMJNUR3VZV7RPVUBCE43H65NYTRWAOYFWSDDPCNSCWDYBAGBVQ/m/maven-archetype-plugin/target/it/projects/generate-basic/build.log, /home/jenkins/jenkins-slave/workspace/-box_maven-archetype_master-7AVMJNUR3VZV7RPVUBCE43H65NYTRWAOYFWSDDPCNSCWDYBAGBVQ/m/maven-archetype-plugin/target/it/projects/property-setting-cli/build.log]
[linux-jdk9] Finished parsing Maven Invoker results (found 11)
[linux-jdk9] [withMaven] junitPublisher - Archive test results for Maven artifact org.apache.maven.archetype:archetype-catalog:3.0.2-SNAPSHOT generated by maven-surefire-plugin:test (default-test): m/archetype-models/archetype-catalog/target/surefire-reports/*.xml
[linux-jdk9] Recording test results
[linux-jdk9] None of the test reports contained any result
[linux-jdk9] [withMaven] junitPublisher - Archive test results for Maven artifact org.apache.maven.archetype:archetype-descriptor:3.0.2-SNAPSHOT generated by maven-surefire-plugin:test (default-test): m/archetype-models/archetype-descriptor/target/surefire-reports/*.xml
[linux-jdk9] Recording test results
[linux-jdk9] None of the test reports contained any result
[linux-jdk9] [withMaven] junitPublisher - Archive test results for Maven artifact org.apache.maven.archetype:archetype-repository:3.0.2-SNAPSHOT generated by maven-surefire-plugin:test (default-test): m/archetype-testing/archetype-repository/target/surefire-reports/*.xml
[linux-jdk9] Recording test results
[linux-jdk9] None of the test reports contained any result
[linux-jdk9] [withMaven] junitPublisher - Archive test results for Maven artifact org.apache.maven.archetype:archetype-proxy:3.0.2-SNAPSHOT generated by maven-surefire-plugin:test (default-test): m/archetype-testing/archetype-proxy/target/surefire-reports/*.xml
[linux-jdk9] Recording test results
[linux-jdk9] None of the test reports contained any result
[linux-jdk9] [withMaven] junitPublisher - Archive test results for Maven artifact org.apache.maven.archetype:archetype-common:3.0.2-SNAPSHOT generated by maven-surefire-plugin:test (default-test): m/archetype-common/target/surefire-reports/*.xml
[linux-jdk9] Recording test results
[linux-jdk9] [withMaven] junitPublisher - Archive test results for Maven artifact org.apache.maven.archetype:archetype-packaging:3.0.2-SNAPSHOT generated by maven-surefire-plugin:test (default-test): m/archetype-packaging/target/surefire-reports/*.xml
[linux-jdk9] Recording test results
[linux-jdk9] None of the test reports contained any result
[linux-jdk9] [withMaven] junitPublisher - Archive test results for Maven artifact org.apache.maven.plugins:maven-archetype-plugin:3.0.2-SNAPSHOT generated by maven-surefire-plugin:test (default-test): m/maven-archetype-plugin/target/surefire-reports/*.xml
[linux-jdk9] Recording test results
[linux-jdk9] [withMaven] junitPublisher - Archive test results for Maven artifact org.apache.maven.archetype:archetype-final:3.0.2-SNAPSHOT generated by maven-surefire-plugin:test (default-test): m/archetype-testing/archetype-final/target/surefire-reports/*.xml
[linux-jdk9] Recording test results
[linux-jdk9] None of the test reports contained any result
[linux-jdk9] [withMaven] junitPublisher - Archive test results for Maven artifact org.apache.maven.archetype:archetype-final:3.0.2-SNAPSHOT generated by maven-failsafe-plugin:integration-test (default): m/archetype-testing/archetype-final/target/failsafe-reports/*.xml
[linux-jdk9] Recording test results
[Pipeline] [linux-jdk10] }
[linux-jdk10] [withMaven] invokerPublisher - Archive invoker results for Maven artifact MavenArtifact{org.apache.maven.plugins:maven-archetype-plugin::3.0.2-SNAPSHOT(version: 3.0.2-SNAPSHOT, snapshot:false) } generated by PluginInvocation{org.apache.maven.plugins:maven-invoker-plugin:3.0.1@run  integration-test}: m/maven-archetype-plugin/target/invoker-reports/*.xml
[linux-jdk10] performing MavenInvokerRecorder, reportsFilenamePattern:'**/m/maven-archetype-plugin/target/invoker-reports/BUILD*.xml', invokerBuildDir:'**/m/maven-archetype-plugin/target/it/projects'
[linux-jdk10] Found reports:[/home/jenkins/jenkins-slave/workspace/-box_maven-archetype_master-7AVMJNUR3VZV7RPVUBCE43H65NYTRWAOYFWSDDPCNSCWDYBAGBVQ/m/maven-archetype-plugin/target/invoker-reports/BUILD-ARCHETYPE-241_filter-directory.xml, /home/jenkins/jenkins-slave/workspace/-box_maven-archetype_master-7AVMJNUR3VZV7RPVUBCE43H65NYTRWAOYFWSDDPCNSCWDYBAGBVQ/m/maven-archetype-plugin/target/invoker-reports/BUILD-ARCHETYPE-517_failing-goals.xml, /home/jenkins/jenkins-slave/workspace/-box_maven-archetype_master-7AVMJNUR3VZV7RPVUBCE43H65NYTRWAOYFWSDDPCNSCWDYBAGBVQ/m/maven-archetype-plugin/target/invoker-reports/BUILD-ARCHETYPE-520_mirror.xml, /home/jenkins/jenkins-slave/workspace/-box_maven-archetype_master-7AVMJNUR3VZV7RPVUBCE43H65NYTRWAOYFWSDDPCNSCWDYBAGBVQ/m/maven-archetype-plugin/target/invoker-reports/BUILD-ARCHETYPE-521_archetype-repo.xml, /home/jenkins/jenkins-slave/workspace/-box_maven-archetype_master-7AVMJNUR3VZV7RPVUBCE43H65NYTRWAOYFWSDDPCNSCWDYBAGBVQ/m/maven-archetype-plugin/target/invoker-reports/BUILD-build-archetype-and-run-its-with-existing-parent.xml, /home/jenkins/jenkins-slave/workspace/-box_maven-archetype_master-7AVMJNUR3VZV7RPVUBCE43H65NYTRWAOYFWSDDPCNSCWDYBAGBVQ/m/maven-archetype-plugin/target/invoker-reports/BUILD-build-archetype-ignore-eol-encoding.xml, /home/jenkins/jenkins-slave/workspace/-box_maven-archetype_master-7AVMJNUR3VZV7RPVUBCE43H65NYTRWAOYFWSDDPCNSCWDYBAGBVQ/m/maven-archetype-plugin/target/invoker-reports/BUILD-build-archetype.xml, /home/jenkins/jenkins-slave/workspace/-box_maven-archetype_master-7AVMJNUR3VZV7RPVUBCE43H65NYTRWAOYFWSDDPCNSCWDYBAGBVQ/m/maven-archetype-plugin/target/invoker-reports/BUILD-create-from-project-exclude-patterns.xml, /home/jenkins/jenkins-slave/workspace/-box_maven-archetype_master-7AVMJNUR3VZV7RPVUBCE43H65NYTRWAOYFWSDDPCNSCWDYBAGBVQ/m/maven-archetype-plugin/target/invoker-reports/BUILD-create-from-project.xml, /home/jenkins/jenkins-slave/workspace/-box_maven-archetype_master-7AVMJNUR3VZV7RPVUBCE43H65NYTRWAOYFWSDDPCNSCWDYBAGBVQ/m/maven-archetype-plugin/target/invoker-reports/BUILD-generate-basic.xml, /home/jenkins/jenkins-slave/workspace/-box_maven-archetype_master-7AVMJNUR3VZV7RPVUBCE43H65NYTRWAOYFWSDDPCNSCWDYBAGBVQ/m/maven-archetype-plugin/target/invoker-reports/BUILD-property-setting-cli.xml]
[linux-jdk10] Found logs:[/home/jenkins/jenkins-slave/workspace/-box_maven-archetype_master-7AVMJNUR3VZV7RPVUBCE43H65NYTRWAOYFWSDDPCNSCWDYBAGBVQ/m/maven-archetype-plugin/target/it/projects/ARCHETYPE-241_filter-directory/build.log, /home/jenkins/jenkins-slave/workspace/-box_maven-archetype_master-7AVMJNUR3VZV7RPVUBCE43H65NYTRWAOYFWSDDPCNSCWDYBAGBVQ/m/maven-archetype-plugin/target/it/projects/ARCHETYPE-517_failing-goals/build.log, /home/jenkins/jenkins-slave/workspace/-box_maven-archetype_master-7AVMJNUR3VZV7RPVUBCE43H65NYTRWAOYFWSDDPCNSCWDYBAGBVQ/m/maven-archetype-plugin/target/it/projects/ARCHETYPE-520_mirror/build.log, /home/jenkins/jenkins-slave/workspace/-box_maven-archetype_master-7AVMJNUR3VZV7RPVUBCE43H65NYTRWAOYFWSDDPCNSCWDYBAGBVQ/m/maven-archetype-plugin/target/it/projects/ARCHETYPE-521_archetype-repo/build.log, /home/jenkins/jenkins-slave/workspace/-box_maven-archetype_master-7AVMJNUR3VZV7RPVUBCE43H65NYTRWAOYFWSDDPCNSCWDYBAGBVQ/m/maven-archetype-plugin/target/it/projects/build-archetype-and-run-its-with-existing-parent/build.log, /home/jenkins/jenkins-slave/workspace/-box_maven-archetype_master-7AVMJNUR3VZV7RPVUBCE43H65NYTRWAOYFWSDDPCNSCWDYBAGBVQ/m/maven-archetype-plugin/target/it/projects/build-archetype-and-run-its-with-existing-parent/target/test-classes/projects/basic/project/project/basic/build.log, /home/jenkins/jenkins-slave/workspace/-box_maven-archetype_master-7AVMJNUR3VZV7RPVUBCE43H65NYTRWAOYFWSDDPCNSCWDYBAGBVQ/m/maven-archetype-plugin/target/it/projects/build-archetype-ignore-eol-encoding/build.log, /home/jenkins/jenkins-slave/workspace/-box_maven-archetype_master-7AVMJNUR3VZV7RPVUBCE43H65NYTRWAOYFWSDDPCNSCWDYBAGBVQ/m/maven-archetype-plugin/target/it/projects/build-archetype-ignore-eol-encoding/target/test-classes/projects/basic/project/basic/build.log, /home/jenkins/jenkins-slave/workspace/-box_maven-archetype_master-7AVMJNUR3VZV7RPVUBCE43H65NYTRWAOYFWSDDPCNSCWDYBAGBVQ/m/maven-archetype-plugin/target/it/projects/build-archetype/build.log, /home/jenkins/jenkins-slave/workspace/-box_maven-archetype_master-7AVMJNUR3VZV7RPVUBCE43H65NYTRWAOYFWSDDPCNSCWDYBAGBVQ/m/maven-archetype-plugin/target/it/projects/build-archetype/target/test-classes/projects/basic/project/basic/build.log, /home/jenkins/jenkins-slave/workspace/-box_maven-archetype_master-7AVMJNUR3VZV7RPVUBCE43H65NYTRWAOYFWSDDPCNSCWDYBAGBVQ/m/maven-archetype-plugin/target/it/projects/create-from-project-exclude-patterns/build.log, /home/jenkins/jenkins-slave/workspace/-box_maven-archetype_master-7AVMJNUR3VZV7RPVUBCE43H65NYTRWAOYFWSDDPCNSCWDYBAGBVQ/m/maven-archetype-plugin/target/it/projects/create-from-project-exclude-patterns/target/generated-sources/archetype/src/main/resources/archetype-resources/build.log, /home/jenkins/jenkins-slave/workspace/-box_maven-archetype_master-7AVMJNUR3VZV7RPVUBCE43H65NYTRWAOYFWSDDPCNSCWDYBAGBVQ/m/maven-archetype-plugin/target/it/projects/create-from-project-exclude-patterns/target/generated-sources/archetype/target/classes/archetype-resources/build.log, /home/jenkins/jenkins-slave/workspace/-box_maven-archetype_master-7AVMJNUR3VZV7RPVUBCE43H65NYTRWAOYFWSDDPCNSCWDYBAGBVQ/m/maven-archetype-plugin/target/it/projects/create-from-project/build.log, /home/jenkins/jenkins-slave/workspace/-box_maven-archetype_master-7AVMJNUR3VZV7RPVUBCE43H65NYTRWAOYFWSDDPCNSCWDYBAGBVQ/m/maven-archetype-plugin/target/it/projects/create-from-project/target/generated-sources/archetype/src/main/resources/archetype-resources/build.log, /home/jenkins/jenkins-slave/workspace/-box_maven-archetype_master-7AVMJNUR3VZV7RPVUBCE43H65NYTRWAOYFWSDDPCNSCWDYBAGBVQ/m/maven-archetype-plugin/target/it/projects/create-from-project/target/generated-sources/archetype/target/classes/archetype-resources/build.log, /home/jenkins/jenkins-slave/workspace/-box_maven-archetype_master-7AVMJNUR3VZV7RPVUBCE43H65NYTRWAOYFWSDDPCNSCWDYBAGBVQ/m/maven-archetype-plugin/target/it/projects/generate-basic/build.log, /home/jenkins/jenkins-slave/workspace/-box_maven-archetype_master-7AVMJNUR3VZV7RPVUBCE43H65NYTRWAOYFWSDDPCNSCWDYBAGBVQ/m/maven-archetype-plugin/target/it/projects/property-setting-cli/build.log]
[linux-jdk10] Finished parsing Maven Invoker results (found 11)
[linux-jdk10] [withMaven] junitPublisher - Archive test results for Maven artifact org.apache.maven.archetype:archetype-catalog:3.0.2-SNAPSHOT generated by maven-surefire-plugin:test (default-test): m/archetype-models/archetype-catalog/target/surefire-reports/*.xml
[linux-jdk10] Recording test results
[linux-jdk10] None of the test reports contained any result
[linux-jdk10] [withMaven] junitPublisher - Archive test results for Maven artifact org.apache.maven.archetype:archetype-descriptor:3.0.2-SNAPSHOT generated by maven-surefire-plugin:test (default-test): m/archetype-models/archetype-descriptor/target/surefire-reports/*.xml
[linux-jdk10] Recording test results
[linux-jdk10] None of the test reports contained any result
[linux-jdk10] [withMaven] junitPublisher - Archive test results for Maven artifact org.apache.maven.archetype:archetype-repository:3.0.2-SNAPSHOT generated by maven-surefire-plugin:test (default-test): m/archetype-testing/archetype-repository/target/surefire-reports/*.xml
[linux-jdk10] Recording test results
[linux-jdk10] None of the test reports contained any result
[linux-jdk10] [withMaven] junitPublisher - Archive test results for Maven artifact org.apache.maven.archetype:archetype-proxy:3.0.2-SNAPSHOT generated by maven-surefire-plugin:test (default-test): m/archetype-testing/archetype-proxy/target/surefire-reports/*.xml
[linux-jdk10] Recording test results
[linux-jdk10] None of the test reports contained any result
[linux-jdk10] [withMaven] junitPublisher - Archive test results for Maven artifact org.apache.maven.archetype:archetype-common:3.0.2-SNAPSHOT generated by maven-surefire-plugin:test (default-test): m/archetype-common/target/surefire-reports/*.xml
[linux-jdk10] Recording test results
[linux-jdk10] [withMaven] junitPublisher - Archive test results for Maven artifact org.apache.maven.archetype:archetype-packaging:3.0.2-SNAPSHOT generated by maven-surefire-plugin:test (default-test): m/archetype-packaging/target/surefire-reports/*.xml
[linux-jdk10] Recording test results
[linux-jdk10] None of the test reports contained any result
[linux-jdk10] [withMaven] junitPublisher - Archive test results for Maven artifact org.apache.maven.plugins:maven-archetype-plugin:3.0.2-SNAPSHOT generated by maven-surefire-plugin:test (default-test): m/maven-archetype-plugin/target/surefire-reports/*.xml
[linux-jdk10] Recording test results
[linux-jdk10] [withMaven] junitPublisher - Archive test results for Maven artifact org.apache.maven.archetype:archetype-final:3.0.2-SNAPSHOT generated by maven-surefire-plugin:test (default-test): m/archetype-testing/archetype-final/target/surefire-reports/*.xml
[linux-jdk10] Recording test results
[linux-jdk10] None of the test reports contained any result
[linux-jdk10] [withMaven] junitPublisher - Archive test results for Maven artifact org.apache.maven.archetype:archetype-final:3.0.2-SNAPSHOT generated by maven-failsafe-plugin:integration-test (default): m/archetype-testing/archetype-final/target/failsafe-reports/*.xml
[linux-jdk10] Recording test results
[Pipeline] [windows-jdk7] }
[windows-jdk7] [withMaven] invokerPublisher - Archive invoker results for Maven artifact MavenArtifact{org.apache.maven.plugins:maven-archetype-plugin::3.0.2-SNAPSHOT(version: 3.0.2-SNAPSHOT, snapshot:false) } generated by PluginInvocation{org.apache.maven.plugins:maven-invoker-plugin:3.0.1@run  integration-test}: m\maven-archetype-plugin\target\invoker-reports\*.xml
[windows-jdk7] performing MavenInvokerRecorder, reportsFilenamePattern:'**/m\maven-archetype-plugin\target\invoker-reports/BUILD*.xml', invokerBuildDir:'**/m\maven-archetype-plugin\target\it\projects'
[windows-jdk7] Found reports:[f:\jenkins\jenkins-slave\workspace\-box_maven-archetype_master-7AVMJNUR3VZV7RPVUBCE43H65NYTRWAOYFWSDDPCNSCWDYBAGBVQ\m\maven-archetype-plugin\target\invoker-reports\BUILD-ARCHETYPE-241_filter-directory.xml, f:\jenkins\jenkins-slave\workspace\-box_maven-archetype_master-7AVMJNUR3VZV7RPVUBCE43H65NYTRWAOYFWSDDPCNSCWDYBAGBVQ\m\maven-archetype-plugin\target\invoker-reports\BUILD-ARCHETYPE-517_failing-goals.xml, f:\jenkins\jenkins-slave\workspace\-box_maven-archetype_master-7AVMJNUR3VZV7RPVUBCE43H65NYTRWAOYFWSDDPCNSCWDYBAGBVQ\m\maven-archetype-plugin\target\invoker-reports\BUILD-ARCHETYPE-520_mirror.xml, f:\jenkins\jenkins-slave\workspace\-box_maven-archetype_master-7AVMJNUR3VZV7RPVUBCE43H65NYTRWAOYFWSDDPCNSCWDYBAGBVQ\m\maven-archetype-plugin\target\invoker-reports\BUILD-ARCHETYPE-521_archetype-repo.xml, f:\jenkins\jenkins-slave\workspace\-box_maven-archetype_master-7AVMJNUR3VZV7RPVUBCE43H65NYTRWAOYFWSDDPCNSCWDYBAGBVQ\m\maven-archetype-plugin\target\invoker-reports\BUILD-build-archetype-and-run-its-with-existing-parent.xml, f:\jenkins\jenkins-slave\workspace\-box_maven-archetype_master-7AVMJNUR3VZV7RPVUBCE43H65NYTRWAOYFWSDDPCNSCWDYBAGBVQ\m\maven-archetype-plugin\target\invoker-reports\BUILD-build-archetype-ignore-eol-encoding.xml, f:\jenkins\jenkins-slave\workspace\-box_maven-archetype_master-7AVMJNUR3VZV7RPVUBCE43H65NYTRWAOYFWSDDPCNSCWDYBAGBVQ\m\maven-archetype-plugin\target\invoker-reports\BUILD-build-archetype.xml, f:\jenkins\jenkins-slave\workspace\-box_maven-archetype_master-7AVMJNUR3VZV7RPVUBCE43H65NYTRWAOYFWSDDPCNSCWDYBAGBVQ\m\maven-archetype-plugin\target\invoker-reports\BUILD-create-from-project-exclude-patterns.xml, f:\jenkins\jenkins-slave\workspace\-box_maven-archetype_master-7AVMJNUR3VZV7RPVUBCE43H65NYTRWAOYFWSDDPCNSCWDYBAGBVQ\m\maven-archetype-plugin\target\invoker-reports\BUILD-create-from-project.xml, f:\jenkins\jenkins-slave\workspace\-box_maven-archetype_master-7AVMJNUR3VZV7RPVUBCE43H65NYTRWAOYFWSDDPCNSCWDYBAGBVQ\m\maven-archetype-plugin\target\invoker-reports\BUILD-generate-basic.xml, f:\jenkins\jenkins-slave\workspace\-box_maven-archetype_master-7AVMJNUR3VZV7RPVUBCE43H65NYTRWAOYFWSDDPCNSCWDYBAGBVQ\m\maven-archetype-plugin\target\invoker-reports\BUILD-property-setting-cli.xml]
[windows-jdk7] Found logs:[f:\jenkins\jenkins-slave\workspace\-box_maven-archetype_master-7AVMJNUR3VZV7RPVUBCE43H65NYTRWAOYFWSDDPCNSCWDYBAGBVQ\m\maven-archetype-plugin\target\it\projects\ARCHETYPE-241_filter-directory\build.log, f:\jenkins\jenkins-slave\workspace\-box_maven-archetype_master-7AVMJNUR3VZV7RPVUBCE43H65NYTRWAOYFWSDDPCNSCWDYBAGBVQ\m\maven-archetype-plugin\target\it\projects\ARCHETYPE-517_failing-goals\build.log, f:\jenkins\jenkins-slave\workspace\-box_maven-archetype_master-7AVMJNUR3VZV7RPVUBCE43H65NYTRWAOYFWSDDPCNSCWDYBAGBVQ\m\maven-archetype-plugin\target\it\projects\ARCHETYPE-520_mirror\build.log, f:\jenkins\jenkins-slave\workspace\-box_maven-archetype_master-7AVMJNUR3VZV7RPVUBCE43H65NYTRWAOYFWSDDPCNSCWDYBAGBVQ\m\maven-archetype-plugin\target\it\projects\ARCHETYPE-521_archetype-repo\build.log, f:\jenkins\jenkins-slave\workspace\-box_maven-archetype_master-7AVMJNUR3VZV7RPVUBCE43H65NYTRWAOYFWSDDPCNSCWDYBAGBVQ\m\maven-archetype-plugin\target\it\projects\build-archetype-and-run-its-with-existing-parent\build.log, f:\jenkins\jenkins-slave\workspace\-box_maven-archetype_master-7AVMJNUR3VZV7RPVUBCE43H65NYTRWAOYFWSDDPCNSCWDYBAGBVQ\m\maven-archetype-plugin\target\it\projects\build-archetype-and-run-its-with-existing-parent\target\test-classes\projects\basic\project\project\basic\build.log, f:\jenkins\jenkins-slave\workspace\-box_maven-archetype_master-7AVMJNUR3VZV7RPVUBCE43H65NYTRWAOYFWSDDPCNSCWDYBAGBVQ\m\maven-archetype-plugin\target\it\projects\build-archetype-ignore-eol-encoding\build.log, f:\jenkins\jenkins-slave\workspace\-box_maven-archetype_master-7AVMJNUR3VZV7RPVUBCE43H65NYTRWAOYFWSDDPCNSCWDYBAGBVQ\m\maven-archetype-plugin\target\it\projects\build-archetype-ignore-eol-encoding\target\test-classes\projects\basic\project\basic\build.log, f:\jenkins\jenkins-slave\workspace\-box_maven-archetype_master-7AVMJNUR3VZV7RPVUBCE43H65NYTRWAOYFWSDDPCNSCWDYBAGBVQ\m\maven-archetype-plugin\target\it\projects\build-archetype\build.log, f:\jenkins\jenkins-slave\workspace\-box_maven-archetype_master-7AVMJNUR3VZV7RPVUBCE43H65NYTRWAOYFWSDDPCNSCWDYBAGBVQ\m\maven-archetype-plugin\target\it\projects\build-archetype\target\test-classes\projects\basic\project\basic\build.log, f:\jenkins\jenkins-slave\workspace\-box_maven-archetype_master-7AVMJNUR3VZV7RPVUBCE43H65NYTRWAOYFWSDDPCNSCWDYBAGBVQ\m\maven-archetype-plugin\target\it\projects\create-from-project-exclude-patterns\build.log, f:\jenkins\jenkins-slave\workspace\-box_maven-archetype_master-7AVMJNUR3VZV7RPVUBCE43H65NYTRWAOYFWSDDPCNSCWDYBAGBVQ\m\maven-archetype-plugin\target\it\projects\create-from-project-exclude-patterns\target\generated-sources\archetype\src\main\resources\archetype-resources\build.log, f:\jenkins\jenkins-slave\workspace\-box_maven-archetype_master-7AVMJNUR3VZV7RPVUBCE43H65NYTRWAOYFWSDDPCNSCWDYBAGBVQ\m\maven-archetype-plugin\target\it\projects\create-from-project-exclude-patterns\target\generated-sources\archetype\target\classes\archetype-resources\build.log, f:\jenkins\jenkins-slave\workspace\-box_maven-archetype_master-7AVMJNUR3VZV7RPVUBCE43H65NYTRWAOYFWSDDPCNSCWDYBAGBVQ\m\maven-archetype-plugin\target\it\projects\create-from-project\build.log, f:\jenkins\jenkins-slave\workspace\-box_maven-archetype_master-7AVMJNUR3VZV7RPVUBCE43H65NYTRWAOYFWSDDPCNSCWDYBAGBVQ\m\maven-archetype-plugin\target\it\projects\create-from-project\target\generated-sources\archetype\src\main\resources\archetype-resources\build.log, f:\jenkins\jenkins-slave\workspace\-box_maven-archetype_master-7AVMJNUR3VZV7RPVUBCE43H65NYTRWAOYFWSDDPCNSCWDYBAGBVQ\m\maven-archetype-plugin\target\it\projects\create-from-project\target\generated-sources\archetype\target\classes\archetype-resources\build.log, f:\jenkins\jenkins-slave\workspace\-box_maven-archetype_master-7AVMJNUR3VZV7RPVUBCE43H65NYTRWAOYFWSDDPCNSCWDYBAGBVQ\m\maven-archetype-plugin\target\it\projects\generate-basic\build.log, f:\jenkins\jenkins-slave\workspace\-box_maven-archetype_master-7AVMJNUR3VZV7RPVUBCE43H65NYTRWAOYFWSDDPCNSCWDYBAGBVQ\m\maven-archetype-plugin\target\it\projects\property-setting-cli\build.log]
[windows-jdk7] Finished parsing Maven Invoker results (found 11)
[windows-jdk7] [withMaven] junitPublisher - Archive test results for Maven artifact org.apache.maven.archetype:archetype-catalog:3.0.2-SNAPSHOT generated by maven-surefire-plugin:test (default-test): m\archetype-models\archetype-catalog\target\surefire-reports\*.xml
[windows-jdk7] Recording test results
[windows-jdk7] None of the test reports contained any result
[windows-jdk7] [withMaven] junitPublisher - Archive test results for Maven artifact org.apache.maven.archetype:archetype-descriptor:3.0.2-SNAPSHOT generated by maven-surefire-plugin:test (default-test): m\archetype-models\archetype-descriptor\target\surefire-reports\*.xml
[windows-jdk7] Recording test results
[windows-jdk7] None of the test reports contained any result
[windows-jdk7] [withMaven] junitPublisher - Archive test results for Maven artifact org.apache.maven.archetype:archetype-repository:3.0.2-SNAPSHOT generated by maven-surefire-plugin:test (default-test): m\archetype-testing\archetype-repository\target\surefire-reports\*.xml
[windows-jdk7] Recording test results
[windows-jdk7] None of the test reports contained any result
[windows-jdk7] [withMaven] junitPublisher - Archive test results for Maven artifact org.apache.maven.archetype:archetype-proxy:3.0.2-SNAPSHOT generated by maven-surefire-plugin:test (default-test): m\archetype-testing\archetype-proxy\target\surefire-reports\*.xml
[windows-jdk7] Recording test results
[windows-jdk7] None of the test reports contained any result
[windows-jdk7] [withMaven] junitPublisher - Archive test results for Maven artifact org.apache.maven.archetype:archetype-common:3.0.2-SNAPSHOT generated by maven-surefire-plugin:test (default-test): m\archetype-common\target\surefire-reports\*.xml
[windows-jdk7] Recording test results
[windows-jdk7] [withMaven] junitPublisher - Archive test results for Maven artifact org.apache.maven.archetype:archetype-packaging:3.0.2-SNAPSHOT generated by maven-surefire-plugin:test (default-test): m\archetype-packaging\target\surefire-reports\*.xml
[windows-jdk7] Recording test results
[windows-jdk7] None of the test reports contained any result
[windows-jdk7] [withMaven] junitPublisher - Archive test results for Maven artifact org.apache.maven.plugins:maven-archetype-plugin:3.0.2-SNAPSHOT generated by maven-surefire-plugin:test (default-test): m\maven-archetype-plugin\target\surefire-reports\*.xml
[windows-jdk7] Recording test results
[windows-jdk7] [withMaven] junitPublisher - Archive test results for Maven artifact org.apache.maven.archetype:archetype-final:3.0.2-SNAPSHOT generated by maven-surefire-plugin:test (default-test): m\archetype-testing\archetype-final\target\surefire-reports\*.xml
[windows-jdk7] Recording test results
[windows-jdk7] None of the test reports contained any result
[windows-jdk7] [withMaven] junitPublisher - Archive test results for Maven artifact org.apache.maven.archetype:archetype-final:3.0.2-SNAPSHOT generated by maven-failsafe-plugin:integration-test (default): m\archetype-testing\archetype-final\target\failsafe-reports\*.xml
[windows-jdk7] Recording test results
[Pipeline] [windows-jdk8] }
[windows-jdk8] [withMaven] invokerPublisher - Archive invoker results for Maven artifact MavenArtifact{org.apache.maven.plugins:maven-archetype-plugin::3.0.2-SNAPSHOT(version: 3.0.2-SNAPSHOT, snapshot:false) } generated by PluginInvocation{org.apache.maven.plugins:maven-invoker-plugin:3.0.1@run  integration-test}: m\maven-archetype-plugin\target\invoker-reports\*.xml
[windows-jdk8] performing MavenInvokerRecorder, reportsFilenamePattern:'**/m\maven-archetype-plugin\target\invoker-reports/BUILD*.xml', invokerBuildDir:'**/m\maven-archetype-plugin\target\it\projects'
[windows-jdk8] Found reports:[f:\jenkins\jenkins-slave\workspace\-box_maven-archetype_master-7AVMJNUR3VZV7RPVUBCE43H65NYTRWAOYFWSDDPCNSCWDYBAGBVQ\m\maven-archetype-plugin\target\invoker-reports\BUILD-ARCHETYPE-241_filter-directory.xml, f:\jenkins\jenkins-slave\workspace\-box_maven-archetype_master-7AVMJNUR3VZV7RPVUBCE43H65NYTRWAOYFWSDDPCNSCWDYBAGBVQ\m\maven-archetype-plugin\target\invoker-reports\BUILD-ARCHETYPE-517_failing-goals.xml, f:\jenkins\jenkins-slave\workspace\-box_maven-archetype_master-7AVMJNUR3VZV7RPVUBCE43H65NYTRWAOYFWSDDPCNSCWDYBAGBVQ\m\maven-archetype-plugin\target\invoker-reports\BUILD-ARCHETYPE-520_mirror.xml, f:\jenkins\jenkins-slave\workspace\-box_maven-archetype_master-7AVMJNUR3VZV7RPVUBCE43H65NYTRWAOYFWSDDPCNSCWDYBAGBVQ\m\maven-archetype-plugin\target\invoker-reports\BUILD-ARCHETYPE-521_archetype-repo.xml, f:\jenkins\jenkins-slave\workspace\-box_maven-archetype_master-7AVMJNUR3VZV7RPVUBCE43H65NYTRWAOYFWSDDPCNSCWDYBAGBVQ\m\maven-archetype-plugin\target\invoker-reports\BUILD-build-archetype-and-run-its-with-existing-parent.xml, f:\jenkins\jenkins-slave\workspace\-box_maven-archetype_master-7AVMJNUR3VZV7RPVUBCE43H65NYTRWAOYFWSDDPCNSCWDYBAGBVQ\m\maven-archetype-plugin\target\invoker-reports\BUILD-build-archetype-ignore-eol-encoding.xml, f:\jenkins\jenkins-slave\workspace\-box_maven-archetype_master-7AVMJNUR3VZV7RPVUBCE43H65NYTRWAOYFWSDDPCNSCWDYBAGBVQ\m\maven-archetype-plugin\target\invoker-reports\BUILD-build-archetype.xml, f:\jenkins\jenkins-slave\workspace\-box_maven-archetype_master-7AVMJNUR3VZV7RPVUBCE43H65NYTRWAOYFWSDDPCNSCWDYBAGBVQ\m\maven-archetype-plugin\target\invoker-reports\BUILD-create-from-project-exclude-patterns.xml, f:\jenkins\jenkins-slave\workspace\-box_maven-archetype_master-7AVMJNUR3VZV7RPVUBCE43H65NYTRWAOYFWSDDPCNSCWDYBAGBVQ\m\maven-archetype-plugin\target\invoker-reports\BUILD-create-from-project.xml, f:\jenkins\jenkins-slave\workspace\-box_maven-archetype_master-7AVMJNUR3VZV7RPVUBCE43H65NYTRWAOYFWSDDPCNSCWDYBAGBVQ\m\maven-archetype-plugin\target\invoker-reports\BUILD-generate-basic.xml, f:\jenkins\jenkins-slave\workspace\-box_maven-archetype_master-7AVMJNUR3VZV7RPVUBCE43H65NYTRWAOYFWSDDPCNSCWDYBAGBVQ\m\maven-archetype-plugin\target\invoker-reports\BUILD-property-setting-cli.xml]
[windows-jdk8] Found logs:[f:\jenkins\jenkins-slave\workspace\-box_maven-archetype_master-7AVMJNUR3VZV7RPVUBCE43H65NYTRWAOYFWSDDPCNSCWDYBAGBVQ\m\maven-archetype-plugin\target\it\projects\ARCHETYPE-241_filter-directory\build.log, f:\jenkins\jenkins-slave\workspace\-box_maven-archetype_master-7AVMJNUR3VZV7RPVUBCE43H65NYTRWAOYFWSDDPCNSCWDYBAGBVQ\m\maven-archetype-plugin\target\it\projects\ARCHETYPE-517_failing-goals\build.log, f:\jenkins\jenkins-slave\workspace\-box_maven-archetype_master-7AVMJNUR3VZV7RPVUBCE43H65NYTRWAOYFWSDDPCNSCWDYBAGBVQ\m\maven-archetype-plugin\target\it\projects\ARCHETYPE-520_mirror\build.log, f:\jenkins\jenkins-slave\workspace\-box_maven-archetype_master-7AVMJNUR3VZV7RPVUBCE43H65NYTRWAOYFWSDDPCNSCWDYBAGBVQ\m\maven-archetype-plugin\target\it\projects\ARCHETYPE-521_archetype-repo\build.log, f:\jenkins\jenkins-slave\workspace\-box_maven-archetype_master-7AVMJNUR3VZV7RPVUBCE43H65NYTRWAOYFWSDDPCNSCWDYBAGBVQ\m\maven-archetype-plugin\target\it\projects\build-archetype-and-run-its-with-existing-parent\build.log, f:\jenkins\jenkins-slave\workspace\-box_maven-archetype_master-7AVMJNUR3VZV7RPVUBCE43H65NYTRWAOYFWSDDPCNSCWDYBAGBVQ\m\maven-archetype-plugin\target\it\projects\build-archetype-and-run-its-with-existing-parent\target\test-classes\projects\basic\project\project\basic\build.log, f:\jenkins\jenkins-slave\workspace\-box_maven-archetype_master-7AVMJNUR3VZV7RPVUBCE43H65NYTRWAOYFWSDDPCNSCWDYBAGBVQ\m\maven-archetype-plugin\target\it\projects\build-archetype-ignore-eol-encoding\build.log, f:\jenkins\jenkins-slave\workspace\-box_maven-archetype_master-7AVMJNUR3VZV7RPVUBCE43H65NYTRWAOYFWSDDPCNSCWDYBAGBVQ\m\maven-archetype-plugin\target\it\projects\build-archetype-ignore-eol-encoding\target\test-classes\projects\basic\project\basic\build.log, f:\jenkins\jenkins-slave\workspace\-box_maven-archetype_master-7AVMJNUR3VZV7RPVUBCE43H65NYTRWAOYFWSDDPCNSCWDYBAGBVQ\m\maven-archetype-plugin\target\it\projects\build-archetype\build.log, f:\jenkins\jenkins-slave\workspace\-box_maven-archetype_master-7AVMJNUR3VZV7RPVUBCE43H65NYTRWAOYFWSDDPCNSCWDYBAGBVQ\m\maven-archetype-plugin\target\it\projects\build-archetype\target\test-classes\projects\basic\project\basic\build.log, f:\jenkins\jenkins-slave\workspace\-box_maven-archetype_master-7AVMJNUR3VZV7RPVUBCE43H65NYTRWAOYFWSDDPCNSCWDYBAGBVQ\m\maven-archetype-plugin\target\it\projects\create-from-project-exclude-patterns\build.log, f:\jenkins\jenkins-slave\workspace\-box_maven-archetype_master-7AVMJNUR3VZV7RPVUBCE43H65NYTRWAOYFWSDDPCNSCWDYBAGBVQ\m\maven-archetype-plugin\target\it\projects\create-from-project-exclude-patterns\target\generated-sources\archetype\src\main\resources\archetype-resources\build.log, f:\jenkins\jenkins-slave\workspace\-box_maven-archetype_master-7AVMJNUR3VZV7RPVUBCE43H65NYTRWAOYFWSDDPCNSCWDYBAGBVQ\m\maven-archetype-plugin\target\it\projects\create-from-project-exclude-patterns\target\generated-sources\archetype\target\classes\archetype-resources\build.log, f:\jenkins\jenkins-slave\workspace\-box_maven-archetype_master-7AVMJNUR3VZV7RPVUBCE43H65NYTRWAOYFWSDDPCNSCWDYBAGBVQ\m\maven-archetype-plugin\target\it\projects\create-from-project\build.log, f:\jenkins\jenkins-slave\workspace\-box_maven-archetype_master-7AVMJNUR3VZV7RPVUBCE43H65NYTRWAOYFWSDDPCNSCWDYBAGBVQ\m\maven-archetype-plugin\target\it\projects\create-from-project\target\generated-sources\archetype\src\main\resources\archetype-resources\build.log, f:\jenkins\jenkins-slave\workspace\-box_maven-archetype_master-7AVMJNUR3VZV7RPVUBCE43H65NYTRWAOYFWSDDPCNSCWDYBAGBVQ\m\maven-archetype-plugin\target\it\projects\create-from-project\target\generated-sources\archetype\target\classes\archetype-resources\build.log, f:\jenkins\jenkins-slave\workspace\-box_maven-archetype_master-7AVMJNUR3VZV7RPVUBCE43H65NYTRWAOYFWSDDPCNSCWDYBAGBVQ\m\maven-archetype-plugin\target\it\projects\generate-basic\build.log, f:\jenkins\jenkins-slave\workspace\-box_maven-archetype_master-7AVMJNUR3VZV7RPVUBCE43H65NYTRWAOYFWSDDPCNSCWDYBAGBVQ\m\maven-archetype-plugin\target\it\projects\property-setting-cli\build.log]
[windows-jdk8] Finished parsing Maven Invoker results (found 11)
[windows-jdk8] [withMaven] junitPublisher - Archive test results for Maven artifact org.apache.maven.archetype:archetype-catalog:3.0.2-SNAPSHOT generated by maven-surefire-plugin:test (default-test): m\archetype-models\archetype-catalog\target\surefire-reports\*.xml
[windows-jdk8] Recording test results
[windows-jdk8] None of the test reports contained any result
[windows-jdk8] [withMaven] junitPublisher - Archive test results for Maven artifact org.apache.maven.archetype:archetype-descriptor:3.0.2-SNAPSHOT generated by maven-surefire-plugin:test (default-test): m\archetype-models\archetype-descriptor\target\surefire-reports\*.xml
[windows-jdk8] Recording test results
[windows-jdk8] None of the test reports contained any result
[windows-jdk8] [withMaven] junitPublisher - Archive test results for Maven artifact org.apache.maven.archetype:archetype-repository:3.0.2-SNAPSHOT generated by maven-surefire-plugin:test (default-test): m\archetype-testing\archetype-repository\target\surefire-reports\*.xml
[windows-jdk8] Recording test results
[windows-jdk8] None of the test reports contained any result
[windows-jdk8] [withMaven] junitPublisher - Archive test results for Maven artifact org.apache.maven.archetype:archetype-proxy:3.0.2-SNAPSHOT generated by maven-surefire-plugin:test (default-test): m\archetype-testing\archetype-proxy\target\surefire-reports\*.xml
[windows-jdk8] Recording test results
[windows-jdk8] None of the test reports contained any result
[windows-jdk8] [withMaven] junitPublisher - Archive test results for Maven artifact org.apache.maven.archetype:archetype-common:3.0.2-SNAPSHOT generated by maven-surefire-plugin:test (default-test): m\archetype-common\target\surefire-reports\*.xml
[windows-jdk8] Recording test results
[windows-jdk8] [withMaven] junitPublisher - Archive test results for Maven artifact org.apache.maven.archetype:archetype-packaging:3.0.2-SNAPSHOT generated by maven-surefire-plugin:test (default-test): m\archetype-packaging\target\surefire-reports\*.xml
[windows-jdk8] Recording test results
[windows-jdk8] None of the test reports contained any result
[windows-jdk8] [withMaven] junitPublisher - Archive test results for Maven artifact org.apache.maven.plugins:maven-archetype-plugin:3.0.2-SNAPSHOT generated by maven-surefire-plugin:test (default-test): m\maven-archetype-plugin\target\surefire-reports\*.xml
[windows-jdk8] Recording test results
[windows-jdk8] [withMaven] junitPublisher - Archive test results for Maven artifact org.apache.maven.archetype:archetype-final:3.0.2-SNAPSHOT generated by maven-surefire-plugin:test (default-test): m\archetype-testing\archetype-final\target\surefire-reports\*.xml
[windows-jdk8] Recording test results
[windows-jdk8] None of the test reports contained any result
[windows-jdk8] [withMaven] junitPublisher - Archive test results for Maven artifact org.apache.maven.archetype:archetype-final:3.0.2-SNAPSHOT generated by maven-failsafe-plugin:integration-test (default): m\archetype-testing\archetype-final\target\failsafe-reports\*.xml
[windows-jdk8] Recording test results
[Pipeline] [windows-jdk10] }
[windows-jdk10] [withMaven] invokerPublisher - Archive invoker results for Maven artifact MavenArtifact{org.apache.maven.plugins:maven-archetype-plugin::3.0.2-SNAPSHOT(version: 3.0.2-SNAPSHOT, snapshot:false) } generated by PluginInvocation{org.apache.maven.plugins:maven-invoker-plugin:3.0.1@run  integration-test}: m\maven-archetype-plugin\target\invoker-reports\*.xml
[windows-jdk10] performing MavenInvokerRecorder, reportsFilenamePattern:'**/m\maven-archetype-plugin\target\invoker-reports/BUILD*.xml', invokerBuildDir:'**/m\maven-archetype-plugin\target\it\projects'
[windows-jdk10] Found reports:[f:\jenkins\jenkins-slave\workspace\-box_maven-archetype_master-7AVMJNUR3VZV7RPVUBCE43H65NYTRWAOYFWSDDPCNSCWDYBAGBVQ\m\maven-archetype-plugin\target\invoker-reports\BUILD-ARCHETYPE-241_filter-directory.xml, f:\jenkins\jenkins-slave\workspace\-box_maven-archetype_master-7AVMJNUR3VZV7RPVUBCE43H65NYTRWAOYFWSDDPCNSCWDYBAGBVQ\m\maven-archetype-plugin\target\invoker-reports\BUILD-ARCHETYPE-517_failing-goals.xml, f:\jenkins\jenkins-slave\workspace\-box_maven-archetype_master-7AVMJNUR3VZV7RPVUBCE43H65NYTRWAOYFWSDDPCNSCWDYBAGBVQ\m\maven-archetype-plugin\target\invoker-reports\BUILD-ARCHETYPE-520_mirror.xml, f:\jenkins\jenkins-slave\workspace\-box_maven-archetype_master-7AVMJNUR3VZV7RPVUBCE43H65NYTRWAOYFWSDDPCNSCWDYBAGBVQ\m\maven-archetype-plugin\target\invoker-reports\BUILD-ARCHETYPE-521_archetype-repo.xml, f:\jenkins\jenkins-slave\workspace\-box_maven-archetype_master-7AVMJNUR3VZV7RPVUBCE43H65NYTRWAOYFWSDDPCNSCWDYBAGBVQ\m\maven-archetype-plugin\target\invoker-reports\BUILD-build-archetype-and-run-its-with-existing-parent.xml, f:\jenkins\jenkins-slave\workspace\-box_maven-archetype_master-7AVMJNUR3VZV7RPVUBCE43H65NYTRWAOYFWSDDPCNSCWDYBAGBVQ\m\maven-archetype-plugin\target\invoker-reports\BUILD-build-archetype-ignore-eol-encoding.xml, f:\jenkins\jenkins-slave\workspace\-box_maven-archetype_master-7AVMJNUR3VZV7RPVUBCE43H65NYTRWAOYFWSDDPCNSCWDYBAGBVQ\m\maven-archetype-plugin\target\invoker-reports\BUILD-build-archetype.xml, f:\jenkins\jenkins-slave\workspace\-box_maven-archetype_master-7AVMJNUR3VZV7RPVUBCE43H65NYTRWAOYFWSDDPCNSCWDYBAGBVQ\m\maven-archetype-plugin\target\invoker-reports\BUILD-create-from-project-exclude-patterns.xml, f:\jenkins\jenkins-slave\workspace\-box_maven-archetype_master-7AVMJNUR3VZV7RPVUBCE43H65NYTRWAOYFWSDDPCNSCWDYBAGBVQ\m\maven-archetype-plugin\target\invoker-reports\BUILD-create-from-project.xml, f:\jenkins\jenkins-slave\workspace\-box_maven-archetype_master-7AVMJNUR3VZV7RPVUBCE43H65NYTRWAOYFWSDDPCNSCWDYBAGBVQ\m\maven-archetype-plugin\target\invoker-reports\BUILD-generate-basic.xml, f:\jenkins\jenkins-slave\workspace\-box_maven-archetype_master-7AVMJNUR3VZV7RPVUBCE43H65NYTRWAOYFWSDDPCNSCWDYBAGBVQ\m\maven-archetype-plugin\target\invoker-reports\BUILD-property-setting-cli.xml]
[windows-jdk10] Found logs:[f:\jenkins\jenkins-slave\workspace\-box_maven-archetype_master-7AVMJNUR3VZV7RPVUBCE43H65NYTRWAOYFWSDDPCNSCWDYBAGBVQ\m\maven-archetype-plugin\target\it\projects\ARCHETYPE-241_filter-directory\build.log, f:\jenkins\jenkins-slave\workspace\-box_maven-archetype_master-7AVMJNUR3VZV7RPVUBCE43H65NYTRWAOYFWSDDPCNSCWDYBAGBVQ\m\maven-archetype-plugin\target\it\projects\ARCHETYPE-517_failing-goals\build.log, f:\jenkins\jenkins-slave\workspace\-box_maven-archetype_master-7AVMJNUR3VZV7RPVUBCE43H65NYTRWAOYFWSDDPCNSCWDYBAGBVQ\m\maven-archetype-plugin\target\it\projects\ARCHETYPE-520_mirror\build.log, f:\jenkins\jenkins-slave\workspace\-box_maven-archetype_master-7AVMJNUR3VZV7RPVUBCE43H65NYTRWAOYFWSDDPCNSCWDYBAGBVQ\m\maven-archetype-plugin\target\it\projects\ARCHETYPE-521_archetype-repo\build.log, f:\jenkins\jenkins-slave\workspace\-box_maven-archetype_master-7AVMJNUR3VZV7RPVUBCE43H65NYTRWAOYFWSDDPCNSCWDYBAGBVQ\m\maven-archetype-plugin\target\it\projects\build-archetype-and-run-its-with-existing-parent\build.log, f:\jenkins\jenkins-slave\workspace\-box_maven-archetype_master-7AVMJNUR3VZV7RPVUBCE43H65NYTRWAOYFWSDDPCNSCWDYBAGBVQ\m\maven-archetype-plugin\target\it\projects\build-archetype-and-run-its-with-existing-parent\target\test-classes\projects\basic\project\project\basic\build.log, f:\jenkins\jenkins-slave\workspace\-box_maven-archetype_master-7AVMJNUR3VZV7RPVUBCE43H65NYTRWAOYFWSDDPCNSCWDYBAGBVQ\m\maven-archetype-plugin\target\it\projects\build-archetype-ignore-eol-encoding\build.log, f:\jenkins\jenkins-slave\workspace\-box_maven-archetype_master-7AVMJNUR3VZV7RPVUBCE43H65NYTRWAOYFWSDDPCNSCWDYBAGBVQ\m\maven-archetype-plugin\target\it\projects\build-archetype-ignore-eol-encoding\target\test-classes\projects\basic\project\basic\build.log, f:\jenkins\jenkins-slave\workspace\-box_maven-archetype_master-7AVMJNUR3VZV7RPVUBCE43H65NYTRWAOYFWSDDPCNSCWDYBAGBVQ\m\maven-archetype-plugin\target\it\projects\build-archetype\build.log, f:\jenkins\jenkins-slave\workspace\-box_maven-archetype_master-7AVMJNUR3VZV7RPVUBCE43H65NYTRWAOYFWSDDPCNSCWDYBAGBVQ\m\maven-archetype-plugin\target\it\projects\build-archetype\target\test-classes\projects\basic\project\basic\build.log, f:\jenkins\jenkins-slave\workspace\-box_maven-archetype_master-7AVMJNUR3VZV7RPVUBCE43H65NYTRWAOYFWSDDPCNSCWDYBAGBVQ\m\maven-archetype-plugin\target\it\projects\create-from-project-exclude-patterns\build.log, f:\jenkins\jenkins-slave\workspace\-box_maven-archetype_master-7AVMJNUR3VZV7RPVUBCE43H65NYTRWAOYFWSDDPCNSCWDYBAGBVQ\m\maven-archetype-plugin\target\it\projects\create-from-project-exclude-patterns\target\generated-sources\archetype\src\main\resources\archetype-resources\build.log, f:\jenkins\jenkins-slave\workspace\-box_maven-archetype_master-7AVMJNUR3VZV7RPVUBCE43H65NYTRWAOYFWSDDPCNSCWDYBAGBVQ\m\maven-archetype-plugin\target\it\projects\create-from-project-exclude-patterns\target\generated-sources\archetype\target\classes\archetype-resources\build.log, f:\jenkins\jenkins-slave\workspace\-box_maven-archetype_master-7AVMJNUR3VZV7RPVUBCE43H65NYTRWAOYFWSDDPCNSCWDYBAGBVQ\m\maven-archetype-plugin\target\it\projects\create-from-project\build.log, f:\jenkins\jenkins-slave\workspace\-box_maven-archetype_master-7AVMJNUR3VZV7RPVUBCE43H65NYTRWAOYFWSDDPCNSCWDYBAGBVQ\m\maven-archetype-plugin\target\it\projects\create-from-project\target\generated-sources\archetype\src\main\resources\archetype-resources\build.log, f:\jenkins\jenkins-slave\workspace\-box_maven-archetype_master-7AVMJNUR3VZV7RPVUBCE43H65NYTRWAOYFWSDDPCNSCWDYBAGBVQ\m\maven-archetype-plugin\target\it\projects\create-from-project\target\generated-sources\archetype\target\classes\archetype-resources\build.log, f:\jenkins\jenkins-slave\workspace\-box_maven-archetype_master-7AVMJNUR3VZV7RPVUBCE43H65NYTRWAOYFWSDDPCNSCWDYBAGBVQ\m\maven-archetype-plugin\target\it\projects\generate-basic\build.log, f:\jenkins\jenkins-slave\workspace\-box_maven-archetype_master-7AVMJNUR3VZV7RPVUBCE43H65NYTRWAOYFWSDDPCNSCWDYBAGBVQ\m\maven-archetype-plugin\target\it\projects\property-setting-cli\build.log]
[windows-jdk10] Finished parsing Maven Invoker results (found 11)
[windows-jdk10] [withMaven] junitPublisher - Archive test results for Maven artifact org.apache.maven.archetype:archetype-catalog:3.0.2-SNAPSHOT generated by maven-surefire-plugin:test (default-test): m\archetype-models\archetype-catalog\target\surefire-reports\*.xml
[windows-jdk10] Recording test results
[windows-jdk10] None of the test reports contained any result
[windows-jdk10] [withMaven] junitPublisher - Archive test results for Maven artifact org.apache.maven.archetype:archetype-descriptor:3.0.2-SNAPSHOT generated by maven-surefire-plugin:test (default-test): m\archetype-models\archetype-descriptor\target\surefire-reports\*.xml
[windows-jdk10] Recording test results
[windows-jdk10] None of the test reports contained any result
[windows-jdk10] [withMaven] junitPublisher - Archive test results for Maven artifact org.apache.maven.archetype:archetype-repository:3.0.2-SNAPSHOT generated by maven-surefire-plugin:test (default-test): m\archetype-testing\archetype-repository\target\surefire-reports\*.xml
[windows-jdk10] Recording test results
[windows-jdk10] None of the test reports contained any result
[windows-jdk10] [withMaven] junitPublisher - Archive test results for Maven artifact org.apache.maven.archetype:archetype-proxy:3.0.2-SNAPSHOT generated by maven-surefire-plugin:test (default-test): m\archetype-testing\archetype-proxy\target\surefire-reports\*.xml
[windows-jdk10] Recording test results
[windows-jdk10] None of the test reports contained any result
[windows-jdk10] [withMaven] junitPublisher - Archive test results for Maven artifact org.apache.maven.archetype:archetype-common:3.0.2-SNAPSHOT generated by maven-surefire-plugin:test (default-test): m\archetype-common\target\surefire-reports\*.xml
[windows-jdk10] Recording test results
[windows-jdk10] [withMaven] junitPublisher - Archive test results for Maven artifact org.apache.maven.archetype:archetype-packaging:3.0.2-SNAPSHOT generated by maven-surefire-plugin:test (default-test): m\archetype-packaging\target\surefire-reports\*.xml
[windows-jdk10] Recording test results
[windows-jdk10] None of the test reports contained any result
[windows-jdk10] [withMaven] junitPublisher - Archive test results for Maven artifact org.apache.maven.plugins:maven-archetype-plugin:3.0.2-SNAPSHOT generated by maven-surefire-plugin:test (default-test): m\maven-archetype-plugin\target\surefire-reports\*.xml
[windows-jdk10] Recording test results
[windows-jdk10] [withMaven] junitPublisher - Archive test results for Maven artifact org.apache.maven.archetype:archetype-final:3.0.2-SNAPSHOT generated by maven-surefire-plugin:test (default-test): m\archetype-testing\archetype-final\target\surefire-reports\*.xml
[windows-jdk10] Recording test results
[windows-jdk10] None of the test reports contained any result
[windows-jdk10] [withMaven] junitPublisher - Archive test results for Maven artifact org.apache.maven.archetype:archetype-final:3.0.2-SNAPSHOT generated by maven-failsafe-plugin:integration-test (default): m\archetype-testing\archetype-final\target\failsafe-reports\*.xml
[windows-jdk10] Recording test results
[Pipeline] [linux-jdk7] // node
[Pipeline] [linux-jdk9] // withMaven
[Pipeline] [linux-jdk10] // withMaven
[Pipeline] [windows-jdk7] // withMaven
[Pipeline] [windows-jdk8] // withMaven
[Pipeline] [windows-jdk10] // withMaven
[Pipeline] [linux-jdk7] }
[Pipeline] [linux-jdk9] }
[Pipeline] [linux-jdk10] }
[Pipeline] [windows-jdk7] }
[Pipeline] [windows-jdk8] }
[Pipeline] [windows-jdk9] }
[Pipeline] [windows-jdk10] }
[Pipeline] [linux-jdk9] // stage
[Pipeline] [linux-jdk10] // stage
[Pipeline] [windows-jdk7] // stage
[Pipeline] [windows-jdk8] // stage
[Pipeline] [windows-jdk9] // dir
[Pipeline] [windows-jdk10] // stage
[Pipeline] [linux-jdk9] }
[Pipeline] [linux-jdk10] }
[Pipeline] [windows-jdk7] }
[Pipeline] [windows-jdk8] }
[Pipeline] [windows-jdk10] }
[Pipeline] [windows-jdk9] }
[windows-jdk9] [withMaven] invokerPublisher - Archive invoker results for Maven artifact MavenArtifact{org.apache.maven.plugins:maven-archetype-plugin::3.0.2-SNAPSHOT(version: 3.0.2-SNAPSHOT, snapshot:false) } generated by PluginInvocation{org.apache.maven.plugins:maven-invoker-plugin:3.0.1@run  integration-test}: m\maven-archetype-plugin\target\invoker-reports\*.xml
[windows-jdk9] performing MavenInvokerRecorder, reportsFilenamePattern:'**/m\maven-archetype-plugin\target\invoker-reports/BUILD*.xml', invokerBuildDir:'**/m\maven-archetype-plugin\target\it\projects'
[windows-jdk9] Found reports:[f:\jenkins\jenkins-slave\workspace\-box_maven-archetype_master-7AVMJNUR3VZV7RPVUBCE43H65NYTRWAOYFWSDDPCNSCWDYBAGBVQ\m\maven-archetype-plugin\target\invoker-reports\BUILD-ARCHETYPE-241_filter-directory.xml, f:\jenkins\jenkins-slave\workspace\-box_maven-archetype_master-7AVMJNUR3VZV7RPVUBCE43H65NYTRWAOYFWSDDPCNSCWDYBAGBVQ\m\maven-archetype-plugin\target\invoker-reports\BUILD-ARCHETYPE-517_failing-goals.xml, f:\jenkins\jenkins-slave\workspace\-box_maven-archetype_master-7AVMJNUR3VZV7RPVUBCE43H65NYTRWAOYFWSDDPCNSCWDYBAGBVQ\m\maven-archetype-plugin\target\invoker-reports\BUILD-ARCHETYPE-520_mirror.xml, f:\jenkins\jenkins-slave\workspace\-box_maven-archetype_master-7AVMJNUR3VZV7RPVUBCE43H65NYTRWAOYFWSDDPCNSCWDYBAGBVQ\m\maven-archetype-plugin\target\invoker-reports\BUILD-ARCHETYPE-521_archetype-repo.xml, f:\jenkins\jenkins-slave\workspace\-box_maven-archetype_master-7AVMJNUR3VZV7RPVUBCE43H65NYTRWAOYFWSDDPCNSCWDYBAGBVQ\m\maven-archetype-plugin\target\invoker-reports\BUILD-build-archetype-and-run-its-with-existing-parent.xml, f:\jenkins\jenkins-slave\workspace\-box_maven-archetype_master-7AVMJNUR3VZV7RPVUBCE43H65NYTRWAOYFWSDDPCNSCWDYBAGBVQ\m\maven-archetype-plugin\target\invoker-reports\BUILD-build-archetype-ignore-eol-encoding.xml, f:\jenkins\jenkins-slave\workspace\-box_maven-archetype_master-7AVMJNUR3VZV7RPVUBCE43H65NYTRWAOYFWSDDPCNSCWDYBAGBVQ\m\maven-archetype-plugin\target\invoker-reports\BUILD-build-archetype.xml, f:\jenkins\jenkins-slave\workspace\-box_maven-archetype_master-7AVMJNUR3VZV7RPVUBCE43H65NYTRWAOYFWSDDPCNSCWDYBAGBVQ\m\maven-archetype-plugin\target\invoker-reports\BUILD-create-from-project-exclude-patterns.xml, f:\jenkins\jenkins-slave\workspace\-box_maven-archetype_master-7AVMJNUR3VZV7RPVUBCE43H65NYTRWAOYFWSDDPCNSCWDYBAGBVQ\m\maven-archetype-plugin\target\invoker-reports\BUILD-create-from-project.xml, f:\jenkins\jenkins-slave\workspace\-box_maven-archetype_master-7AVMJNUR3VZV7RPVUBCE43H65NYTRWAOYFWSDDPCNSCWDYBAGBVQ\m\maven-archetype-plugin\target\invoker-reports\BUILD-generate-basic.xml, f:\jenkins\jenkins-slave\workspace\-box_maven-archetype_master-7AVMJNUR3VZV7RPVUBCE43H65NYTRWAOYFWSDDPCNSCWDYBAGBVQ\m\maven-archetype-plugin\target\invoker-reports\BUILD-property-setting-cli.xml]
[windows-jdk9] Found logs:[f:\jenkins\jenkins-slave\workspace\-box_maven-archetype_master-7AVMJNUR3VZV7RPVUBCE43H65NYTRWAOYFWSDDPCNSCWDYBAGBVQ\m\maven-archetype-plugin\target\it\projects\ARCHETYPE-241_filter-directory\build.log, f:\jenkins\jenkins-slave\workspace\-box_maven-archetype_master-7AVMJNUR3VZV7RPVUBCE43H65NYTRWAOYFWSDDPCNSCWDYBAGBVQ\m\maven-archetype-plugin\target\it\projects\ARCHETYPE-517_failing-goals\build.log, f:\jenkins\jenkins-slave\workspace\-box_maven-archetype_master-7AVMJNUR3VZV7RPVUBCE43H65NYTRWAOYFWSDDPCNSCWDYBAGBVQ\m\maven-archetype-plugin\target\it\projects\ARCHETYPE-520_mirror\build.log, f:\jenkins\jenkins-slave\workspace\-box_maven-archetype_master-7AVMJNUR3VZV7RPVUBCE43H65NYTRWAOYFWSDDPCNSCWDYBAGBVQ\m\maven-archetype-plugin\target\it\projects\ARCHETYPE-521_archetype-repo\build.log, f:\jenkins\jenkins-slave\workspace\-box_maven-archetype_master-7AVMJNUR3VZV7RPVUBCE43H65NYTRWAOYFWSDDPCNSCWDYBAGBVQ\m\maven-archetype-plugin\target\it\projects\build-archetype-and-run-its-with-existing-parent\build.log, f:\jenkins\jenkins-slave\workspace\-box_maven-archetype_master-7AVMJNUR3VZV7RPVUBCE43H65NYTRWAOYFWSDDPCNSCWDYBAGBVQ\m\maven-archetype-plugin\target\it\projects\build-archetype-and-run-its-with-existing-parent\target\test-classes\projects\basic\project\project\basic\build.log, f:\jenkins\jenkins-slave\workspace\-box_maven-archetype_master-7AVMJNUR3VZV7RPVUBCE43H65NYTRWAOYFWSDDPCNSCWDYBAGBVQ\m\maven-archetype-plugin\target\it\projects\build-archetype-ignore-eol-encoding\build.log, f:\jenkins\jenkins-slave\workspace\-box_maven-archetype_master-7AVMJNUR3VZV7RPVUBCE43H65NYTRWAOYFWSDDPCNSCWDYBAGBVQ\m\maven-archetype-plugin\target\it\projects\build-archetype-ignore-eol-encoding\target\test-classes\projects\basic\project\basic\build.log, f:\jenkins\jenkins-slave\workspace\-box_maven-archetype_master-7AVMJNUR3VZV7RPVUBCE43H65NYTRWAOYFWSDDPCNSCWDYBAGBVQ\m\maven-archetype-plugin\target\it\projects\build-archetype\build.log, f:\jenkins\jenkins-slave\workspace\-box_maven-archetype_master-7AVMJNUR3VZV7RPVUBCE43H65NYTRWAOYFWSDDPCNSCWDYBAGBVQ\m\maven-archetype-plugin\target\it\projects\build-archetype\target\test-classes\projects\basic\project\basic\build.log, f:\jenkins\jenkins-slave\workspace\-box_maven-archetype_master-7AVMJNUR3VZV7RPVUBCE43H65NYTRWAOYFWSDDPCNSCWDYBAGBVQ\m\maven-archetype-plugin\target\it\projects\create-from-project-exclude-patterns\build.log, f:\jenkins\jenkins-slave\workspace\-box_maven-archetype_master-7AVMJNUR3VZV7RPVUBCE43H65NYTRWAOYFWSDDPCNSCWDYBAGBVQ\m\maven-archetype-plugin\target\it\projects\create-from-project-exclude-patterns\target\generated-sources\archetype\src\main\resources\archetype-resources\build.log, f:\jenkins\jenkins-slave\workspace\-box_maven-archetype_master-7AVMJNUR3VZV7RPVUBCE43H65NYTRWAOYFWSDDPCNSCWDYBAGBVQ\m\maven-archetype-plugin\target\it\projects\create-from-project-exclude-patterns\target\generated-sources\archetype\target\classes\archetype-resources\build.log, f:\jenkins\jenkins-slave\workspace\-box_maven-archetype_master-7AVMJNUR3VZV7RPVUBCE43H65NYTRWAOYFWSDDPCNSCWDYBAGBVQ\m\maven-archetype-plugin\target\it\projects\create-from-project\build.log, f:\jenkins\jenkins-slave\workspace\-box_maven-archetype_master-7AVMJNUR3VZV7RPVUBCE43H65NYTRWAOYFWSDDPCNSCWDYBAGBVQ\m\maven-archetype-plugin\target\it\projects\create-from-project\target\generated-sources\archetype\src\main\resources\archetype-resources\build.log, f:\jenkins\jenkins-slave\workspace\-box_maven-archetype_master-7AVMJNUR3VZV7RPVUBCE43H65NYTRWAOYFWSDDPCNSCWDYBAGBVQ\m\maven-archetype-plugin\target\it\projects\create-from-project\target\generated-sources\archetype\target\classes\archetype-resources\build.log, f:\jenkins\jenkins-slave\workspace\-box_maven-archetype_master-7AVMJNUR3VZV7RPVUBCE43H65NYTRWAOYFWSDDPCNSCWDYBAGBVQ\m\maven-archetype-plugin\target\it\projects\generate-basic\build.log, f:\jenkins\jenkins-slave\workspace\-box_maven-archetype_master-7AVMJNUR3VZV7RPVUBCE43H65NYTRWAOYFWSDDPCNSCWDYBAGBVQ\m\maven-archetype-plugin\target\it\projects\property-setting-cli\build.log]
[windows-jdk9] Finished parsing Maven Invoker results (found 11)
[windows-jdk9] [withMaven] junitPublisher - Archive test results for Maven artifact org.apache.maven.archetype:archetype-catalog:3.0.2-SNAPSHOT generated by maven-surefire-plugin:test (default-test): m\archetype-models\archetype-catalog\target\surefire-reports\*.xml
[windows-jdk9] Recording test results
[windows-jdk9] None of the test reports contained any result
[windows-jdk9] [withMaven] junitPublisher - Archive test results for Maven artifact org.apache.maven.archetype:archetype-descriptor:3.0.2-SNAPSHOT generated by maven-surefire-plugin:test (default-test): m\archetype-models\archetype-descriptor\target\surefire-reports\*.xml
[windows-jdk9] Recording test results
[windows-jdk9] None of the test reports contained any result
[windows-jdk9] [withMaven] junitPublisher - Archive test results for Maven artifact org.apache.maven.archetype:archetype-repository:3.0.2-SNAPSHOT generated by maven-surefire-plugin:test (default-test): m\archetype-testing\archetype-repository\target\surefire-reports\*.xml
[windows-jdk9] Recording test results
[windows-jdk9] None of the test reports contained any result
[windows-jdk9] [withMaven] junitPublisher - Archive test results for Maven artifact org.apache.maven.archetype:archetype-proxy:3.0.2-SNAPSHOT generated by maven-surefire-plugin:test (default-test): m\archetype-testing\archetype-proxy\target\surefire-reports\*.xml
[windows-jdk9] Recording test results
[windows-jdk9] None of the test reports contained any result
[windows-jdk9] [withMaven] junitPublisher - Archive test results for Maven artifact org.apache.maven.archetype:archetype-common:3.0.2-SNAPSHOT generated by maven-surefire-plugin:test (default-test): m\archetype-common\target\surefire-reports\*.xml
[windows-jdk9] Recording test results
[windows-jdk9] [withMaven] junitPublisher - Archive test results for Maven artifact org.apache.maven.archetype:archetype-packaging:3.0.2-SNAPSHOT generated by maven-surefire-plugin:test (default-test): m\archetype-packaging\target\surefire-reports\*.xml
[windows-jdk9] Recording test results
[windows-jdk9] None of the test reports contained any result
[windows-jdk9] [withMaven] junitPublisher - Archive test results for Maven artifact org.apache.maven.plugins:maven-archetype-plugin:3.0.2-SNAPSHOT generated by maven-surefire-plugin:test (default-test): m\maven-archetype-plugin\target\surefire-reports\*.xml
[windows-jdk9] Recording test results
[windows-jdk9] [withMaven] junitPublisher - Archive test results for Maven artifact org.apache.maven.archetype:archetype-final:3.0.2-SNAPSHOT generated by maven-surefire-plugin:test (default-test): m\archetype-testing\archetype-final\target\surefire-reports\*.xml
[windows-jdk9] Recording test results
[windows-jdk9] None of the test reports contained any result
[windows-jdk9] [withMaven] junitPublisher - Archive test results for Maven artifact org.apache.maven.archetype:archetype-final:3.0.2-SNAPSHOT generated by maven-failsafe-plugin:integration-test (default): m\archetype-testing\archetype-final\target\failsafe-reports\*.xml
[windows-jdk9] Recording test results
[Pipeline] [linux-jdk9] // node
[Pipeline] [linux-jdk10] // node
[Pipeline] [windows-jdk7] // node
[Pipeline] [windows-jdk8] // node
[Pipeline] [windows-jdk10] // node
[Pipeline] [windows-jdk9] // withMaven
[Pipeline] [linux-jdk9] }
[Pipeline] [linux-jdk10] }
[Pipeline] [windows-jdk7] }
[Pipeline] [windows-jdk8] }
[Pipeline] [windows-jdk10] }
[Pipeline] [windows-jdk9] }
[Pipeline] [windows-jdk9] // stage
[Pipeline] [windows-jdk9] }
[Pipeline] [windows-jdk9] // node
[Pipeline] [windows-jdk9] }
[Pipeline] // parallel
[Pipeline] stage
[Pipeline] { (Notifications)
[Pipeline] echo
Build result: UNSTABLE
[Pipeline] jiraIssueSelector
[Pipeline] emailext
Mime
  • Unnamed multipart/mixed (inline, None, 0 bytes)
View raw message