maven-notifications mailing list archives

Site index · List index
Message view « Date » · « Thread »
Top « Date » · « Thread »
From Apache Jenkins Server <jenk...@builds.apache.org>
Subject Build failed in Jenkins: Maven TLP » maven-archetypes » master #11
Date Tue, 03 Jul 2018 14:11:05 GMT
See https://builds.apache.org/job/maven-box/job/maven-archetypes/job/master/11/

Changes:

* Add jdkForMaven and mavenForJdk methods Use reqexp for version matching
* regex in switch/case are full match, not partial match
* Update JDKs
* Looks like the API has changed.
* Try to fix it.
* TLSv1.x being deactivated since June. So only TLSv1.2 is valid for
* Add asfMavenTlpPlgnBuild to run plugins with multiple Maven versions
* Add maven version to stageId
* Add removeFromCollection() due to RejectedAccessException on
* Scripts not permitted to use method java.util.Collection stream
* Pass 'first'
* Ensure at least minimum required Java version is used
* builds.a.o doesn't have a Maven 3.1.x
* Pass 'failfast'
* Pass 'failingFast'
* Set https.protocols for Java7
* Make failingFast global variable
* Introduce a shared taskContext to keep track of failures
* Make taskContext accessible for try-catch
* Ensure tasks on the same Jenkins instance don't block each others
* dir('m') was used twice
* Also run site goal
* Remove unused parameter
* Disable site plan, doesn't work with multimodules

No tests ran.

Build log:
[...truncated 567.77 KB...]
[linux-jdk7] [withMaven] artifactsPublisher - Archive artifact m/target/maven-archetype-bundles-1.4-SNAPSHOT-site.xml
under org/apache/maven/archetypes/maven-archetype-bundles/1.4-SNAPSHOT/maven-archetype-bundles-1.4-SNAPSHOT-site.xml
[linux-jdk7] [Fast Archiver] No prior successful build to compare, so performing full copy
of artifacts
[linux-jdk7] [Fast Archiver] No prior successful build to compare, so performing full copy
of artifacts
[linux-jdk7] [Fast Archiver] No prior successful build to compare, so performing full copy
of artifacts
[linux-jdk7] [withMaven] openTasksPublisher - Scan Tasks for Maven artifact archetype.it:basic-project:0.1-SNAPSHOT
in source directory m/maven-archetype-archetype/target/test-classes/projects/it-basic/project/basic-archetype/target/test-classes/projects/it-basic/project/basic-project/src/main/java
[linux-jdk7] [TASKS] Scanning folder '/home/jenkins/jenkins-slave/workspace/box_maven-archetypes_master-CWQIX33IMRENQAEK6YQUG4YRNL2FP25GOPO4YFHLPIHFEWUYVBDQ'
for files matching the pattern 'm/maven-archetype-archetype/target/test-classes/projects/it-basic/project/basic-archetype/target/test-classes/projects/it-basic/project/basic-project/src/main/java/**/*'
- excludes: null
[linux-jdk7] [TASKS] Found 1 files to scan for tasks
[linux-jdk7] [TASKS] Found 0 open tasks.
[linux-jdk7] Skipping warnings blame since pipelines do not have an SCM link.%n
[Pipeline] [linux-jdk7] // withMaven
[Pipeline] [linux-jdk7] echo
[linux-jdk7] [FAIL FAST] This is the first failure and likely root cause
[Pipeline] [linux-jdk7] }
[Pipeline] [linux-jdk7] // stage
[Pipeline] [linux-jdk7] }
[Pipeline] [linux-jdk7] // node
[linux-jdk8] [INFO] [INFO] [INFO] Using 'UTF-8' encoding to copy filtered resources.
[linux-jdk8] [INFO] [INFO] [INFO] skip non existing resourceDirectory /home/jenkins/jenkins-slave/workspace/box_maven-archetypes_master-CWQIX33IMRENQAEK6YQUG4YRNL2FP25GOPO4YFHLPIHFEWUYVBDQ/m/maven-archetype-archetype/target/test-classes/projects/it-basic/project/basic-archetype/target/test-classes/projects/it-basic/project/basic-project/src/main/resources
[linux-jdk8] [INFO] [INFO] [INFO] 
[linux-jdk8] [INFO] [INFO] [INFO] --- maven-compiler-plugin:3.7.0:compile (default-compile)
@ basic-project ---
[linux-jdk8] [INFO] [INFO] [INFO] Downloading from central: https://repo.maven.apache.org/maven2/org/apache/maven/shared/maven-shared-incremental/1.1/maven-shared-incremental-1.1.pom
[linux-jdk8] [INFO] [INFO] [INFO] Downloaded from central: https://repo.maven.apache.org/maven2/org/apache/maven/shared/maven-shared-incremental/1.1/maven-shared-incremental-1.1.pom
(4.7 kB at 339 kB/s)
[linux-jdk8] [INFO] [INFO] [INFO] Downloading from central: https://repo.maven.apache.org/maven2/org/apache/maven/shared/maven-shared-utils/0.1/maven-shared-utils-0.1.pom
[linux-jdk8] [INFO] [INFO] [INFO] Downloaded from central: https://repo.maven.apache.org/maven2/org/apache/maven/shared/maven-shared-utils/0.1/maven-shared-utils-0.1.pom
(4.0 kB at 289 kB/s)
[linux-jdk8] [INFO] [INFO] [INFO] Downloading from central: https://repo.maven.apache.org/maven2/org/codehaus/plexus/plexus-java/0.9.2/plexus-java-0.9.2.pom
[linux-jdk8] [INFO] [INFO] [INFO] Downloaded from central: https://repo.maven.apache.org/maven2/org/codehaus/plexus/plexus-java/0.9.2/plexus-java-0.9.2.pom
(2.4 kB at 162 kB/s)
[linux-jdk8] [INFO] [INFO] [INFO] Downloading from central: https://repo.maven.apache.org/maven2/org/codehaus/plexus/plexus-languages/0.9.2/plexus-languages-0.9.2.pom
[linux-jdk8] [INFO] [INFO] [INFO] Downloaded from central: https://repo.maven.apache.org/maven2/org/codehaus/plexus/plexus-languages/0.9.2/plexus-languages-0.9.2.pom
(2.3 kB at 175 kB/s)
[linux-jdk8] [INFO] [INFO] [INFO] Downloading from central: https://repo.maven.apache.org/maven2/org/ow2/asm/asm/6.0_BETA/asm-6.0_BETA.pom
[linux-jdk8] [INFO] [INFO] [INFO] Downloaded from central: https://repo.maven.apache.org/maven2/org/ow2/asm/asm/6.0_BETA/asm-6.0_BETA.pom
(1.9 kB at 138 kB/s)
[linux-jdk8] [INFO] [INFO] [INFO] Downloading from central: https://repo.maven.apache.org/maven2/org/ow2/asm/asm-parent/6.0_BETA/asm-parent-6.0_BETA.pom
[linux-jdk8] [INFO] [INFO] [INFO] Downloaded from central: https://repo.maven.apache.org/maven2/org/ow2/asm/asm-parent/6.0_BETA/asm-parent-6.0_BETA.pom
(5.5 kB at 367 kB/s)
[linux-jdk8] [INFO] [INFO] [INFO] Downloading from central: https://repo.maven.apache.org/maven2/org/ow2/ow2/1.3/ow2-1.3.pom
[linux-jdk8] [INFO] [INFO] [INFO] Downloaded from central: https://repo.maven.apache.org/maven2/org/ow2/ow2/1.3/ow2-1.3.pom
(9.5 kB at 679 kB/s)
[linux-jdk8] [INFO] [INFO] [INFO] Downloading from central: https://repo.maven.apache.org/maven2/com/thoughtworks/qdox/qdox/2.0-M7/qdox-2.0-M7.pom
[linux-jdk8] [INFO] [INFO] [INFO] Downloaded from central: https://repo.maven.apache.org/maven2/com/thoughtworks/qdox/qdox/2.0-M7/qdox-2.0-M7.pom
(16 kB at 1.1 MB/s)
[linux-jdk8] [INFO] [INFO] [INFO] Downloading from central: https://repo.maven.apache.org/maven2/org/codehaus/plexus/plexus-compiler-api/2.8.2/plexus-compiler-api-2.8.2.pom
[linux-jdk8] [INFO] [INFO] [INFO] Downloaded from central: https://repo.maven.apache.org/maven2/org/codehaus/plexus/plexus-compiler-api/2.8.2/plexus-compiler-api-2.8.2.pom
(867 B at 62 kB/s)
[linux-jdk8] [INFO] [INFO] [INFO] Downloading from central: https://repo.maven.apache.org/maven2/org/codehaus/plexus/plexus-compiler/2.8.2/plexus-compiler-2.8.2.pom
[linux-jdk8] [INFO] [INFO] [INFO] Downloaded from central: https://repo.maven.apache.org/maven2/org/codehaus/plexus/plexus-compiler/2.8.2/plexus-compiler-2.8.2.pom
(4.9 kB at 376 kB/s)
[linux-jdk8] [INFO] [INFO] [INFO] Downloading from central: https://repo.maven.apache.org/maven2/org/codehaus/plexus/plexus-compiler-manager/2.8.2/plexus-compiler-manager-2.8.2.pom
[linux-jdk8] [INFO] [INFO] [INFO] Downloaded from central: https://repo.maven.apache.org/maven2/org/codehaus/plexus/plexus-compiler-manager/2.8.2/plexus-compiler-manager-2.8.2.pom
(692 B at 49 kB/s)
[linux-jdk8] [INFO] [INFO] [INFO] Downloading from central: https://repo.maven.apache.org/maven2/org/codehaus/plexus/plexus-compiler-javac/2.8.2/plexus-compiler-javac-2.8.2.pom
[linux-jdk8] [INFO] [INFO] [INFO] Downloaded from central: https://repo.maven.apache.org/maven2/org/codehaus/plexus/plexus-compiler-javac/2.8.2/plexus-compiler-javac-2.8.2.pom
(771 B at 59 kB/s)
[linux-jdk8] [INFO] [INFO] [INFO] Downloading from central: https://repo.maven.apache.org/maven2/org/codehaus/plexus/plexus-compilers/2.8.2/plexus-compilers-2.8.2.pom
[linux-jdk8] [INFO] [INFO] [INFO] Downloaded from central: https://repo.maven.apache.org/maven2/org/codehaus/plexus/plexus-compilers/2.8.2/plexus-compilers-2.8.2.pom
(1.3 kB at 112 kB/s)
[linux-jdk8] [INFO] [INFO] [INFO] Downloading from central: https://repo.maven.apache.org/maven2/org/apache/maven/shared/maven-shared-incremental/1.1/maven-shared-incremental-1.1.jar
[linux-jdk8] [INFO] [INFO] [INFO] Downloading from central: https://repo.maven.apache.org/maven2/org/codehaus/plexus/plexus-java/0.9.2/plexus-java-0.9.2.jar
[linux-jdk8] [INFO] [INFO] [INFO] Downloading from central: https://repo.maven.apache.org/maven2/org/ow2/asm/asm/6.0_BETA/asm-6.0_BETA.jar
[linux-jdk8] [INFO] [INFO] [INFO] Downloading from central: https://repo.maven.apache.org/maven2/com/thoughtworks/qdox/qdox/2.0-M7/qdox-2.0-M7.jar
[linux-jdk8] [INFO] [INFO] [INFO] Downloading from central: https://repo.maven.apache.org/maven2/org/codehaus/plexus/plexus-compiler-api/2.8.2/plexus-compiler-api-2.8.2.jar
[linux-jdk8] [INFO] [INFO] [INFO] Downloaded from central: https://repo.maven.apache.org/maven2/org/apache/maven/shared/maven-shared-incremental/1.1/maven-shared-incremental-1.1.jar
(14 kB at 752 kB/s)
[linux-jdk8] [INFO] [INFO] [INFO] Downloading from central: https://repo.maven.apache.org/maven2/org/codehaus/plexus/plexus-compiler-manager/2.8.2/plexus-compiler-manager-2.8.2.jar
[linux-jdk8] [INFO] [INFO] [INFO] Downloaded from central: https://repo.maven.apache.org/maven2/org/codehaus/plexus/plexus-compiler-manager/2.8.2/plexus-compiler-manager-2.8.2.jar
(4.7 kB at 156 kB/s)
[linux-jdk8] [INFO] [INFO] [INFO] Downloading from central: https://repo.maven.apache.org/maven2/org/codehaus/plexus/plexus-compiler-javac/2.8.2/plexus-compiler-javac-2.8.2.jar
[linux-jdk8] [INFO] [INFO] [INFO] Downloaded from central: https://repo.maven.apache.org/maven2/org/codehaus/plexus/plexus-java/0.9.2/plexus-java-0.9.2.jar
(31 kB at 843 kB/s)
[linux-jdk8] [INFO] [INFO] [INFO] Downloaded from central: https://repo.maven.apache.org/maven2/org/codehaus/plexus/plexus-compiler-api/2.8.2/plexus-compiler-api-2.8.2.jar
(26 kB at 733 kB/s)
[linux-jdk8] [INFO] [INFO] [INFO] Downloaded from central: https://repo.maven.apache.org/maven2/org/ow2/asm/asm/6.0_BETA/asm-6.0_BETA.jar
(56 kB at 1.4 MB/s)
[linux-jdk8] [INFO] [INFO] [INFO] Downloaded from central: https://repo.maven.apache.org/maven2/org/codehaus/plexus/plexus-compiler-javac/2.8.2/plexus-compiler-javac-2.8.2.jar
(20 kB at 446 kB/s)
[linux-jdk8] [INFO] [INFO] [INFO] Downloaded from central: https://repo.maven.apache.org/maven2/com/thoughtworks/qdox/qdox/2.0-M7/qdox-2.0-M7.jar
(315 kB at 5.1 MB/s)
[linux-jdk8] [INFO] [INFO] [INFO] Changes detected - recompiling the module!
[linux-jdk8] [INFO] [INFO] [INFO] Compiling 1 source file to /home/jenkins/jenkins-slave/workspace/box_maven-archetypes_master-CWQIX33IMRENQAEK6YQUG4YRNL2FP25GOPO4YFHLPIHFEWUYVBDQ/m/maven-archetype-archetype/target/test-classes/projects/it-basic/project/basic-archetype/target/test-classes/projects/it-basic/project/basic-project/target/classes
[Pipeline] [linux-jdk7] }
[linux-jdk9] Running on H27 in /home/jenkins/jenkins-slave/workspace/box_maven-archetypes_master-CWQIX33IMRENQAEK6YQUG4YRNL2FP25GOPO4YFHLPIHFEWUYVBDQ
[linux-jdk8] Sending interrupt signal to process
[linux-jdk7] Failed in branch linux-jdk7
[linux-jdk10] Running on H27 in /home/jenkins/jenkins-slave/workspace/box_maven-archetypes_master-CWQIX33IMRENQAEK6YQUG4YRNL2FP25GOPO4YFHLPIHFEWUYVBDQ@2
[linux-jdk8] [INFO] [INFO] [INFO] 
[linux-jdk8] [INFO] [INFO] [INFO] --- maven-resources-plugin:3.0.2:testResources (default-testResources)
@ basic-project ---
[linux-jdk8] [INFO] [INFO] [INFO] Using 'UTF-8' encoding to copy filtered resources.
[linux-jdk8] [INFO] [INFO] [INFO] skip non existing resourceDirectory /home/jenkins/jenkins-slave/workspace/box_maven-archetypes_master-CWQIX33IMRENQAEK6YQUG4YRNL2FP25GOPO4YFHLPIHFEWUYVBDQ/m/maven-archetype-archetype/target/test-classes/projects/it-basic/project/basic-archetype/target/test-classes/projects/it-basic/project/basic-project/src/test/resources
[linux-jdk8] [INFO] [INFO] [INFO] 
[linux-jdk8] [INFO] [INFO] [INFO] --- maven-compiler-plugin:3.7.0:testCompile (default-testCompile)
@ basic-project ---
[linux-jdk8] [INFO] [INFO] [INFO] Changes detected - recompiling the module!
[linux-jdk8] [INFO] [INFO] [INFO] Compiling 1 source file to /home/jenkins/jenkins-slave/workspace/box_maven-archetypes_master-CWQIX33IMRENQAEK6YQUG4YRNL2FP25GOPO4YFHLPIHFEWUYVBDQ/m/maven-archetype-archetype/target/test-classes/projects/it-basic/project/basic-archetype/target/test-classes/projects/it-basic/project/basic-project/target/test-classes
[linux-jdk8] [INFO] [INFO] [INFO] 
[linux-jdk8] [INFO] [INFO] [INFO] --- maven-surefire-plugin:2.20.1:test (default-test) @ basic-project
---
[linux-jdk8] [INFO] [INFO] [INFO] Downloading from central: https://repo.maven.apache.org/maven2/org/apache/maven/surefire/maven-surefire-common/2.20.1/maven-surefire-common-2.20.1.pom
[linux-jdk8] [INFO] [INFO] [INFO] Downloaded from central: https://repo.maven.apache.org/maven2/org/apache/maven/surefire/maven-surefire-common/2.20.1/maven-surefire-common-2.20.1.pom
(9.3 kB at 666 kB/s)
[linux-jdk8] [INFO] [INFO] [INFO] Downloading from central: https://repo.maven.apache.org/maven2/org/apache/maven/plugin-tools/maven-plugin-annotations/3.3/maven-plugin-annotations-3.3.pom
[linux-jdk8] [INFO] [INFO] [INFO] Downloaded from central: https://repo.maven.apache.org/maven2/org/apache/maven/plugin-tools/maven-plugin-annotations/3.3/maven-plugin-annotations-3.3.pom
(1.6 kB at 125 kB/s)
[linux-jdk8] [INFO] [INFO] [INFO] Downloading from central: https://repo.maven.apache.org/maven2/org/apache/maven/plugin-tools/maven-plugin-tools/3.3/maven-plugin-tools-3.3.pom
[linux-jdk8] [INFO] [INFO] [INFO] Downloaded from central: https://repo.maven.apache.org/maven2/org/apache/maven/plugin-tools/maven-plugin-tools/3.3/maven-plugin-tools-3.3.pom
(13 kB at 843 kB/s)
[linux-jdk8] [INFO] [INFO] [INFO] Downloading from central: https://repo.maven.apache.org/maven2/org/apache/maven/surefire/surefire-api/2.20.1/surefire-api-2.20.1.pom
[linux-jdk8] [INFO] [INFO] [INFO] Downloaded from central: https://repo.maven.apache.org/maven2/org/apache/maven/surefire/surefire-api/2.20.1/surefire-api-2.20.1.pom
(3.7 kB at 281 kB/s)
[linux-jdk8] [INFO] [INFO] [INFO] Downloading from central: https://repo.maven.apache.org/maven2/org/apache/maven/surefire/surefire-logger-api/2.20.1/surefire-logger-api-2.20.1.pom
[linux-jdk8] [INFO] [INFO] [INFO] Downloaded from central: https://repo.maven.apache.org/maven2/org/apache/maven/surefire/surefire-logger-api/2.20.1/surefire-logger-api-2.20.1.pom
(2.0 kB at 155 kB/s)
[linux-jdk8] [INFO] [INFO] [INFO] Downloading from central: https://repo.maven.apache.org/maven2/org/apache/maven/surefire/surefire-booter/2.20.1/surefire-booter-2.20.1.pom
[linux-jdk8] [INFO] [INFO] [INFO] Downloaded from central: https://repo.maven.apache.org/maven2/org/apache/maven/surefire/surefire-booter/2.20.1/surefire-booter-2.20.1.pom
(8.5 kB at 528 kB/s)
[linux-jdk8] [INFO] [INFO] [INFO] Downloading from central: https://repo.maven.apache.org/maven2/org/apache/maven/maven-toolchain/2.2.1/maven-toolchain-2.2.1.pom
[linux-jdk8] [INFO] [INFO] [INFO] Downloaded from central: https://repo.maven.apache.org/maven2/org/apache/maven/maven-toolchain/2.2.1/maven-toolchain-2.2.1.pom
(3.3 kB at 257 kB/s)
[linux-jdk8] [INFO] [INFO] [INFO] Downloading from central: https://repo.maven.apache.org/maven2/org/apache/maven/surefire/maven-surefire-common/2.20.1/maven-surefire-common-2.20.1.jar
[linux-jdk8] [INFO] [INFO] [INFO] Downloading from central: https://repo.maven.apache.org/maven2/org/apache/maven/plugin-tools/maven-plugin-annotations/3.3/maven-plugin-annotations-3.3.jar
[linux-jdk8] [INFO] [INFO] [INFO] Downloading from central: https://repo.maven.apache.org/maven2/org/apache/maven/surefire/surefire-api/2.20.1/surefire-api-2.20.1.jar
[linux-jdk8] [INFO] [INFO] [INFO] Downloading from central: https://repo.maven.apache.org/maven2/org/apache/maven/surefire/surefire-logger-api/2.20.1/surefire-logger-api-2.20.1.jar
[linux-jdk8] [INFO] [INFO] [INFO] Downloading from central: https://repo.maven.apache.org/maven2/org/apache/maven/surefire/surefire-booter/2.20.1/surefire-booter-2.20.1.jar
[linux-jdk8] [INFO] [INFO] [INFO] Downloaded from central: https://repo.maven.apache.org/maven2/org/apache/maven/plugin-tools/maven-plugin-annotations/3.3/maven-plugin-annotations-3.3.jar
(14 kB at 826 kB/s)
[linux-jdk8] [INFO] [INFO] [INFO] Downloading from central: https://repo.maven.apache.org/maven2/junit/junit/4.12/junit-4.12.jar
[linux-jdk8] [INFO] [INFO] [INFO] Downloaded from central: https://repo.maven.apache.org/maven2/org/apache/maven/surefire/surefire-logger-api/2.20.1/surefire-logger-api-2.20.1.jar
(13 kB at 720 kB/s)
[linux-jdk8] [INFO] [INFO] [INFO] Downloading from central: https://repo.maven.apache.org/maven2/org/apache/maven/maven-toolchain/2.2.1/maven-toolchain-2.2.1.jar
[linux-jdk8] [INFO] [INFO] [INFO] Downloaded from central: https://repo.maven.apache.org/maven2/org/apache/maven/maven-toolchain/2.2.1/maven-toolchain-2.2.1.jar
(38 kB at 1.1 MB/s)
[linux-jdk8] [INFO] [INFO] [INFO] Downloaded from central: https://repo.maven.apache.org/maven2/org/apache/maven/surefire/surefire-api/2.20.1/surefire-api-2.20.1.jar
(183 kB at 3.9 MB/s)
[linux-jdk8] [INFO] [INFO] [INFO] Downloaded from central: https://repo.maven.apache.org/maven2/org/apache/maven/surefire/surefire-booter/2.20.1/surefire-booter-2.20.1.jar
(268 kB at 4.8 MB/s)
[linux-jdk8] [INFO] [INFO] [INFO] Downloaded from central: https://repo.maven.apache.org/maven2/junit/junit/4.12/junit-4.12.jar
(315 kB at 5.2 MB/s)
[linux-jdk8] [INFO] [INFO] [INFO] Downloaded from central: https://repo.maven.apache.org/maven2/org/apache/maven/surefire/maven-surefire-common/2.20.1/maven-surefire-common-2.20.1.jar
(509 kB at 7.1 MB/s)
[linux-jdk8] [INFO] [INFO] [INFO] Surefire report directory: /home/jenkins/jenkins-slave/workspace/box_maven-archetypes_master-CWQIX33IMRENQAEK6YQUG4YRNL2FP25GOPO4YFHLPIHFEWUYVBDQ/m/maven-archetype-archetype/target/test-classes/projects/it-basic/project/basic-archetype/target/test-classes/projects/it-basic/project/basic-project/target/surefire-reports
[linux-jdk8] [INFO] [INFO] Post-archetype-generation invoker exit code: 143
[linux-jdk8] [INFO] [INFO] ------------------------------------------------------------------------
[linux-jdk8] [INFO] [INFO] BUILD FAILURE
[linux-jdk8] [INFO] [INFO] ------------------------------------------------------------------------
[linux-jdk8] [INFO] [INFO] Total time: 5.800 s
[linux-jdk8] [INFO] [INFO] Finished at: 2018-07-03T14:11:00Z
[linux-jdk8] [INFO] [INFO] Final Memory: 28M/1447M
[linux-jdk8] [INFO] [INFO] ------------------------------------------------------------------------
[linux-jdk8] [INFO] [INFO] [jenkins-event-spy] Generated /home/jenkins/jenkins-slave/workspace/box_maven-archetypes_master-CWQIX33IMRENQAEK6YQUG4YRNL2FP25GOPO4YFHLPIHFEWUYVBDQ@tmp/withMaven0aaf3c1c/maven-spy-20180703-141054-415403766360037041138.log
[linux-jdk8] [INFO] [ERROR] Failed to execute goal org.apache.maven.plugins:maven-archetype-plugin:3.0.1:integration-test
(default-integration-test) on project basic-archetype: 
[linux-jdk8] [INFO] [ERROR] Archetype IT 'it-basic' failed: Execution failure: exit code =
143
[linux-jdk8] [INFO] [ERROR] -> [Help 1]
[linux-jdk8] [INFO] org.apache.maven.lifecycle.LifecycleExecutionException: Failed to execute
goal org.apache.maven.plugins:maven-archetype-plugin:3.0.1:integration-test (default-integration-test)
on project basic-archetype: 
[linux-jdk8] [INFO] Archetype IT 'it-basic' failed: Execution failure: exit code = 143
[linux-jdk8] [INFO]     at org.apache.maven.lifecycle.internal.MojoExecutor.execute (MojoExecutor.java:213)
[linux-jdk8] [INFO]     at org.apache.maven.lifecycle.internal.MojoExecutor.execute (MojoExecutor.java:154)
[linux-jdk8] [INFO]     at org.apache.maven.lifecycle.internal.MojoExecutor.execute (MojoExecutor.java:146)
[linux-jdk8] [INFO]     at org.apache.maven.lifecycle.internal.LifecycleModuleBuilder.buildProject
(LifecycleModuleBuilder.java:117)
[linux-jdk8] [INFO]     at org.apache.maven.lifecycle.internal.LifecycleModuleBuilder.buildProject
(LifecycleModuleBuilder.java:81)
[linux-jdk8] [INFO]     at org.apache.maven.lifecycle.internal.builder.singlethreaded.SingleThreadedBuilder.build
(SingleThreadedBuilder.java:51)
[linux-jdk8] [INFO]     at org.apache.maven.lifecycle.internal.LifecycleStarter.execute (LifecycleStarter.java:128)
[linux-jdk8] [INFO]     at org.apache.maven.DefaultMaven.doExecute (DefaultMaven.java:309)
[linux-jdk8] [INFO]     at org.apache.maven.DefaultMaven.doExecute (DefaultMaven.java:194)
[linux-jdk8] [INFO]     at org.apache.maven.DefaultMaven.execute (DefaultMaven.java:107)
[linux-jdk8] [INFO]     at org.apache.maven.cli.MavenCli.execute (MavenCli.java:955)
[linux-jdk8] [INFO]     at org.apache.maven.cli.MavenCli.doMain (MavenCli.java:290)
[linux-jdk8] [INFO]     at org.apache.maven.cli.MavenCli.main (MavenCli.java:194)
[linux-jdk8] [INFO]     at sun.reflect.NativeMethodAccessorImpl.invoke0 (Native Method)
[linux-jdk8] [INFO]     at sun.reflect.NativeMethodAccessorImpl.invoke (NativeMethodAccessorImpl.java:62)
[linux-jdk8] [INFO]     at sun.reflect.DelegatingMethodAccessorImpl.invoke (DelegatingMethodAccessorImpl.java:43)
[linux-jdk8] [INFO]     at java.lang.reflect.Method.invoke (Method.java:498)
[linux-jdk8] [INFO]     at org.codehaus.plexus.classworlds.launcher.Launcher.launchEnhanced
(Launcher.java:289)
[linux-jdk8] [INFO]     at org.codehaus.plexus.classworlds.launcher.Launcher.launch (Launcher.java:229)
[linux-jdk8] [INFO]     at org.codehaus.plexus.classworlds.launcher.Launcher.mainWithExitCode
(Launcher.java:415)
[linux-jdk8] [INFO]     at org.codehaus.plexus.classworlds.launcher.Launcher.main (Launcher.java:356)
[linux-jdk8] [INFO] Caused by: org.apache.maven.plugin.MojoExecutionException: 
[linux-jdk8] [INFO] Archetype IT 'it-basic' failed: Execution failure: exit code = 143
[linux-jdk8] [INFO]     at org.apache.maven.archetype.mojos.IntegrationTestMojo.execute (IntegrationTestMojo.java:325)
[linux-jdk8] [INFO]     at org.apache.maven.plugin.DefaultBuildPluginManager.executeMojo (DefaultBuildPluginManager.java:134)
[linux-jdk8] [INFO]     at org.apache.maven.lifecycle.internal.MojoExecutor.execute (MojoExecutor.java:208)
[linux-jdk8] [INFO]     at org.apache.maven.lifecycle.internal.MojoExecutor.execute (MojoExecutor.java:154)
[linux-jdk8] [INFO]     at org.apache.maven.lifecycle.internal.MojoExecutor.execute (MojoExecutor.java:146)
[linux-jdk8] [INFO]     at org.apache.maven.lifecycle.internal.LifecycleModuleBuilder.buildProject
(LifecycleModuleBuilder.java:117)
[linux-jdk8] [INFO]     at org.apache.maven.lifecycle.internal.LifecycleModuleBuilder.buildProject
(LifecycleModuleBuilder.java:81)
[linux-jdk8] [INFO]     at org.apache.maven.lifecycle.internal.builder.singlethreaded.SingleThreadedBuilder.build
(SingleThreadedBuilder.java:51)
[linux-jdk8] [INFO]     at org.apache.maven.lifecycle.internal.LifecycleStarter.execute (LifecycleStarter.java:128)
[linux-jdk8] [INFO]     at org.apache.maven.DefaultMaven.doExecute (DefaultMaven.java:309)
[linux-jdk8] [INFO]     at org.apache.maven.DefaultMaven.doExecute (DefaultMaven.java:194)
[linux-jdk8] [INFO]     at org.apache.maven.DefaultMaven.execute (DefaultMaven.java:107)
[linux-jdk8] [INFO]     at org.apache.maven.cli.MavenCli.execute (MavenCli.java:955)
[linux-jdk8] [INFO]     at org.apache.maven.cli.MavenCli.doMain (MavenCli.java:290)
[linux-jdk8] [INFO]     at org.apache.maven.cli.MavenCli.main (MavenCli.java:194)
[linux-jdk8] [INFO]     at sun.reflect.NativeMethodAccessorImpl.invoke0 (Native Method)
[linux-jdk8] [INFO]     at sun.reflect.NativeMethodAccessorImpl.invoke (NativeMethodAccessorImpl.java:62)
[linux-jdk8] [INFO]     at sun.reflect.DelegatingMethodAccessorImpl.invoke (DelegatingMethodAccessorImpl.java:43)
[linux-jdk8] [INFO]     at java.lang.reflect.Method.invoke (Method.java:498)
[linux-jdk8] [INFO]     at org.codehaus.plexus.classworlds.launcher.Launcher.launchEnhanced
(Launcher.java:289)
[linux-jdk8] [INFO]     at org.codehaus.plexus.classworlds.launcher.Launcher.launch (Launcher.java:229)
[linux-jdk8] [INFO]     at org.codehaus.plexus.classworlds.launcher.Launcher.mainWithExitCode
(Launcher.java:415)
[linux-jdk8] [INFO]     at org.codehaus.plexus.classworlds.launcher.Launcher.main (Launcher.java:356)
[linux-jdk8] [INFO] [ERROR] 
[linux-jdk8] [INFO] [ERROR] Re-run Maven using the -X switch to enable full debug logging.
[linux-jdk8] [INFO] [ERROR] 
[linux-jdk8] [INFO] [ERROR] For more information about the errors and possible solutions,
please read the following articles:
[linux-jdk8] [INFO] [ERROR] [Help 1] http://cwiki.apache.org/confluence/display/MAVEN/MojoExecutionException
[linux-jdk8] Terminated
[Pipeline] [linux-jdk9] {
[Pipeline] [linux-jdk10] // node
[Pipeline] [windows-jdk7] // node
[Pipeline] [windows-jdk8] // node
[Pipeline] [windows-jdk9] // node
[Pipeline] [windows-jdk10] // node
[Pipeline] [linux-jdk10] }
[linux-jdk10] Failed in branch linux-jdk10
[Pipeline] [windows-jdk7] }
[windows-jdk7] Failed in branch windows-jdk7
[Pipeline] [windows-jdk8] }
[windows-jdk8] Failed in branch windows-jdk8
[Pipeline] [windows-jdk9] }
[windows-jdk9] Failed in branch windows-jdk9
[Pipeline] [windows-jdk10] }
[windows-jdk10] Failed in branch windows-jdk10
[Pipeline] [linux-jdk8] }
[Pipeline] [linux-jdk9] stage
[Pipeline] [linux-jdk9] { (Checkout linux-jdk9)
[Pipeline] [linux-jdk9] dir
[linux-jdk9] Running in /home/jenkins/jenkins-slave/workspace/box_maven-archetypes_master-CWQIX33IMRENQAEK6YQUG4YRNL2FP25GOPO4YFHLPIHFEWUYVBDQ/m
[Pipeline] [linux-jdk9] {
[Pipeline] [linux-jdk9] checkout
[linux-jdk9]  > git rev-parse --is-inside-work-tree # timeout=10
[linux-jdk9] Fetching changes from the remote Git repository
[linux-jdk9]  > git config remote.origin.url https://gitbox.apache.org/repos/asf/maven-archetypes.git
# timeout=10
[linux-jdk9] Fetching without tags
[linux-jdk9] Fetching upstream changes from https://gitbox.apache.org/repos/asf/maven-archetypes.git
[linux-jdk9]  > git --version # timeout=10
[linux-jdk9]  > git fetch --no-tags --progress https://gitbox.apache.org/repos/asf/maven-archetypes.git
+refs/heads/*:refs/remotes/origin/*
[linux-jdk9] Checking out Revision 4f6492c5981cd0bace21563fb674f443bbba8a24 (master)
[linux-jdk9]  > git config core.sparsecheckout # timeout=10
[linux-jdk9]  > git checkout -f 4f6492c5981cd0bace21563fb674f443bbba8a24
[linux-jdk9] Commit message: "[INFRA-16467] move components documentation out of CMS space"
[linux-jdk9] Cleaning workspace
[linux-jdk9]  > git rev-parse --verify HEAD # timeout=10
[linux-jdk9] Resetting working tree
[linux-jdk9]  > git reset --hard # timeout=10
[linux-jdk9]  > git clean -fdx # timeout=10
[Pipeline] [linux-jdk8] // dir
[Pipeline] [linux-jdk8] }
[linux-jdk8] [withMaven] One or multiple Maven executions have been ignored by the Jenkins
Pipeline Maven Plugin because they have been interrupted before completion (2). See Pipeline
Maven Plugin FAQ for more details.
[Pipeline] [linux-jdk8] // withMaven
[Pipeline] [linux-jdk8] echo
[linux-jdk8] [FAIL FAST] linux-jdk7 had first failure, ignoring script returned exit code
143
[Pipeline] [linux-jdk8] }
[Pipeline] [linux-jdk9] }
[Pipeline] [linux-jdk8] // stage
[Pipeline] [linux-jdk9] // dir
[Pipeline] [linux-jdk8] }
[Pipeline] [linux-jdk9] }
[Pipeline] [linux-jdk8] // node
[Pipeline] [linux-jdk9] // stage
[Pipeline] [linux-jdk8] }
[Pipeline] [linux-jdk9] stage
[Pipeline] [linux-jdk9] { (Build linux-jdk9)
[Pipeline] [linux-jdk9] echo
[linux-jdk9] [FAIL FAST] linux-jdk7 has failed. Skipping linux-jdk9.
[Pipeline] [linux-jdk9] }
[Pipeline] [linux-jdk9] // stage
[Pipeline] [linux-jdk9] }
[Pipeline] [linux-jdk9] // node
[Pipeline] [linux-jdk9] }
[linux-jdk9] Failed in branch linux-jdk9
[Pipeline] // parallel
[Pipeline] echo
***** FAST FAILURE *****

Fast failure triggered by linux-jdk7

***** FAST FAILURE *****
[Pipeline] stage
[Pipeline] { (Notifications)
[Pipeline] echo
Build result: FAILURE
[Pipeline] jiraIssueSelector
[Pipeline] emailext
Mime
  • Unnamed multipart/mixed (inline, None, 0 bytes)
View raw message