maven-notifications mailing list archives

Site index · List index
Message view « Date » · « Thread »
Top « Date » · « Thread »
From Apache Jenkins Server <jenk...@builds.apache.org>
Subject Build failed in Jenkins: Maven TLP » maven-jlink-plugin » MJLINK-26 #1
Date Sat, 08 Sep 2018 21:35:27 GMT
See https://builds.apache.org/job/maven-box/job/maven-jlink-plugin/job/MJLINK-26/1/

No changes.

All tests passed

Build log:
[...truncated 4.54 MB...]
[windows-jdk9-m3.5.x_build] [INFO] Downloading from central: https://repo.maven.apache.org/maven2/org/apache/maven/shared/maven-shared-resources/2/maven-shared-resources-2.pom
[windows-jdk9-m3.5.x_build] [INFO] Downloaded from central: https://repo.maven.apache.org/maven2/org/apache/maven/shared/maven-shared-resources/2/maven-shared-resources-2.pom
(3.0 kB at 328 kB/s)
[windows-jdk9-m3.5.x_build] [INFO] Downloading from central: https://repo.maven.apache.org/maven2/org/codehaus/plexus/plexus-utils/3.0.10/plexus-utils-3.0.10.pom
[windows-jdk9-m3.5.x_build] [INFO] Downloaded from central: https://repo.maven.apache.org/maven2/org/codehaus/plexus/plexus-utils/3.0.10/plexus-utils-3.0.10.pom
(3.1 kB at 524 kB/s)
[windows-jdk9-m3.5.x_build] [INFO] Downloading from central: https://repo.maven.apache.org/maven2/org/codehaus/plexus/plexus/3.3/plexus-3.3.pom
[windows-jdk9-m3.5.x_build] [INFO] Downloaded from central: https://repo.maven.apache.org/maven2/org/codehaus/plexus/plexus/3.3/plexus-3.3.pom
(20 kB at 3.3 MB/s)
[windows-jdk9-m3.5.x_build] [INFO] Downloading from central: https://repo.maven.apache.org/maven2/org/apache/maven/doxia/doxia-integration-tools/1.6/doxia-integration-tools-1.6.pom
[windows-jdk9-m3.5.x_build] [INFO] Downloaded from central: https://repo.maven.apache.org/maven2/org/apache/maven/doxia/doxia-integration-tools/1.6/doxia-integration-tools-1.6.pom
(7.0 kB at 1.2 MB/s)
[windows-jdk9-m3.5.x_build] [INFO] Downloading from central: https://repo.maven.apache.org/maven2/org/apache/maven/doxia/doxia-tools/3/doxia-tools-3.pom
[windows-jdk9-m3.5.x_build] [INFO] Downloaded from central: https://repo.maven.apache.org/maven2/org/apache/maven/doxia/doxia-tools/3/doxia-tools-3.pom
(9.9 kB at 1.4 MB/s)
[windows-jdk9-m3.5.x_build] [INFO] Downloading from central: https://repo.maven.apache.org/maven2/org/codehaus/plexus/plexus-resources/1.1.0/plexus-resources-1.1.0.pom
[windows-jdk9-m3.5.x_build] [INFO] Downloaded from central: https://repo.maven.apache.org/maven2/org/codehaus/plexus/plexus-resources/1.1.0/plexus-resources-1.1.0.pom
(3.2 kB at 454 kB/s)
[windows-jdk9-m3.5.x_build] [INFO] Downloading from central: https://repo.maven.apache.org/maven2/com/puppycrawl/tools/checkstyle/6.18/checkstyle-6.18.pom
[windows-jdk9-m3.5.x_build] [INFO] Downloaded from central: https://repo.maven.apache.org/maven2/com/puppycrawl/tools/checkstyle/6.18/checkstyle-6.18.pom
(71 kB at 7.1 MB/s)
[windows-jdk9-m3.5.x_build] [INFO] Downloading from central: https://repo.maven.apache.org/maven2/antlr/antlr/2.7.7/antlr-2.7.7.pom
[windows-jdk9-m3.5.x_build] [INFO] Downloaded from central: https://repo.maven.apache.org/maven2/antlr/antlr/2.7.7/antlr-2.7.7.pom
(632 B at 105 kB/s)
[windows-jdk9-m3.5.x_build] [INFO] Downloading from central: https://repo.maven.apache.org/maven2/org/antlr/antlr4-runtime/4.5.3/antlr4-runtime-4.5.3.pom
[windows-jdk9-m3.5.x_build] [INFO] Downloaded from central: https://repo.maven.apache.org/maven2/org/antlr/antlr4-runtime/4.5.3/antlr4-runtime-4.5.3.pom
(2.3 kB at 385 kB/s)
[windows-jdk9-m3.5.x_build] [INFO] Downloading from central: https://repo.maven.apache.org/maven2/org/antlr/antlr4-master/4.5.3/antlr4-master-4.5.3.pom
[windows-jdk9-m3.5.x_build] [INFO] Downloaded from central: https://repo.maven.apache.org/maven2/org/antlr/antlr4-master/4.5.3/antlr4-master-4.5.3.pom
(3.7 kB at 737 kB/s)
[windows-jdk9-m3.5.x_build] [INFO] Downloading from central: https://repo.maven.apache.org/maven2/commons-beanutils/commons-beanutils/1.9.2/commons-beanutils-1.9.2.pom
[windows-jdk9-m3.5.x_build] [INFO] Downloaded from central: https://repo.maven.apache.org/maven2/commons-beanutils/commons-beanutils/1.9.2/commons-beanutils-1.9.2.pom
(14 kB at 2.0 MB/s)
[windows-jdk9-m3.5.x_build] [INFO] Downloading from central: https://repo.maven.apache.org/maven2/org/apache/commons/commons-parent/33/commons-parent-33.pom
[windows-jdk9-m3.5.x_build] [INFO] Downloaded from central: https://repo.maven.apache.org/maven2/org/apache/commons/commons-parent/33/commons-parent-33.pom
(53 kB at 6.6 MB/s)
[windows-jdk9-m3.5.x_build] [INFO] Downloading from central: https://repo.maven.apache.org/maven2/commons-cli/commons-cli/1.3.1/commons-cli-1.3.1.pom
[windows-jdk9-m3.5.x_build] [INFO] Downloaded from central: https://repo.maven.apache.org/maven2/commons-cli/commons-cli/1.3.1/commons-cli-1.3.1.pom
(10 kB at 1.7 MB/s)
[windows-jdk9-m3.5.x_build] [INFO] Downloading from central: https://repo.maven.apache.org/maven2/com/google/guava/guava/19.0/guava-19.0.pom
[windows-jdk9-m3.5.x_build] [INFO] Downloaded from central: https://repo.maven.apache.org/maven2/com/google/guava/guava/19.0/guava-19.0.pom
(6.8 kB at 1.4 MB/s)
[windows-jdk9-m3.5.x_build] [INFO] Downloading from central: https://repo.maven.apache.org/maven2/com/google/guava/guava-parent/19.0/guava-parent-19.0.pom
[windows-jdk9-m3.5.x_build] [INFO] Downloaded from central: https://repo.maven.apache.org/maven2/com/google/guava/guava-parent/19.0/guava-parent-19.0.pom
(9.9 kB at 1.2 MB/s)
[windows-jdk9-m3.5.x_build] [INFO] Downloading from central: https://repo.maven.apache.org/maven2/org/sonatype/oss/oss-parent/7/oss-parent-7.pom
[windows-jdk9-m3.5.x_build] [INFO] Downloaded from central: https://repo.maven.apache.org/maven2/org/sonatype/oss/oss-parent/7/oss-parent-7.pom
(4.8 kB at 965 kB/s)
[windows-jdk9-m3.5.x_build] [INFO] Downloading from central: https://repo.maven.apache.org/maven2/javax/xml/bind/jaxb-api/2.3.0/jaxb-api-2.3.0.pom
[windows-jdk9-m3.5.x_build] [INFO] Downloaded from central: https://repo.maven.apache.org/maven2/javax/xml/bind/jaxb-api/2.3.0/jaxb-api-2.3.0.pom
(23 kB at 3.8 MB/s)
[windows-jdk9-m3.5.x_build] [INFO] Downloading from central: https://repo.maven.apache.org/maven2/javax/xml/bind/jaxb-api-parent/2.3.0/jaxb-api-parent-2.3.0.pom
[windows-jdk9-m3.5.x_build] [INFO] Downloaded from central: https://repo.maven.apache.org/maven2/javax/xml/bind/jaxb-api-parent/2.3.0/jaxb-api-parent-2.3.0.pom
(5.6 kB at 940 kB/s)
[windows-jdk9-m3.5.x_build] [INFO] Downloading from central: https://repo.maven.apache.org/maven2/net/java/jvnet-parent/5/jvnet-parent-5.pom
[windows-jdk9-m3.5.x_build] [INFO] Downloaded from central: https://repo.maven.apache.org/maven2/net/java/jvnet-parent/5/jvnet-parent-5.pom
(8.9 kB at 1.3 MB/s)
[windows-jdk9-m3.5.x_build] [INFO] Downloading from central: https://repo.maven.apache.org/maven2/org/apache/maven/shared/maven-shared-resources/2/maven-shared-resources-2.jar
[windows-jdk9-m3.5.x_build] [INFO] Downloading from central: https://repo.maven.apache.org/maven2/org/apache/maven/doxia/doxia-integration-tools/1.6/doxia-integration-tools-1.6.jar
[windows-jdk9-m3.5.x_build] [INFO] Downloading from central: https://repo.maven.apache.org/maven2/org/apache/maven/doxia/doxia-core/1.2/doxia-core-1.2.jar
[windows-jdk9-m3.5.x_build] [INFO] Downloading from central: https://repo.maven.apache.org/maven2/commons-logging/commons-logging/1.0.4/commons-logging-1.0.4.jar
[windows-jdk9-m3.5.x_build] [INFO] Downloading from central: https://repo.maven.apache.org/maven2/commons-digester/commons-digester/1.6/commons-digester-1.6.jar
[windows-jdk9-m3.5.x_build] [INFO] Downloaded from central: https://repo.maven.apache.org/maven2/commons-logging/commons-logging/1.0.4/commons-logging-1.0.4.jar
(38 kB at 1.4 MB/s)
[windows-jdk9-m3.5.x_build] [INFO] Downloading from central: https://repo.maven.apache.org/maven2/commons-io/commons-io/1.4/commons-io-1.4.jar
[windows-jdk9-m3.5.x_build] [INFO] Downloaded from central: https://repo.maven.apache.org/maven2/commons-digester/commons-digester/1.6/commons-digester-1.6.jar
(168 kB at 2.7 MB/s)
[windows-jdk9-m3.5.x_build] [INFO] Downloading from central: https://repo.maven.apache.org/maven2/org/codehaus/plexus/plexus-resources/1.1.0/plexus-resources-1.1.0.jar
[windows-jdk9-m3.5.x_build] [INFO] Downloaded from central: https://repo.maven.apache.org/maven2/org/apache/maven/doxia/doxia-integration-tools/1.6/doxia-integration-tools-1.6.jar
(45 kB at 708 kB/s)
[windows-jdk9-m3.5.x_build] [INFO] Downloading from central: https://repo.maven.apache.org/maven2/com/puppycrawl/tools/checkstyle/6.18/checkstyle-6.18.jar
[windows-jdk9-m3.5.x_build] [INFO] Downloaded from central: https://repo.maven.apache.org/maven2/org/apache/maven/doxia/doxia-core/1.2/doxia-core-1.2.jar
(154 kB at 2.0 MB/s)
[windows-jdk9-m3.5.x_build] [INFO] Downloading from central: https://repo.maven.apache.org/maven2/antlr/antlr/2.7.7/antlr-2.7.7.jar
[windows-jdk9-m3.5.x_build] [INFO] Downloaded from central: https://repo.maven.apache.org/maven2/commons-io/commons-io/1.4/commons-io-1.4.jar
(109 kB at 1.4 MB/s)
[windows-jdk9-m3.5.x_build] [INFO] Downloading from central: https://repo.maven.apache.org/maven2/org/antlr/antlr4-runtime/4.5.3/antlr4-runtime-4.5.3.jar
[windows-jdk9-m3.5.x_build] [INFO] Downloaded from central: https://repo.maven.apache.org/maven2/com/puppycrawl/tools/checkstyle/6.18/checkstyle-6.18.jar
(1.2 MB at 11 MB/s)
[windows-jdk9-m3.5.x_build] [INFO] Downloading from central: https://repo.maven.apache.org/maven2/commons-beanutils/commons-beanutils/1.9.2/commons-beanutils-1.9.2.jar
[windows-jdk9-m3.5.x_build] [INFO] Downloaded from central: https://repo.maven.apache.org/maven2/org/codehaus/plexus/plexus-resources/1.1.0/plexus-resources-1.1.0.jar
(23 kB at 221 kB/s)
[windows-jdk9-m3.5.x_build] [INFO] Downloading from central: https://repo.maven.apache.org/maven2/commons-cli/commons-cli/1.3.1/commons-cli-1.3.1.jar
[windows-jdk9-m3.5.x_build] [INFO] Downloaded from central: https://repo.maven.apache.org/maven2/org/apache/maven/shared/maven-shared-resources/2/maven-shared-resources-2.jar
(13 kB at 119 kB/s)
[windows-jdk9-m3.5.x_build] [INFO] Downloading from central: https://repo.maven.apache.org/maven2/com/google/guava/guava/19.0/guava-19.0.jar
[windows-jdk9-m3.5.x_build] [INFO] Downloaded from central: https://repo.maven.apache.org/maven2/commons-cli/commons-cli/1.3.1/commons-cli-1.3.1.jar
(53 kB at 461 kB/s)
[windows-jdk9-m3.5.x_build] [INFO] Downloading from central: https://repo.maven.apache.org/maven2/javax/xml/bind/jaxb-api/2.3.0/jaxb-api-2.3.0.jar
[windows-jdk9-m3.5.x_build] [INFO] Downloaded from central: https://repo.maven.apache.org/maven2/antlr/antlr/2.7.7/antlr-2.7.7.jar
(445 kB at 3.7 MB/s)
[windows-jdk9-m3.5.x_build] [INFO] Downloaded from central: https://repo.maven.apache.org/maven2/javax/xml/bind/jaxb-api/2.3.0/jaxb-api-2.3.0.jar
(126 kB at 945 kB/s)
[windows-jdk9-m3.5.x_build] [INFO] Downloaded from central: https://repo.maven.apache.org/maven2/org/antlr/antlr4-runtime/4.5.3/antlr4-runtime-4.5.3.jar
(302 kB at 2.3 MB/s)
[windows-jdk9-m3.5.x_build] [INFO] Downloaded from central: https://repo.maven.apache.org/maven2/commons-beanutils/commons-beanutils/1.9.2/commons-beanutils-1.9.2.jar
(234 kB at 1.4 MB/s)
[windows-jdk9-m3.5.x_build] [INFO] Downloaded from central: https://repo.maven.apache.org/maven2/com/google/guava/guava/19.0/guava-19.0.jar
(2.3 MB at 14 MB/s)
[windows-jdk9-m3.5.x_build] [INFO] 
[windows-jdk9-m3.5.x_build] [INFO] --- maven-invoker-plugin:3.1.0:verify (integration-test)
@ maven-jlink-plugin ---
[windows-jdk9-m3.5.x_build] [INFO] -------------------------------------------------
[windows-jdk9-m3.5.x_build] [INFO] Build Summary:
[windows-jdk9-m3.5.x_build] [INFO]   Passed: 15, Failed: 1, Errors: 0, Skipped: 0
[windows-jdk9-m3.5.x_build] [INFO] -------------------------------------------------
[windows-jdk9-m3.5.x_build] [ERROR] The following builds failed:
[windows-jdk9-m3.5.x_build] [ERROR] *  MJLINK-26\pom.xml
[windows-jdk9-m3.5.x_build] [INFO] -------------------------------------------------
[windows-jdk9-m3.5.x_build] [INFO] ------------------------------------------------------------------------
[windows-jdk9-m3.5.x_build] [INFO] BUILD FAILURE
[windows-jdk9-m3.5.x_build] [INFO] ------------------------------------------------------------------------
[windows-jdk9-m3.5.x_build] [INFO] Total time: 03:45 min
[windows-jdk9-m3.5.x_build] [INFO] Finished at: 2018-09-08T21:35:16Z
[windows-jdk9-m3.5.x_build] [INFO] Final Memory: 52M/173M
[windows-jdk9-m3.5.x_build] [INFO] ------------------------------------------------------------------------
[windows-jdk9-m3.5.x_build] [INFO] [jenkins-event-spy] Generated F:\jenkins\jenkins-slave\workspace\aven-jlink-plugin_MJLINK-26-6R5KMY7RJWJCDDS6GS7F2QBTFBPREF3UHXHNLUKO7K3YGJCZL2BA@tmp\withMavenb29779d8\maven-spy-20180908-213131-1153648505545875913498.log
[windows-jdk9-m3.5.x_build] [ERROR] Failed to execute goal org.apache.maven.plugins:maven-invoker-plugin:3.1.0:verify
(integration-test) on project maven-jlink-plugin: 1 build failed. See console output above
for details. -> [Help 1]
[windows-jdk9-m3.5.x_build] [ERROR] 
[windows-jdk9-m3.5.x_build] [ERROR] To see the full stack trace of the errors, re-run Maven
with the -e switch.
[windows-jdk9-m3.5.x_build] [ERROR] Re-run Maven using the -X switch to enable full debug
logging.
[windows-jdk9-m3.5.x_build] [ERROR] 
[windows-jdk9-m3.5.x_build] [ERROR] For more information about the errors and possible solutions,
please read the following articles:
[windows-jdk9-m3.5.x_build] [ERROR] [Help 1] http://cwiki.apache.org/confluence/display/MAVEN/MojoFailureException
[Pipeline] [windows-jdk9-m3.5.x_build] }
[Pipeline] [windows-jdk9-m3.5.x_build] // dir
[Pipeline] [windows-jdk9-m3.5.x_build] }
[windows-jdk9-m3.5.x_build] [Fast Archiver] No prior successful build to compare, so performing
full copy of artifacts
[windows-jdk9-m3.5.x_build] [withMaven] invokerPublisher - Archive invoker results for Maven
artifact MavenArtifact{org.apache.maven.plugins:maven-jlink-plugin::3.0.0-alpha-2-SNAPSHOT(version:
3.0.0-alpha-2-SNAPSHOT, snapshot:false) } generated by PluginInvocation{org.apache.maven.plugins:maven-invoker-plugin:3.1.0@integration-test
 integration-test}: windows-jdk9-m3.5.x_build\target\invoker-reports\*.xml
[windows-jdk9-m3.5.x_build] performing MavenInvokerRecorder, reportsFilenamePattern:'**/windows-jdk9-m3.5.x_build\target\invoker-reports/BUILD*.xml',
invokerBuildDir:'**/windows-jdk9-m3.5.x_build\target\it'
[windows-jdk9-m3.5.x_build] Found reports:[f:\jenkins\jenkins-slave\workspace\aven-jlink-plugin_MJLINK-26-6R5KMY7RJWJCDDS6GS7F2QBTFBPREF3UHXHNLUKO7K3YGJCZL2BA\windows-jdk9-m3.5.x_build\target\invoker-reports\BUILD-MJLINK-26.xml,
f:\jenkins\jenkins-slave\workspace\aven-jlink-plugin_MJLINK-26-6R5KMY7RJWJCDDS6GS7F2QBTFBPREF3UHXHNLUKO7K3YGJCZL2BA\windows-jdk9-m3.5.x_build\target\invoker-reports\BUILD-MJLINK-3_improveVerboseOutput.xml,
f:\jenkins\jenkins-slave\workspace\aven-jlink-plugin_MJLINK-26-6R5KMY7RJWJCDDS6GS7F2QBTFBPREF3UHXHNLUKO7K3YGJCZL2BA\windows-jdk9-m3.5.x_build\target\invoker-reports\BUILD-MJLINK-4_dependencyResolution.xml,
f:\jenkins\jenkins-slave\workspace\aven-jlink-plugin_MJLINK-26-6R5KMY7RJWJCDDS6GS7F2QBTFBPREF3UHXHNLUKO7K3YGJCZL2BA\windows-jdk9-m3.5.x_build\target\invoker-reports\BUILD-cli-options_bind-services.xml,
f:\jenkins\jenkins-slave\workspace\aven-jlink-plugin_MJLINK-26-6R5KMY7RJWJCDDS6GS7F2QBTFBPREF3UHXHNLUKO7K3YGJCZL2BA\windows-jdk9-m3.5.x_build\target\invoker-reports\BUILD-cli-options_compress-0.xml,
f:\jenkins\jenkins-slave\workspace\aven-jlink-plugin_MJLINK-26-6R5KMY7RJWJCDDS6GS7F2QBTFBPREF3UHXHNLUKO7K3YGJCZL2BA\windows-jdk9-m3.5.x_build\target\invoker-reports\BUILD-cli-options_compress-1.xml,
f:\jenkins\jenkins-slave\workspace\aven-jlink-plugin_MJLINK-26-6R5KMY7RJWJCDDS6GS7F2QBTFBPREF3UHXHNLUKO7K3YGJCZL2BA\windows-jdk9-m3.5.x_build\target\invoker-reports\BUILD-cli-options_compress-2.xml,
f:\jenkins\jenkins-slave\workspace\aven-jlink-plugin_MJLINK-26-6R5KMY7RJWJCDDS6GS7F2QBTFBPREF3UHXHNLUKO7K3YGJCZL2BA\windows-jdk9-m3.5.x_build\target\invoker-reports\BUILD-cli-options_disable-plugin.xml,
f:\jenkins\jenkins-slave\workspace\aven-jlink-plugin_MJLINK-26-6R5KMY7RJWJCDDS6GS7F2QBTFBPREF3UHXHNLUKO7K3YGJCZL2BA\windows-jdk9-m3.5.x_build\target\invoker-reports\BUILD-cli-options_endian-big.xml,
f:\jenkins\jenkins-slave\workspace\aven-jlink-plugin_MJLINK-26-6R5KMY7RJWJCDDS6GS7F2QBTFBPREF3UHXHNLUKO7K3YGJCZL2BA\windows-jdk9-m3.5.x_build\target\invoker-reports\BUILD-cli-options_endian.xml,
f:\jenkins\jenkins-slave\workspace\aven-jlink-plugin_MJLINK-26-6R5KMY7RJWJCDDS6GS7F2QBTFBPREF3UHXHNLUKO7K3YGJCZL2BA\windows-jdk9-m3.5.x_build\target\invoker-reports\BUILD-cli-options_ignore-signing-information.xml,
f:\jenkins\jenkins-slave\workspace\aven-jlink-plugin_MJLINK-26-6R5KMY7RJWJCDDS6GS7F2QBTFBPREF3UHXHNLUKO7K3YGJCZL2BA\windows-jdk9-m3.5.x_build\target\invoker-reports\BUILD-cli-options_no-header-files.xml,
f:\jenkins\jenkins-slave\workspace\aven-jlink-plugin_MJLINK-26-6R5KMY7RJWJCDDS6GS7F2QBTFBPREF3UHXHNLUKO7K3YGJCZL2BA\windows-jdk9-m3.5.x_build\target\invoker-reports\BUILD-cli-options_no-man-pages.xml,
f:\jenkins\jenkins-slave\workspace\aven-jlink-plugin_MJLINK-26-6R5KMY7RJWJCDDS6GS7F2QBTFBPREF3UHXHNLUKO7K3YGJCZL2BA\windows-jdk9-m3.5.x_build\target\invoker-reports\BUILD-cli-options_strip-debug.xml,
f:\jenkins\jenkins-slave\workspace\aven-jlink-plugin_MJLINK-26-6R5KMY7RJWJCDDS6GS7F2QBTFBPREF3UHXHNLUKO7K3YGJCZL2BA\windows-jdk9-m3.5.x_build\target\invoker-reports\BUILD-setup-jar-module-info.xml,
f:\jenkins\jenkins-slave\workspace\aven-jlink-plugin_MJLINK-26-6R5KMY7RJWJCDDS6GS7F2QBTFBPREF3UHXHNLUKO7K3YGJCZL2BA\windows-jdk9-m3.5.x_build\target\invoker-reports\BUILD-setup-jar.xml]
[windows-jdk9-m3.5.x_build] Found logs:[f:\jenkins\jenkins-slave\workspace\aven-jlink-plugin_MJLINK-26-6R5KMY7RJWJCDDS6GS7F2QBTFBPREF3UHXHNLUKO7K3YGJCZL2BA\windows-jdk9-m3.5.x_build\target\it\MJLINK-26\build.log,
f:\jenkins\jenkins-slave\workspace\aven-jlink-plugin_MJLINK-26-6R5KMY7RJWJCDDS6GS7F2QBTFBPREF3UHXHNLUKO7K3YGJCZL2BA\windows-jdk9-m3.5.x_build\target\it\MJLINK-3_improveVerboseOutput\build.log,
f:\jenkins\jenkins-slave\workspace\aven-jlink-plugin_MJLINK-26-6R5KMY7RJWJCDDS6GS7F2QBTFBPREF3UHXHNLUKO7K3YGJCZL2BA\windows-jdk9-m3.5.x_build\target\it\MJLINK-4_dependencyResolution\build.log,
f:\jenkins\jenkins-slave\workspace\aven-jlink-plugin_MJLINK-26-6R5KMY7RJWJCDDS6GS7F2QBTFBPREF3UHXHNLUKO7K3YGJCZL2BA\windows-jdk9-m3.5.x_build\target\it\cli-options\bind-services\build.log,
f:\jenkins\jenkins-slave\workspace\aven-jlink-plugin_MJLINK-26-6R5KMY7RJWJCDDS6GS7F2QBTFBPREF3UHXHNLUKO7K3YGJCZL2BA\windows-jdk9-m3.5.x_build\target\it\cli-options\compress-0\build.log,
f:\jenkins\jenkins-slave\workspace\aven-jlink-plugin_MJLINK-26-6R5KMY7RJWJCDDS6GS7F2QBTFBPREF3UHXHNLUKO7K3YGJCZL2BA\windows-jdk9-m3.5.x_build\target\it\cli-options\compress-1\build.log,
f:\jenkins\jenkins-slave\workspace\aven-jlink-plugin_MJLINK-26-6R5KMY7RJWJCDDS6GS7F2QBTFBPREF3UHXHNLUKO7K3YGJCZL2BA\windows-jdk9-m3.5.x_build\target\it\cli-options\compress-2\build.log,
f:\jenkins\jenkins-slave\workspace\aven-jlink-plugin_MJLINK-26-6R5KMY7RJWJCDDS6GS7F2QBTFBPREF3UHXHNLUKO7K3YGJCZL2BA\windows-jdk9-m3.5.x_build\target\it\cli-options\disable-plugin\build.log,
f:\jenkins\jenkins-slave\workspace\aven-jlink-plugin_MJLINK-26-6R5KMY7RJWJCDDS6GS7F2QBTFBPREF3UHXHNLUKO7K3YGJCZL2BA\windows-jdk9-m3.5.x_build\target\it\cli-options\endian-big\build.log,
f:\jenkins\jenkins-slave\workspace\aven-jlink-plugin_MJLINK-26-6R5KMY7RJWJCDDS6GS7F2QBTFBPREF3UHXHNLUKO7K3YGJCZL2BA\windows-jdk9-m3.5.x_build\target\it\cli-options\endian\build.log,
f:\jenkins\jenkins-slave\workspace\aven-jlink-plugin_MJLINK-26-6R5KMY7RJWJCDDS6GS7F2QBTFBPREF3UHXHNLUKO7K3YGJCZL2BA\windows-jdk9-m3.5.x_build\target\it\cli-options\ignore-signing-information\build.log,
f:\jenkins\jenkins-slave\workspace\aven-jlink-plugin_MJLINK-26-6R5KMY7RJWJCDDS6GS7F2QBTFBPREF3UHXHNLUKO7K3YGJCZL2BA\windows-jdk9-m3.5.x_build\target\it\cli-options\no-header-files\build.log,
f:\jenkins\jenkins-slave\workspace\aven-jlink-plugin_MJLINK-26-6R5KMY7RJWJCDDS6GS7F2QBTFBPREF3UHXHNLUKO7K3YGJCZL2BA\windows-jdk9-m3.5.x_build\target\it\cli-options\no-man-pages\build.log,
f:\jenkins\jenkins-slave\workspace\aven-jlink-plugin_MJLINK-26-6R5KMY7RJWJCDDS6GS7F2QBTFBPREF3UHXHNLUKO7K3YGJCZL2BA\windows-jdk9-m3.5.x_build\target\it\cli-options\strip-debug\build.log,
f:\jenkins\jenkins-slave\workspace\aven-jlink-plugin_MJLINK-26-6R5KMY7RJWJCDDS6GS7F2QBTFBPREF3UHXHNLUKO7K3YGJCZL2BA\windows-jdk9-m3.5.x_build\target\it\setup-jar-module-info\build.log,
f:\jenkins\jenkins-slave\workspace\aven-jlink-plugin_MJLINK-26-6R5KMY7RJWJCDDS6GS7F2QBTFBPREF3UHXHNLUKO7K3YGJCZL2BA\windows-jdk9-m3.5.x_build\target\it\setup-jar\build.log]
[windows-jdk9-m3.5.x_build] Finished parsing Maven Invoker results (found 16)
[windows-jdk9-m3.5.x_build] [withMaven] junitPublisher - Archive test results for Maven artifact
org.apache.maven.plugins:maven-jlink-plugin:3.0.0-alpha-2-SNAPSHOT generated by maven-surefire-plugin:test
(default-test): windows-jdk9-m3.5.x_build\target\surefire-reports\*.xml
[windows-jdk9-m3.5.x_build] Recording test results
[windows-jdk9-m3.5.x_build] [withMaven] openTasksPublisher - Scan Tasks for Maven artifact
org.apache.maven.plugins:maven-jlink-plugin:3.0.0-alpha-2-SNAPSHOT in source directory windows-jdk9-m3.5.x_build\src\main\java
[windows-jdk9-m3.5.x_build] [TASKS] Scanning folder 'f:\jenkins\jenkins-slave\workspace\aven-jlink-plugin_MJLINK-26-6R5KMY7RJWJCDDS6GS7F2QBTFBPREF3UHXHNLUKO7K3YGJCZL2BA'
for files matching the pattern 'windows-jdk9-m3.5.x_build\src\main\java\**\*' - excludes:
null
[windows-jdk9-m3.5.x_build] [TASKS] Found 2 files to scan for tasks
[windows-jdk9-m3.5.x_build] [TASKS] Found 5 open tasks.
[windows-jdk9-m3.5.x_build] Skipping warnings blame since pipelines do not have an SCM link.%n
[Pipeline] [windows-jdk9-m3.5.x_build] // withMaven
[Pipeline] [windows-jdk9-m3.5.x_build] cleanWs
[windows-jdk9-m3.5.x_build] [WS-CLEANUP] Deleting project workspace...[WS-CLEANUP] done
[Pipeline] [windows-jdk9-m3.5.x_build] cleanWs
[windows-jdk9-m3.5.x_build] [WS-CLEANUP] Deleting project workspace...[WS-CLEANUP] done
[Pipeline] [windows-jdk9-m3.5.x_build] }
[Pipeline] [windows-jdk9-m3.5.x_build] // stage
[Pipeline] [windows-jdk9-m3.5.x_build] }
[Pipeline] [windows-jdk9-m3.5.x_build] // node
[Pipeline] [windows-jdk9-m3.5.x_build] }
[windows-jdk9-m3.5.x_build] Failed in branch windows-jdk9-m3.5.x_build
[windows-jdk10-m3.5.x_build] [INFO]           MJLINK-4_dependencyResolution\pom.xml ............
SUCCESS (10.3 s)
[windows-jdk10-m3.5.x_build] [INFO] 
[windows-jdk10-m3.5.x_build] [INFO] --- mrm-maven-plugin:1.1.0:stop (default) @ maven-jlink-plugin
---
[windows-jdk10-m3.5.x_build] [INFO] Stopping Mock Repository Manager on http://localhost:64942
[windows-jdk10-m3.5.x_build] [INFO] Stopped SocketConnector@0.0.0.0:64942
[windows-jdk10-m3.5.x_build] [INFO] Mock Repository Manager http://localhost:64942 is stopped.
[windows-jdk10-m3.5.x_build] [INFO] 
[windows-jdk10-m3.5.x_build] [INFO] --- maven-checkstyle-plugin:3.0.0:check (checkstyle-check)
@ maven-jlink-plugin ---
[windows-jdk10-m3.5.x_build] [INFO] Downloading from central: https://repo.maven.apache.org/maven2/org/apache/maven/shared/maven-shared-resources/2/maven-shared-resources-2.pom
[windows-jdk10-m3.5.x_build] [INFO] Downloaded from central: https://repo.maven.apache.org/maven2/org/apache/maven/shared/maven-shared-resources/2/maven-shared-resources-2.pom
(3.0 kB at 57 kB/s)
[windows-jdk10-m3.5.x_build] [INFO] Downloading from central: https://repo.maven.apache.org/maven2/org/codehaus/plexus/plexus-utils/3.0.10/plexus-utils-3.0.10.pom
[windows-jdk10-m3.5.x_build] [INFO] Downloaded from central: https://repo.maven.apache.org/maven2/org/codehaus/plexus/plexus-utils/3.0.10/plexus-utils-3.0.10.pom
(3.1 kB at 137 kB/s)
[windows-jdk10-m3.5.x_build] [INFO] Downloading from central: https://repo.maven.apache.org/maven2/org/codehaus/plexus/plexus/3.3/plexus-3.3.pom
[windows-jdk10-m3.5.x_build] [INFO] Downloaded from central: https://repo.maven.apache.org/maven2/org/codehaus/plexus/plexus/3.3/plexus-3.3.pom
(20 kB at 1.4 MB/s)
[windows-jdk10-m3.5.x_build] [INFO] Downloading from central: https://repo.maven.apache.org/maven2/org/apache/maven/doxia/doxia-integration-tools/1.6/doxia-integration-tools-1.6.pom
[windows-jdk10-m3.5.x_build] [INFO] Downloaded from central: https://repo.maven.apache.org/maven2/org/apache/maven/doxia/doxia-integration-tools/1.6/doxia-integration-tools-1.6.pom
(7.0 kB at 870 kB/s)
[windows-jdk10-m3.5.x_build] [INFO] Downloading from central: https://repo.maven.apache.org/maven2/org/apache/maven/doxia/doxia-tools/3/doxia-tools-3.pom
[windows-jdk10-m3.5.x_build] [INFO] Downloaded from central: https://repo.maven.apache.org/maven2/org/apache/maven/doxia/doxia-tools/3/doxia-tools-3.pom
(9.9 kB at 1.2 MB/s)
[windows-jdk10-m3.5.x_build] [INFO] Downloading from central: https://repo.maven.apache.org/maven2/org/codehaus/plexus/plexus-resources/1.1.0/plexus-resources-1.1.0.pom
[windows-jdk10-m3.5.x_build] [INFO] Downloaded from central: https://repo.maven.apache.org/maven2/org/codehaus/plexus/plexus-resources/1.1.0/plexus-resources-1.1.0.pom
(3.2 kB at 397 kB/s)
[windows-jdk10-m3.5.x_build] [INFO] Downloading from central: https://repo.maven.apache.org/maven2/com/puppycrawl/tools/checkstyle/6.18/checkstyle-6.18.pom
[windows-jdk10-m3.5.x_build] [INFO] Downloaded from central: https://repo.maven.apache.org/maven2/com/puppycrawl/tools/checkstyle/6.18/checkstyle-6.18.pom
(71 kB at 4.4 MB/s)
[windows-jdk10-m3.5.x_build] [INFO] Downloading from central: https://repo.maven.apache.org/maven2/antlr/antlr/2.7.7/antlr-2.7.7.pom
[windows-jdk10-m3.5.x_build] [INFO] Downloaded from central: https://repo.maven.apache.org/maven2/antlr/antlr/2.7.7/antlr-2.7.7.pom
(632 B at 79 kB/s)
[windows-jdk10-m3.5.x_build] [INFO] Downloading from central: https://repo.maven.apache.org/maven2/org/antlr/antlr4-runtime/4.5.3/antlr4-runtime-4.5.3.pom
[windows-jdk10-m3.5.x_build] [INFO] Downloaded from central: https://repo.maven.apache.org/maven2/org/antlr/antlr4-runtime/4.5.3/antlr4-runtime-4.5.3.pom
(2.3 kB at 289 kB/s)
[windows-jdk10-m3.5.x_build] [INFO] Downloading from central: https://repo.maven.apache.org/maven2/org/antlr/antlr4-master/4.5.3/antlr4-master-4.5.3.pom
[windows-jdk10-m3.5.x_build] [INFO] Downloaded from central: https://repo.maven.apache.org/maven2/org/antlr/antlr4-master/4.5.3/antlr4-master-4.5.3.pom
(3.7 kB at 460 kB/s)
[windows-jdk10-m3.5.x_build] [INFO] Downloading from central: https://repo.maven.apache.org/maven2/commons-beanutils/commons-beanutils/1.9.2/commons-beanutils-1.9.2.pom
[windows-jdk10-m3.5.x_build] [INFO] Downloaded from central: https://repo.maven.apache.org/maven2/commons-beanutils/commons-beanutils/1.9.2/commons-beanutils-1.9.2.pom
(14 kB at 1.8 MB/s)
[windows-jdk10-m3.5.x_build] [INFO] Downloading from central: https://repo.maven.apache.org/maven2/org/apache/commons/commons-parent/33/commons-parent-33.pom
[windows-jdk10-m3.5.x_build] [INFO] Downloaded from central: https://repo.maven.apache.org/maven2/org/apache/commons/commons-parent/33/commons-parent-33.pom
(53 kB at 5.3 MB/s)
[windows-jdk10-m3.5.x_build] [INFO] Downloading from central: https://repo.maven.apache.org/maven2/commons-cli/commons-cli/1.3.1/commons-cli-1.3.1.pom
[windows-jdk10-m3.5.x_build] [INFO] Downloaded from central: https://repo.maven.apache.org/maven2/commons-cli/commons-cli/1.3.1/commons-cli-1.3.1.pom
(10 kB at 1.7 MB/s)
[windows-jdk10-m3.5.x_build] [INFO] Downloading from central: https://repo.maven.apache.org/maven2/com/google/guava/guava/19.0/guava-19.0.pom
[windows-jdk10-m3.5.x_build] [INFO] Downloaded from central: https://repo.maven.apache.org/maven2/com/google/guava/guava/19.0/guava-19.0.pom
(6.8 kB at 970 kB/s)
[windows-jdk10-m3.5.x_build] [INFO] Downloading from central: https://repo.maven.apache.org/maven2/com/google/guava/guava-parent/19.0/guava-parent-19.0.pom
[windows-jdk10-m3.5.x_build] [INFO] Downloaded from central: https://repo.maven.apache.org/maven2/com/google/guava/guava-parent/19.0/guava-parent-19.0.pom
(9.9 kB at 1.2 MB/s)
[windows-jdk10-m3.5.x_build] [INFO] Downloading from central: https://repo.maven.apache.org/maven2/org/sonatype/oss/oss-parent/7/oss-parent-7.pom
[windows-jdk10-m3.5.x_build] [INFO] Downloaded from central: https://repo.maven.apache.org/maven2/org/sonatype/oss/oss-parent/7/oss-parent-7.pom
(4.8 kB at 603 kB/s)
[windows-jdk10-m3.5.x_build] [INFO] Downloading from central: https://repo.maven.apache.org/maven2/javax/xml/bind/jaxb-api/2.3.0/jaxb-api-2.3.0.pom
[windows-jdk10-m3.5.x_build] [INFO] Downloaded from central: https://repo.maven.apache.org/maven2/javax/xml/bind/jaxb-api/2.3.0/jaxb-api-2.3.0.pom
(23 kB at 2.1 MB/s)
[windows-jdk10-m3.5.x_build] [INFO] Downloading from central: https://repo.maven.apache.org/maven2/javax/xml/bind/jaxb-api-parent/2.3.0/jaxb-api-parent-2.3.0.pom
[windows-jdk10-m3.5.x_build] [INFO] Downloaded from central: https://repo.maven.apache.org/maven2/javax/xml/bind/jaxb-api-parent/2.3.0/jaxb-api-parent-2.3.0.pom
(5.6 kB at 705 kB/s)
[windows-jdk10-m3.5.x_build] [INFO] Downloading from central: https://repo.maven.apache.org/maven2/net/java/jvnet-parent/5/jvnet-parent-5.pom
[windows-jdk10-m3.5.x_build] [INFO] Downloaded from central: https://repo.maven.apache.org/maven2/net/java/jvnet-parent/5/jvnet-parent-5.pom
(8.9 kB at 1.3 MB/s)
[windows-jdk10-m3.5.x_build] [INFO] Downloading from central: https://repo.maven.apache.org/maven2/org/apache/maven/doxia/doxia-core/1.2/doxia-core-1.2.jar
[windows-jdk10-m3.5.x_build] [INFO] Downloading from central: https://repo.maven.apache.org/maven2/org/apache/maven/shared/maven-shared-resources/2/maven-shared-resources-2.jar
[windows-jdk10-m3.5.x_build] [INFO] Downloading from central: https://repo.maven.apache.org/maven2/commons-logging/commons-logging/1.0.4/commons-logging-1.0.4.jar
[windows-jdk10-m3.5.x_build] [INFO] Downloading from central: https://repo.maven.apache.org/maven2/commons-digester/commons-digester/1.6/commons-digester-1.6.jar
[windows-jdk10-m3.5.x_build] [INFO] Downloading from central: https://repo.maven.apache.org/maven2/org/apache/maven/doxia/doxia-integration-tools/1.6/doxia-integration-tools-1.6.jar
[windows-jdk10-m3.5.x_build] [INFO] Downloaded from central: https://repo.maven.apache.org/maven2/org/apache/maven/shared/maven-shared-resources/2/maven-shared-resources-2.jar
(13 kB at 816 kB/s)
[windows-jdk10-m3.5.x_build] [INFO] Downloading from central: https://repo.maven.apache.org/maven2/commons-io/commons-io/1.4/commons-io-1.4.jar
[windows-jdk10-m3.5.x_build] [INFO] Downloaded from central: https://repo.maven.apache.org/maven2/commons-logging/commons-logging/1.0.4/commons-logging-1.0.4.jar
(38 kB at 2.1 MB/s)
[windows-jdk10-m3.5.x_build] [INFO] Downloading from central: https://repo.maven.apache.org/maven2/org/codehaus/plexus/plexus-resources/1.1.0/plexus-resources-1.1.0.jar
[windows-jdk10-m3.5.x_build] [INFO] Downloaded from central: https://repo.maven.apache.org/maven2/commons-digester/commons-digester/1.6/commons-digester-1.6.jar
(168 kB at 8.0 MB/s)
[windows-jdk10-m3.5.x_build] [INFO] Downloading from central: https://repo.maven.apache.org/maven2/com/puppycrawl/tools/checkstyle/6.18/checkstyle-6.18.jar
[windows-jdk10-m3.5.x_build] [INFO] Downloaded from central: https://repo.maven.apache.org/maven2/org/apache/maven/doxia/doxia-core/1.2/doxia-core-1.2.jar
(154 kB at 6.4 MB/s)
[windows-jdk10-m3.5.x_build] [INFO] Downloading from central: https://repo.maven.apache.org/maven2/antlr/antlr/2.7.7/antlr-2.7.7.jar
[windows-jdk10-m3.5.x_build] [INFO] Downloaded from central: https://repo.maven.apache.org/maven2/org/codehaus/plexus/plexus-resources/1.1.0/plexus-resources-1.1.0.jar
(23 kB at 893 kB/s)
[windows-jdk10-m3.5.x_build] [INFO] Downloading from central: https://repo.maven.apache.org/maven2/org/antlr/antlr4-runtime/4.5.3/antlr4-runtime-4.5.3.jar
[windows-jdk10-m3.5.x_build] [INFO] Downloaded from central: https://repo.maven.apache.org/maven2/org/apache/maven/doxia/doxia-integration-tools/1.6/doxia-integration-tools-1.6.jar
(45 kB at 1.5 MB/s)
[windows-jdk10-m3.5.x_build] [INFO] Downloading from central: https://repo.maven.apache.org/maven2/commons-beanutils/commons-beanutils/1.9.2/commons-beanutils-1.9.2.jar
[windows-jdk10-m3.5.x_build] [INFO] Downloaded from central: https://repo.maven.apache.org/maven2/commons-io/commons-io/1.4/commons-io-1.4.jar
(109 kB at 3.6 MB/s)
[windows-jdk10-m3.5.x_build] [INFO] Downloading from central: https://repo.maven.apache.org/maven2/commons-cli/commons-cli/1.3.1/commons-cli-1.3.1.jar
[windows-jdk10-m3.5.x_build] [INFO] Downloaded from central: https://repo.maven.apache.org/maven2/commons-cli/commons-cli/1.3.1/commons-cli-1.3.1.jar
(53 kB at 1.3 MB/s)
[windows-jdk10-m3.5.x_build] [INFO] Downloading from central: https://repo.maven.apache.org/maven2/com/google/guava/guava/19.0/guava-19.0.jar
[windows-jdk10-m3.5.x_build] [INFO] Downloaded from central: https://repo.maven.apache.org/maven2/org/antlr/antlr4-runtime/4.5.3/antlr4-runtime-4.5.3.jar
(302 kB at 6.3 MB/s)
[windows-jdk10-m3.5.x_build] [INFO] Downloading from central: https://repo.maven.apache.org/maven2/javax/xml/bind/jaxb-api/2.3.0/jaxb-api-2.3.0.jar
[windows-jdk10-m3.5.x_build] [INFO] Downloaded from central: https://repo.maven.apache.org/maven2/antlr/antlr/2.7.7/antlr-2.7.7.jar
(445 kB at 8.1 MB/s)
[windows-jdk10-m3.5.x_build] [INFO] Downloaded from central: https://repo.maven.apache.org/maven2/com/puppycrawl/tools/checkstyle/6.18/checkstyle-6.18.jar
(1.2 MB at 20 MB/s)
[windows-jdk10-m3.5.x_build] [INFO] Downloaded from central: https://repo.maven.apache.org/maven2/javax/xml/bind/jaxb-api/2.3.0/jaxb-api-2.3.0.jar
(126 kB at 2.1 MB/s)
[windows-jdk10-m3.5.x_build] [INFO] Downloaded from central: https://repo.maven.apache.org/maven2/commons-beanutils/commons-beanutils/1.9.2/commons-beanutils-1.9.2.jar
(234 kB at 3.2 MB/s)
[windows-jdk10-m3.5.x_build] [INFO] Downloaded from central: https://repo.maven.apache.org/maven2/com/google/guava/guava/19.0/guava-19.0.jar
(2.3 MB at 20 MB/s)
[windows-jdk10-m3.5.x_build] [INFO] 
[windows-jdk10-m3.5.x_build] [INFO] --- maven-invoker-plugin:3.1.0:verify (integration-test)
@ maven-jlink-plugin ---
[windows-jdk10-m3.5.x_build] [INFO] -------------------------------------------------
[windows-jdk10-m3.5.x_build] [INFO] Build Summary:
[windows-jdk10-m3.5.x_build] [INFO]   Passed: 15, Failed: 1, Errors: 0, Skipped: 0
[windows-jdk10-m3.5.x_build] [INFO] -------------------------------------------------
[windows-jdk10-m3.5.x_build] [ERROR] The following builds failed:
[windows-jdk10-m3.5.x_build] [ERROR] *  MJLINK-26\pom.xml
[windows-jdk10-m3.5.x_build] [INFO] -------------------------------------------------
[windows-jdk10-m3.5.x_build] [INFO] ------------------------------------------------------------------------
[windows-jdk10-m3.5.x_build] [INFO] BUILD FAILURE
[windows-jdk10-m3.5.x_build] [INFO] ------------------------------------------------------------------------
[windows-jdk10-m3.5.x_build] [INFO] Total time: 03:45 min
[windows-jdk10-m3.5.x_build] [INFO] Finished at: 2018-09-08T21:35:24Z
[windows-jdk10-m3.5.x_build] [INFO] Final Memory: 49M/170M
[windows-jdk10-m3.5.x_build] [INFO] ------------------------------------------------------------------------
[windows-jdk10-m3.5.x_build] [INFO] [jenkins-event-spy] Generated F:\jenkins\jenkins-slave\workspace\aven-jlink-plugin_MJLINK-26-6R5KMY7RJWJCDDS6GS7F2QBTFBPREF3UHXHNLUKO7K3YGJCZL2BA@2@tmp\withMaven5ee67b61\maven-spy-20180908-213139-845614988182612456786.log
[windows-jdk10-m3.5.x_build] [ERROR] Failed to execute goal org.apache.maven.plugins:maven-invoker-plugin:3.1.0:verify
(integration-test) on project maven-jlink-plugin: 1 build failed. See console output above
for details. -> [Help 1]
[windows-jdk10-m3.5.x_build] [ERROR] 
[windows-jdk10-m3.5.x_build] [ERROR] To see the full stack trace of the errors, re-run Maven
with the -e switch.
[windows-jdk10-m3.5.x_build] [ERROR] Re-run Maven using the -X switch to enable full debug
logging.
[windows-jdk10-m3.5.x_build] [ERROR] 
[windows-jdk10-m3.5.x_build] [ERROR] For more information about the errors and possible solutions,
please read the following articles:
[windows-jdk10-m3.5.x_build] [ERROR] [Help 1] http://cwiki.apache.org/confluence/display/MAVEN/MojoFailureException
[Pipeline] [windows-jdk10-m3.5.x_build] }
[Pipeline] [windows-jdk10-m3.5.x_build] // dir
[Pipeline] [windows-jdk10-m3.5.x_build] }
[windows-jdk10-m3.5.x_build] [Fast Archiver] No prior successful build to compare, so performing
full copy of artifacts
[windows-jdk10-m3.5.x_build] [withMaven] invokerPublisher - Archive invoker results for Maven
artifact MavenArtifact{org.apache.maven.plugins:maven-jlink-plugin::3.0.0-alpha-2-SNAPSHOT(version:
3.0.0-alpha-2-SNAPSHOT, snapshot:false) } generated by PluginInvocation{org.apache.maven.plugins:maven-invoker-plugin:3.1.0@integration-test
 integration-test}: windows-jdk10-m3.5.x_build\target\invoker-reports\*.xml
[windows-jdk10-m3.5.x_build] performing MavenInvokerRecorder, reportsFilenamePattern:'**/windows-jdk10-m3.5.x_build\target\invoker-reports/BUILD*.xml',
invokerBuildDir:'**/windows-jdk10-m3.5.x_build\target\it'
[windows-jdk10-m3.5.x_build] Found reports:[f:\jenkins\jenkins-slave\workspace\aven-jlink-plugin_MJLINK-26-6R5KMY7RJWJCDDS6GS7F2QBTFBPREF3UHXHNLUKO7K3YGJCZL2BA@2\windows-jdk10-m3.5.x_build\target\invoker-reports\BUILD-MJLINK-26.xml,
f:\jenkins\jenkins-slave\workspace\aven-jlink-plugin_MJLINK-26-6R5KMY7RJWJCDDS6GS7F2QBTFBPREF3UHXHNLUKO7K3YGJCZL2BA@2\windows-jdk10-m3.5.x_build\target\invoker-reports\BUILD-MJLINK-3_improveVerboseOutput.xml,
f:\jenkins\jenkins-slave\workspace\aven-jlink-plugin_MJLINK-26-6R5KMY7RJWJCDDS6GS7F2QBTFBPREF3UHXHNLUKO7K3YGJCZL2BA@2\windows-jdk10-m3.5.x_build\target\invoker-reports\BUILD-MJLINK-4_dependencyResolution.xml,
f:\jenkins\jenkins-slave\workspace\aven-jlink-plugin_MJLINK-26-6R5KMY7RJWJCDDS6GS7F2QBTFBPREF3UHXHNLUKO7K3YGJCZL2BA@2\windows-jdk10-m3.5.x_build\target\invoker-reports\BUILD-cli-options_bind-services.xml,
f:\jenkins\jenkins-slave\workspace\aven-jlink-plugin_MJLINK-26-6R5KMY7RJWJCDDS6GS7F2QBTFBPREF3UHXHNLUKO7K3YGJCZL2BA@2\windows-jdk10-m3.5.x_build\target\invoker-reports\BUILD-cli-options_compress-0.xml,
f:\jenkins\jenkins-slave\workspace\aven-jlink-plugin_MJLINK-26-6R5KMY7RJWJCDDS6GS7F2QBTFBPREF3UHXHNLUKO7K3YGJCZL2BA@2\windows-jdk10-m3.5.x_build\target\invoker-reports\BUILD-cli-options_compress-1.xml,
f:\jenkins\jenkins-slave\workspace\aven-jlink-plugin_MJLINK-26-6R5KMY7RJWJCDDS6GS7F2QBTFBPREF3UHXHNLUKO7K3YGJCZL2BA@2\windows-jdk10-m3.5.x_build\target\invoker-reports\BUILD-cli-options_compress-2.xml,
f:\jenkins\jenkins-slave\workspace\aven-jlink-plugin_MJLINK-26-6R5KMY7RJWJCDDS6GS7F2QBTFBPREF3UHXHNLUKO7K3YGJCZL2BA@2\windows-jdk10-m3.5.x_build\target\invoker-reports\BUILD-cli-options_disable-plugin.xml,
f:\jenkins\jenkins-slave\workspace\aven-jlink-plugin_MJLINK-26-6R5KMY7RJWJCDDS6GS7F2QBTFBPREF3UHXHNLUKO7K3YGJCZL2BA@2\windows-jdk10-m3.5.x_build\target\invoker-reports\BUILD-cli-options_endian-big.xml,
f:\jenkins\jenkins-slave\workspace\aven-jlink-plugin_MJLINK-26-6R5KMY7RJWJCDDS6GS7F2QBTFBPREF3UHXHNLUKO7K3YGJCZL2BA@2\windows-jdk10-m3.5.x_build\target\invoker-reports\BUILD-cli-options_endian.xml,
f:\jenkins\jenkins-slave\workspace\aven-jlink-plugin_MJLINK-26-6R5KMY7RJWJCDDS6GS7F2QBTFBPREF3UHXHNLUKO7K3YGJCZL2BA@2\windows-jdk10-m3.5.x_build\target\invoker-reports\BUILD-cli-options_ignore-signing-information.xml,
f:\jenkins\jenkins-slave\workspace\aven-jlink-plugin_MJLINK-26-6R5KMY7RJWJCDDS6GS7F2QBTFBPREF3UHXHNLUKO7K3YGJCZL2BA@2\windows-jdk10-m3.5.x_build\target\invoker-reports\BUILD-cli-options_no-header-files.xml,
f:\jenkins\jenkins-slave\workspace\aven-jlink-plugin_MJLINK-26-6R5KMY7RJWJCDDS6GS7F2QBTFBPREF3UHXHNLUKO7K3YGJCZL2BA@2\windows-jdk10-m3.5.x_build\target\invoker-reports\BUILD-cli-options_no-man-pages.xml,
f:\jenkins\jenkins-slave\workspace\aven-jlink-plugin_MJLINK-26-6R5KMY7RJWJCDDS6GS7F2QBTFBPREF3UHXHNLUKO7K3YGJCZL2BA@2\windows-jdk10-m3.5.x_build\target\invoker-reports\BUILD-cli-options_strip-debug.xml,
f:\jenkins\jenkins-slave\workspace\aven-jlink-plugin_MJLINK-26-6R5KMY7RJWJCDDS6GS7F2QBTFBPREF3UHXHNLUKO7K3YGJCZL2BA@2\windows-jdk10-m3.5.x_build\target\invoker-reports\BUILD-setup-jar-module-info.xml,
f:\jenkins\jenkins-slave\workspace\aven-jlink-plugin_MJLINK-26-6R5KMY7RJWJCDDS6GS7F2QBTFBPREF3UHXHNLUKO7K3YGJCZL2BA@2\windows-jdk10-m3.5.x_build\target\invoker-reports\BUILD-setup-jar.xml]
[windows-jdk10-m3.5.x_build] Found logs:[f:\jenkins\jenkins-slave\workspace\aven-jlink-plugin_MJLINK-26-6R5KMY7RJWJCDDS6GS7F2QBTFBPREF3UHXHNLUKO7K3YGJCZL2BA@2\windows-jdk10-m3.5.x_build\target\it\MJLINK-26\build.log,
f:\jenkins\jenkins-slave\workspace\aven-jlink-plugin_MJLINK-26-6R5KMY7RJWJCDDS6GS7F2QBTFBPREF3UHXHNLUKO7K3YGJCZL2BA@2\windows-jdk10-m3.5.x_build\target\it\MJLINK-3_improveVerboseOutput\build.log,
f:\jenkins\jenkins-slave\workspace\aven-jlink-plugin_MJLINK-26-6R5KMY7RJWJCDDS6GS7F2QBTFBPREF3UHXHNLUKO7K3YGJCZL2BA@2\windows-jdk10-m3.5.x_build\target\it\MJLINK-4_dependencyResolution\build.log,
f:\jenkins\jenkins-slave\workspace\aven-jlink-plugin_MJLINK-26-6R5KMY7RJWJCDDS6GS7F2QBTFBPREF3UHXHNLUKO7K3YGJCZL2BA@2\windows-jdk10-m3.5.x_build\target\it\cli-options\bind-services\build.log,
f:\jenkins\jenkins-slave\workspace\aven-jlink-plugin_MJLINK-26-6R5KMY7RJWJCDDS6GS7F2QBTFBPREF3UHXHNLUKO7K3YGJCZL2BA@2\windows-jdk10-m3.5.x_build\target\it\cli-options\compress-0\build.log,
f:\jenkins\jenkins-slave\workspace\aven-jlink-plugin_MJLINK-26-6R5KMY7RJWJCDDS6GS7F2QBTFBPREF3UHXHNLUKO7K3YGJCZL2BA@2\windows-jdk10-m3.5.x_build\target\it\cli-options\compress-1\build.log,
f:\jenkins\jenkins-slave\workspace\aven-jlink-plugin_MJLINK-26-6R5KMY7RJWJCDDS6GS7F2QBTFBPREF3UHXHNLUKO7K3YGJCZL2BA@2\windows-jdk10-m3.5.x_build\target\it\cli-options\compress-2\build.log,
f:\jenkins\jenkins-slave\workspace\aven-jlink-plugin_MJLINK-26-6R5KMY7RJWJCDDS6GS7F2QBTFBPREF3UHXHNLUKO7K3YGJCZL2BA@2\windows-jdk10-m3.5.x_build\target\it\cli-options\disable-plugin\build.log,
f:\jenkins\jenkins-slave\workspace\aven-jlink-plugin_MJLINK-26-6R5KMY7RJWJCDDS6GS7F2QBTFBPREF3UHXHNLUKO7K3YGJCZL2BA@2\windows-jdk10-m3.5.x_build\target\it\cli-options\endian-big\build.log,
f:\jenkins\jenkins-slave\workspace\aven-jlink-plugin_MJLINK-26-6R5KMY7RJWJCDDS6GS7F2QBTFBPREF3UHXHNLUKO7K3YGJCZL2BA@2\windows-jdk10-m3.5.x_build\target\it\cli-options\endian\build.log,
f:\jenkins\jenkins-slave\workspace\aven-jlink-plugin_MJLINK-26-6R5KMY7RJWJCDDS6GS7F2QBTFBPREF3UHXHNLUKO7K3YGJCZL2BA@2\windows-jdk10-m3.5.x_build\target\it\cli-options\ignore-signing-information\build.log,
f:\jenkins\jenkins-slave\workspace\aven-jlink-plugin_MJLINK-26-6R5KMY7RJWJCDDS6GS7F2QBTFBPREF3UHXHNLUKO7K3YGJCZL2BA@2\windows-jdk10-m3.5.x_build\target\it\cli-options\no-header-files\build.log,
f:\jenkins\jenkins-slave\workspace\aven-jlink-plugin_MJLINK-26-6R5KMY7RJWJCDDS6GS7F2QBTFBPREF3UHXHNLUKO7K3YGJCZL2BA@2\windows-jdk10-m3.5.x_build\target\it\cli-options\no-man-pages\build.log,
f:\jenkins\jenkins-slave\workspace\aven-jlink-plugin_MJLINK-26-6R5KMY7RJWJCDDS6GS7F2QBTFBPREF3UHXHNLUKO7K3YGJCZL2BA@2\windows-jdk10-m3.5.x_build\target\it\cli-options\strip-debug\build.log,
f:\jenkins\jenkins-slave\workspace\aven-jlink-plugin_MJLINK-26-6R5KMY7RJWJCDDS6GS7F2QBTFBPREF3UHXHNLUKO7K3YGJCZL2BA@2\windows-jdk10-m3.5.x_build\target\it\setup-jar-module-info\build.log,
f:\jenkins\jenkins-slave\workspace\aven-jlink-plugin_MJLINK-26-6R5KMY7RJWJCDDS6GS7F2QBTFBPREF3UHXHNLUKO7K3YGJCZL2BA@2\windows-jdk10-m3.5.x_build\target\it\setup-jar\build.log]
[windows-jdk10-m3.5.x_build] Finished parsing Maven Invoker results (found 16)
[windows-jdk10-m3.5.x_build] [withMaven] junitPublisher - Archive test results for Maven artifact
org.apache.maven.plugins:maven-jlink-plugin:3.0.0-alpha-2-SNAPSHOT generated by maven-surefire-plugin:test
(default-test): windows-jdk10-m3.5.x_build\target\surefire-reports\*.xml
[windows-jdk10-m3.5.x_build] Recording test results
[windows-jdk10-m3.5.x_build] [withMaven] openTasksPublisher - Scan Tasks for Maven artifact
org.apache.maven.plugins:maven-jlink-plugin:3.0.0-alpha-2-SNAPSHOT in source directory windows-jdk10-m3.5.x_build\src\main\java
[windows-jdk10-m3.5.x_build] [TASKS] Scanning folder 'f:\jenkins\jenkins-slave\workspace\aven-jlink-plugin_MJLINK-26-6R5KMY7RJWJCDDS6GS7F2QBTFBPREF3UHXHNLUKO7K3YGJCZL2BA@2'
for files matching the pattern 'windows-jdk10-m3.5.x_build\src\main\java\**\*' - excludes:
null
[windows-jdk10-m3.5.x_build] [TASKS] Found 2 files to scan for tasks
[windows-jdk10-m3.5.x_build] [TASKS] Found 5 open tasks.
[windows-jdk10-m3.5.x_build] Skipping warnings blame since pipelines do not have an SCM link.%n
[Pipeline] [windows-jdk10-m3.5.x_build] // withMaven
[Pipeline] [windows-jdk10-m3.5.x_build] cleanWs
[windows-jdk10-m3.5.x_build] [WS-CLEANUP] Deleting project workspace...[WS-CLEANUP] done
[Pipeline] [windows-jdk10-m3.5.x_build] cleanWs
[windows-jdk10-m3.5.x_build] [WS-CLEANUP] Deleting project workspace...[WS-CLEANUP] done
[Pipeline] [windows-jdk10-m3.5.x_build] }
[Pipeline] [windows-jdk10-m3.5.x_build] // stage
[Pipeline] [windows-jdk10-m3.5.x_build] }
[Pipeline] [windows-jdk10-m3.5.x_build] // node
[Pipeline] [windows-jdk10-m3.5.x_build] }
[windows-jdk10-m3.5.x_build] Failed in branch windows-jdk10-m3.5.x_build
[Pipeline] // parallel
[Pipeline] stage
[Pipeline] { (Notifications)
[Pipeline] echo
Build result: FAILURE
[Pipeline] jiraIssueSelector
[Pipeline] emailext
Mime
  • Unnamed multipart/mixed (inline, None, 0 bytes)
View raw message