maven-notifications mailing list archives

Site index · List index
Message view « Date » · « Thread »
Top « Date » · « Thread »
From Apache Jenkins Server <jenk...@builds.apache.org>
Subject Build failed in Jenkins: Maven TLP » maven-enforcer » MENFORCER-267 #13
Date Tue, 09 Oct 2018 05:32:50 GMT
See https://builds.apache.org/job/maven-box/job/maven-enforcer/job/MENFORCER-267/13/

Changes:

* Exclude H25
* Exclude H31 cause master is failing constantly.
* no need to test anymore with '3.0.x'
* Add Java 11 to defaults
* Try to shorten path for Windows by using tempDir
* Fix arguments
* Add option for temp workspace
* disable tmpWs
* enable tmpWs
* Use def
* Try to shorten wsDir

No tests ran.

Build log:
[...truncated 2.12 MB...]
[windows-jdk7] [INFO] Downloading from central: https://repo.maven.apache.org/maven2/org/apache/maven/shared/maven-filtering/3.1.1/maven-filtering-3.1.1.jar
[windows-jdk7] [INFO] Downloaded from central: https://repo.maven.apache.org/maven2/org/apache/maven/shared/maven-filtering/3.1.1/maven-filtering-3.1.1.jar
(51 kB at 1.4 MB/s)
[windows-jdk7] [INFO] Downloaded from central: https://repo.maven.apache.org/maven2/org/sonatype/plexus/plexus-build-api/0.0.7/plexus-build-api-0.0.7.jar
(8.5 kB at 95 kB/s)
[windows-jdk7] [INFO] Using 'UTF-8' encoding to copy filtered resources.
[windows-jdk7] [INFO] skip non existing resourceDirectory F:\jenkins\jenkins-slave\workspace\aven-enforcer_MENFORCER-267-MP35IMKBJP3RUJT6MXIRF6Y74MB6ZBG5J72MQVWQMIGYU26PXDCQ\m\enforcer-api\src\main\resources
[windows-jdk7] [INFO] Copying 3 resources
[windows-jdk7] [INFO] 
[windows-jdk7] [INFO] --- maven-compiler-plugin:3.7.0:compile (default-compile) @ enforcer-api
---
[windows-jdk7] [INFO] Downloading from central: https://repo.maven.apache.org/maven2/org/apache/maven/shared/maven-shared-incremental/1.1/maven-shared-incremental-1.1.pom
[windows-jdk7] [INFO] Downloaded from central: https://repo.maven.apache.org/maven2/org/apache/maven/shared/maven-shared-incremental/1.1/maven-shared-incremental-1.1.pom
(4.7 kB at 198 kB/s)
[windows-jdk7] [INFO] Downloading from central: https://repo.maven.apache.org/maven2/org/apache/maven/shared/maven-shared-utils/0.1/maven-shared-utils-0.1.pom
[windows-jdk7] [INFO] Downloaded from central: https://repo.maven.apache.org/maven2/org/apache/maven/shared/maven-shared-utils/0.1/maven-shared-utils-0.1.pom
(4.0 kB at 104 kB/s)
[windows-jdk7] [INFO] Downloading from central: https://repo.maven.apache.org/maven2/org/codehaus/plexus/plexus-java/0.9.2/plexus-java-0.9.2.pom
[windows-jdk7] [INFO] Downloaded from central: https://repo.maven.apache.org/maven2/org/codehaus/plexus/plexus-java/0.9.2/plexus-java-0.9.2.pom
(2.4 kB at 94 kB/s)
[windows-jdk7] [INFO] Downloading from central: https://repo.maven.apache.org/maven2/org/codehaus/plexus/plexus-languages/0.9.2/plexus-languages-0.9.2.pom
[windows-jdk7] [INFO] Downloaded from central: https://repo.maven.apache.org/maven2/org/codehaus/plexus/plexus-languages/0.9.2/plexus-languages-0.9.2.pom
(2.3 kB at 81 kB/s)
[windows-jdk7] [INFO] Downloading from central: https://repo.maven.apache.org/maven2/org/ow2/asm/asm/6.0_BETA/asm-6.0_BETA.pom
[windows-jdk7] [INFO] Downloaded from central: https://repo.maven.apache.org/maven2/org/ow2/asm/asm/6.0_BETA/asm-6.0_BETA.pom
(1.9 kB at 78 kB/s)
[windows-jdk7] [INFO] Downloading from central: https://repo.maven.apache.org/maven2/org/ow2/asm/asm-parent/6.0_BETA/asm-parent-6.0_BETA.pom
[windows-jdk7] [INFO] Downloaded from central: https://repo.maven.apache.org/maven2/org/ow2/asm/asm-parent/6.0_BETA/asm-parent-6.0_BETA.pom
(5.5 kB at 250 kB/s)
[windows-jdk7] [INFO] Downloading from central: https://repo.maven.apache.org/maven2/org/ow2/ow2/1.3/ow2-1.3.pom
[windows-jdk7] [INFO] Downloaded from central: https://repo.maven.apache.org/maven2/org/ow2/ow2/1.3/ow2-1.3.pom
(9.5 kB at 352 kB/s)
[windows-jdk7] [INFO] Downloading from central: https://repo.maven.apache.org/maven2/com/thoughtworks/qdox/qdox/2.0-M7/qdox-2.0-M7.pom
[windows-jdk7] [INFO] Downloaded from central: https://repo.maven.apache.org/maven2/com/thoughtworks/qdox/qdox/2.0-M7/qdox-2.0-M7.pom
(16 kB at 546 kB/s)
[windows-jdk7] [INFO] Downloading from central: https://repo.maven.apache.org/maven2/org/codehaus/plexus/plexus-compiler-api/2.8.2/plexus-compiler-api-2.8.2.pom
[windows-jdk7] [INFO] Downloaded from central: https://repo.maven.apache.org/maven2/org/codehaus/plexus/plexus-compiler-api/2.8.2/plexus-compiler-api-2.8.2.pom
(867 B at 33 kB/s)
[windows-jdk7] [INFO] Downloading from central: https://repo.maven.apache.org/maven2/org/codehaus/plexus/plexus-compiler/2.8.2/plexus-compiler-2.8.2.pom
[windows-jdk7] [INFO] Downloaded from central: https://repo.maven.apache.org/maven2/org/codehaus/plexus/plexus-compiler/2.8.2/plexus-compiler-2.8.2.pom
(4.9 kB at 174 kB/s)
[windows-jdk7] [INFO] Downloading from central: https://repo.maven.apache.org/maven2/org/codehaus/plexus/plexus-compiler-manager/2.8.2/plexus-compiler-manager-2.8.2.pom
[windows-jdk7] [INFO] Downloaded from central: https://repo.maven.apache.org/maven2/org/codehaus/plexus/plexus-compiler-manager/2.8.2/plexus-compiler-manager-2.8.2.pom
(692 B at 30 kB/s)
[windows-jdk7] [INFO] Downloading from central: https://repo.maven.apache.org/maven2/org/codehaus/plexus/plexus-compiler-javac/2.8.2/plexus-compiler-javac-2.8.2.pom
[windows-jdk7] [INFO] Downloaded from central: https://repo.maven.apache.org/maven2/org/codehaus/plexus/plexus-compiler-javac/2.8.2/plexus-compiler-javac-2.8.2.pom
(771 B at 32 kB/s)
[windows-jdk7] [INFO] Downloading from central: https://repo.maven.apache.org/maven2/org/codehaus/plexus/plexus-compilers/2.8.2/plexus-compilers-2.8.2.pom
[windows-jdk7] [INFO] Downloaded from central: https://repo.maven.apache.org/maven2/org/codehaus/plexus/plexus-compilers/2.8.2/plexus-compilers-2.8.2.pom
(1.3 kB at 64 kB/s)
[windows-jdk7] [INFO] Downloading from central: https://repo.maven.apache.org/maven2/com/thoughtworks/qdox/qdox/2.0-M7/qdox-2.0-M7.jar
[windows-jdk7] [INFO] Downloading from central: https://repo.maven.apache.org/maven2/org/codehaus/plexus/plexus-java/0.9.2/plexus-java-0.9.2.jar
[windows-jdk7] [INFO] Downloading from central: https://repo.maven.apache.org/maven2/org/codehaus/plexus/plexus-compiler-api/2.8.2/plexus-compiler-api-2.8.2.jar
[windows-jdk7] [INFO] Downloading from central: https://repo.maven.apache.org/maven2/org/apache/maven/shared/maven-shared-incremental/1.1/maven-shared-incremental-1.1.jar
[windows-jdk7] [INFO] Downloading from central: https://repo.maven.apache.org/maven2/org/ow2/asm/asm/6.0_BETA/asm-6.0_BETA.jar
[windows-jdk7] [INFO] Downloaded from central: https://repo.maven.apache.org/maven2/org/ow2/asm/asm/6.0_BETA/asm-6.0_BETA.jar
(56 kB at 818 kB/s)
[windows-jdk7] [INFO] Downloading from central: https://repo.maven.apache.org/maven2/org/codehaus/plexus/plexus-compiler-manager/2.8.2/plexus-compiler-manager-2.8.2.jar
[windows-jdk7] [INFO] Downloaded from central: https://repo.maven.apache.org/maven2/org/apache/maven/shared/maven-shared-incremental/1.1/maven-shared-incremental-1.1.jar
(14 kB at 86 kB/s)
[windows-jdk7] [INFO] Downloading from central: https://repo.maven.apache.org/maven2/org/codehaus/plexus/plexus-compiler-javac/2.8.2/plexus-compiler-javac-2.8.2.jar
[windows-jdk7] [INFO] Downloaded from central: https://repo.maven.apache.org/maven2/com/thoughtworks/qdox/qdox/2.0-M7/qdox-2.0-M7.jar
(315 kB at 1.9 MB/s)
[windows-jdk7] [INFO] Downloaded from central: https://repo.maven.apache.org/maven2/org/codehaus/plexus/plexus-compiler-manager/2.8.2/plexus-compiler-manager-2.8.2.jar
(4.7 kB at 28 kB/s)
[windows-jdk7] [INFO] Downloaded from central: https://repo.maven.apache.org/maven2/org/codehaus/plexus/plexus-compiler-api/2.8.2/plexus-compiler-api-2.8.2.jar
(26 kB at 126 kB/s)
[windows-jdk7] [INFO] Downloaded from central: https://repo.maven.apache.org/maven2/org/codehaus/plexus/plexus-java/0.9.2/plexus-java-0.9.2.jar
(31 kB at 129 kB/s)
[windows-jdk7] [INFO] Downloaded from central: https://repo.maven.apache.org/maven2/org/codehaus/plexus/plexus-compiler-javac/2.8.2/plexus-compiler-javac-2.8.2.jar
(20 kB at 83 kB/s)
[windows-jdk7] [INFO] Changes detected - recompiling the module!
[windows-jdk7] [INFO] Compiling 5 source files to F:\jenkins\jenkins-slave\workspace\aven-enforcer_MENFORCER-267-MP35IMKBJP3RUJT6MXIRF6Y74MB6ZBG5J72MQVWQMIGYU26PXDCQ\m\enforcer-api\target\classes
[windows-jdk7] [INFO] 
[windows-jdk7] [INFO] --- maven-resources-plugin:3.0.2:testResources (default-testResources)
@ enforcer-api ---
[windows-jdk7] [INFO] Using 'UTF-8' encoding to copy filtered resources.
[windows-jdk7] [INFO] skip non existing resourceDirectory F:\jenkins\jenkins-slave\workspace\aven-enforcer_MENFORCER-267-MP35IMKBJP3RUJT6MXIRF6Y74MB6ZBG5J72MQVWQMIGYU26PXDCQ\m\enforcer-api\src\test\resources
[windows-jdk7] [INFO] Copying 3 resources
[windows-jdk7] [INFO] 
[windows-jdk7] [INFO] --- maven-compiler-plugin:3.7.0:testCompile (default-testCompile) @
enforcer-api ---
[windows-jdk7] [INFO] No sources to compile
[windows-jdk7] [INFO] 
[windows-jdk7] [INFO] --- maven-surefire-plugin:2.20.1:test (default-test) @ enforcer-api
---
[windows-jdk7] [INFO] Downloading from central: https://repo.maven.apache.org/maven2/org/apache/maven/surefire/maven-surefire-common/2.20.1/maven-surefire-common-2.20.1.pom
[windows-jdk7] [INFO] Downloaded from central: https://repo.maven.apache.org/maven2/org/apache/maven/surefire/maven-surefire-common/2.20.1/maven-surefire-common-2.20.1.pom
(9.3 kB at 252 kB/s)
[windows-jdk7] [INFO] Downloading from central: https://repo.maven.apache.org/maven2/org/apache/maven/plugin-tools/maven-plugin-annotations/3.3/maven-plugin-annotations-3.3.pom
[windows-jdk7] [INFO] Downloaded from central: https://repo.maven.apache.org/maven2/org/apache/maven/plugin-tools/maven-plugin-annotations/3.3/maven-plugin-annotations-3.3.pom
(1.6 kB at 74 kB/s)
[windows-jdk7] [INFO] Downloading from central: https://repo.maven.apache.org/maven2/org/apache/maven/plugin-tools/maven-plugin-tools/3.3/maven-plugin-tools-3.3.pom
[windows-jdk7] [INFO] Downloaded from central: https://repo.maven.apache.org/maven2/org/apache/maven/plugin-tools/maven-plugin-tools/3.3/maven-plugin-tools-3.3.pom
(13 kB at 506 kB/s)
[windows-jdk7] [INFO] Downloading from central: https://repo.maven.apache.org/maven2/org/apache/maven/surefire/surefire-api/2.20.1/surefire-api-2.20.1.pom
[windows-jdk7] [INFO] Downloaded from central: https://repo.maven.apache.org/maven2/org/apache/maven/surefire/surefire-api/2.20.1/surefire-api-2.20.1.pom
(3.7 kB at 183 kB/s)
[windows-jdk7] [INFO] Downloading from central: https://repo.maven.apache.org/maven2/org/apache/maven/surefire/surefire-logger-api/2.20.1/surefire-logger-api-2.20.1.pom
[windows-jdk7] [INFO] Downloaded from central: https://repo.maven.apache.org/maven2/org/apache/maven/surefire/surefire-logger-api/2.20.1/surefire-logger-api-2.20.1.pom
(2.0 kB at 54 kB/s)
[windows-jdk7] [INFO] Downloading from central: https://repo.maven.apache.org/maven2/org/apache/maven/surefire/surefire-booter/2.20.1/surefire-booter-2.20.1.pom
[windows-jdk7] [INFO] Downloaded from central: https://repo.maven.apache.org/maven2/org/apache/maven/surefire/surefire-booter/2.20.1/surefire-booter-2.20.1.pom
(8.5 kB at 292 kB/s)
[windows-jdk7] [INFO] Downloading from central: https://repo.maven.apache.org/maven2/org/apache/maven/maven-toolchain/2.2.1/maven-toolchain-2.2.1.pom
[windows-jdk7] [INFO] Downloaded from central: https://repo.maven.apache.org/maven2/org/apache/maven/maven-toolchain/2.2.1/maven-toolchain-2.2.1.pom
(3.3 kB at 167 kB/s)
[windows-jdk7] [INFO] Downloading from central: https://repo.maven.apache.org/maven2/org/apache/maven/surefire/maven-surefire-common/2.20.1/maven-surefire-common-2.20.1.jar
[windows-jdk7] [INFO] Downloading from central: https://repo.maven.apache.org/maven2/org/apache/maven/plugin-tools/maven-plugin-annotations/3.3/maven-plugin-annotations-3.3.jar
[windows-jdk7] [INFO] Downloading from central: https://repo.maven.apache.org/maven2/org/apache/maven/surefire/surefire-api/2.20.1/surefire-api-2.20.1.jar
[windows-jdk7] [INFO] Downloading from central: https://repo.maven.apache.org/maven2/org/apache/maven/surefire/surefire-booter/2.20.1/surefire-booter-2.20.1.jar
[windows-jdk7] [INFO] Downloading from central: https://repo.maven.apache.org/maven2/org/apache/maven/surefire/surefire-logger-api/2.20.1/surefire-logger-api-2.20.1.jar
[windows-jdk7] [INFO] Downloaded from central: https://repo.maven.apache.org/maven2/org/apache/maven/surefire/surefire-booter/2.20.1/surefire-booter-2.20.1.jar
(268 kB at 3.9 MB/s)
[windows-jdk7] [INFO] Downloading from central: https://repo.maven.apache.org/maven2/junit/junit/4.12/junit-4.12.jar
[windows-jdk7] [INFO] Downloaded from central: https://repo.maven.apache.org/maven2/org/apache/maven/surefire/surefire-api/2.20.1/surefire-api-2.20.1.jar
(183 kB at 2.5 MB/s)
[windows-jdk7] [INFO] Downloading from central: https://repo.maven.apache.org/maven2/org/apache/maven/maven-toolchain/2.2.1/maven-toolchain-2.2.1.jar
[windows-jdk7] [INFO] Downloaded from central: https://repo.maven.apache.org/maven2/org/apache/maven/surefire/maven-surefire-common/2.20.1/maven-surefire-common-2.20.1.jar
(509 kB at 6.7 MB/s)
[windows-jdk7] [INFO] Downloaded from central: https://repo.maven.apache.org/maven2/org/apache/maven/plugin-tools/maven-plugin-annotations/3.3/maven-plugin-annotations-3.3.jar
(14 kB at 106 kB/s)
[windows-jdk7] [INFO] Downloaded from central: https://repo.maven.apache.org/maven2/org/apache/maven/surefire/surefire-logger-api/2.20.1/surefire-logger-api-2.20.1.jar
(13 kB at 93 kB/s)
[windows-jdk7] [INFO] Downloaded from central: https://repo.maven.apache.org/maven2/junit/junit/4.12/junit-4.12.jar
(315 kB at 2.3 MB/s)
[windows-jdk7] [INFO] Downloaded from central: https://repo.maven.apache.org/maven2/org/apache/maven/maven-toolchain/2.2.1/maven-toolchain-2.2.1.jar
(38 kB at 132 kB/s)
[windows-jdk7] [INFO] 
[windows-jdk7] [INFO] --- maven-jar-plugin:3.0.2:jar (default-jar) @ enforcer-api ---
[windows-jdk7] [INFO] Downloading from central: https://repo.maven.apache.org/maven2/org/apache/maven/shared/maven-shared-utils/3.0.1/maven-shared-utils-3.0.1.jar
[windows-jdk7] [INFO] Downloaded from central: https://repo.maven.apache.org/maven2/org/apache/maven/shared/maven-shared-utils/3.0.1/maven-shared-utils-3.0.1.jar
(154 kB at 4.1 MB/s)
[windows-jdk7] [INFO] Building jar: F:\jenkins\jenkins-slave\workspace\aven-enforcer_MENFORCER-267-MP35IMKBJP3RUJT6MXIRF6Y74MB6ZBG5J72MQVWQMIGYU26PXDCQ\m\enforcer-api\target\enforcer-api-3.0.0-SNAPSHOT.jar
[windows-jdk7] [INFO] 
[windows-jdk7] [INFO] --- maven-site-plugin:3.7:attach-descriptor (attach-descriptor) @ enforcer-api
---
[windows-jdk7] [INFO] Skipping because packaging 'jar' is not pom.
[windows-jdk7] [INFO] 
[windows-jdk7] [INFO] --- maven-checkstyle-plugin:3.0.0:check (checkstyle-check) @ enforcer-api
---
[windows-jdk7] [INFO] 
[windows-jdk7] [INFO] ------------------------------------------------------------------------
[windows-jdk7] [INFO] Building Apache Maven Enforcer Built-In Rules 3.0.0-SNAPSHOT
[windows-jdk7] [INFO] ------------------------------------------------------------------------
[windows-jdk7] [INFO] Downloading from central: https://repo.maven.apache.org/maven2/org/apache/maven/shared/maven-common-artifact-filters/3.0.1/maven-common-artifact-filters-3.0.1.pom
[windows-jdk7] [INFO] Downloaded from central: https://repo.maven.apache.org/maven2/org/apache/maven/shared/maven-common-artifact-filters/3.0.1/maven-common-artifact-filters-3.0.1.pom
(4.8 kB at 202 kB/s)
[windows-jdk7] [INFO] Downloading from central: https://repo.maven.apache.org/maven2/org/apache/maven/plugin-testing/maven-plugin-testing-harness/2.1/maven-plugin-testing-harness-2.1.pom
[windows-jdk7] [INFO] Downloaded from central: https://repo.maven.apache.org/maven2/org/apache/maven/plugin-testing/maven-plugin-testing-harness/2.1/maven-plugin-testing-harness-2.1.pom
(3.2 kB at 79 kB/s)
[windows-jdk7] [INFO] Downloading from central: https://repo.maven.apache.org/maven2/org/apache/maven/plugin-testing/maven-plugin-testing/2.1/maven-plugin-testing-2.1.pom
[windows-jdk7] [INFO] Downloaded from central: https://repo.maven.apache.org/maven2/org/apache/maven/plugin-testing/maven-plugin-testing/2.1/maven-plugin-testing-2.1.pom
(10 kB at 457 kB/s)
[windows-jdk7] [INFO] Downloading from central: https://repo.maven.apache.org/maven2/commons-codec/commons-codec/1.6/commons-codec-1.6.pom
[windows-jdk7] [INFO] Downloaded from central: https://repo.maven.apache.org/maven2/commons-codec/commons-codec/1.6/commons-codec-1.6.pom
(11 kB at 507 kB/s)
[windows-jdk7] [INFO] Downloading from central: https://repo.maven.apache.org/maven2/org/apache/commons/commons-parent/22/commons-parent-22.pom
[windows-jdk7] [INFO] Downloaded from central: https://repo.maven.apache.org/maven2/org/apache/commons/commons-parent/22/commons-parent-22.pom
(42 kB at 1.3 MB/s)
[windows-jdk7] [INFO] Downloading from central: https://repo.maven.apache.org/maven2/org/mockito/mockito-core/2.11.0/mockito-core-2.11.0.pom
[windows-jdk7] [INFO] Downloaded from central: https://repo.maven.apache.org/maven2/org/mockito/mockito-core/2.11.0/mockito-core-2.11.0.pom
(15 kB at 466 kB/s)
[windows-jdk7] [INFO] Downloading from central: https://repo.maven.apache.org/maven2/net/bytebuddy/byte-buddy/1.7.4/byte-buddy-1.7.4.pom
[windows-jdk7] [INFO] Downloaded from central: https://repo.maven.apache.org/maven2/net/bytebuddy/byte-buddy/1.7.4/byte-buddy-1.7.4.pom
(12 kB at 555 kB/s)
[windows-jdk7] [INFO] Downloading from central: https://repo.maven.apache.org/maven2/net/bytebuddy/byte-buddy-parent/1.7.4/byte-buddy-parent-1.7.4.pom
[windows-jdk7] [INFO] Downloaded from central: https://repo.maven.apache.org/maven2/net/bytebuddy/byte-buddy-parent/1.7.4/byte-buddy-parent-1.7.4.pom
(25 kB at 1.1 MB/s)
[windows-jdk7] [INFO] Downloading from central: https://repo.maven.apache.org/maven2/net/bytebuddy/byte-buddy-agent/1.7.4/byte-buddy-agent-1.7.4.pom
[windows-jdk7] [INFO] Downloaded from central: https://repo.maven.apache.org/maven2/net/bytebuddy/byte-buddy-agent/1.7.4/byte-buddy-agent-1.7.4.pom
(4.9 kB at 224 kB/s)
[windows-jdk7] [INFO] Downloading from central: https://repo.maven.apache.org/maven2/org/objenesis/objenesis/2.6/objenesis-2.6.pom
[windows-jdk7] [INFO] Downloaded from central: https://repo.maven.apache.org/maven2/org/objenesis/objenesis/2.6/objenesis-2.6.pom
(2.8 kB at 139 kB/s)
[windows-jdk7] [INFO] Downloading from central: https://repo.maven.apache.org/maven2/org/objenesis/objenesis-parent/2.6/objenesis-parent-2.6.pom
[windows-jdk7] [INFO] Downloaded from central: https://repo.maven.apache.org/maven2/org/objenesis/objenesis-parent/2.6/objenesis-parent-2.6.pom
(17 kB at 751 kB/s)
[windows-jdk7] [INFO] Downloading from central: https://repo.maven.apache.org/maven2/org/apache/maven/shared/maven-dependency-tree/3.0.1/maven-dependency-tree-3.0.1.pom
[windows-jdk7] [INFO] Downloaded from central: https://repo.maven.apache.org/maven2/org/apache/maven/shared/maven-dependency-tree/3.0.1/maven-dependency-tree-3.0.1.pom
(7.5 kB at 259 kB/s)
[windows-jdk7] [INFO] Downloading from central: https://repo.maven.apache.org/maven2/org/assertj/assertj-core/1.7.1/assertj-core-1.7.1.pom
[windows-jdk7] [INFO] Downloaded from central: https://repo.maven.apache.org/maven2/org/assertj/assertj-core/1.7.1/assertj-core-1.7.1.pom
(4.7 kB at 234 kB/s)
[windows-jdk7] [INFO] Downloading from central: https://repo.maven.apache.org/maven2/org/assertj/assertj-parent-pom/1.2.6/assertj-parent-pom-1.2.6.pom
[windows-jdk7] [INFO] Downloaded from central: https://repo.maven.apache.org/maven2/org/assertj/assertj-parent-pom/1.2.6/assertj-parent-pom-1.2.6.pom
(13 kB at 609 kB/s)
[windows-jdk7] [INFO] Downloading from central: https://repo.maven.apache.org/maven2/org/apache/maven/shared/maven-common-artifact-filters/3.0.1/maven-common-artifact-filters-3.0.1.jar
[windows-jdk7] [INFO] Downloading from central: https://repo.maven.apache.org/maven2/org/apache/maven/plugin-testing/maven-plugin-testing-harness/2.1/maven-plugin-testing-harness-2.1.jar
[windows-jdk7] [INFO] Downloading from central: https://repo.maven.apache.org/maven2/org/apache/commons/commons-lang3/3.5/commons-lang3-3.5.jar
[windows-jdk7] [INFO] Downloading from central: https://repo.maven.apache.org/maven2/org/mockito/mockito-core/2.11.0/mockito-core-2.11.0.jar
[windows-jdk7] [INFO] Downloading from central: https://repo.maven.apache.org/maven2/commons-codec/commons-codec/1.6/commons-codec-1.6.jar
[windows-jdk7] [INFO] Downloaded from central: https://repo.maven.apache.org/maven2/commons-codec/commons-codec/1.6/commons-codec-1.6.jar
(233 kB at 4.2 MB/s)
[windows-jdk7] [INFO] Downloading from central: https://repo.maven.apache.org/maven2/net/bytebuddy/byte-buddy/1.7.4/byte-buddy-1.7.4.jar
[windows-jdk7] [INFO] Downloaded from central: https://repo.maven.apache.org/maven2/org/apache/commons/commons-lang3/3.5/commons-lang3-3.5.jar
(480 kB at 8.3 MB/s)
[windows-jdk7] [INFO] Downloading from central: https://repo.maven.apache.org/maven2/net/bytebuddy/byte-buddy-agent/1.7.4/byte-buddy-agent-1.7.4.jar
[windows-jdk7] [INFO] Downloaded from central: https://repo.maven.apache.org/maven2/org/apache/maven/shared/maven-common-artifact-filters/3.0.1/maven-common-artifact-filters-3.0.1.jar
(61 kB at 1.0 MB/s)
[windows-jdk7] [INFO] Downloading from central: https://repo.maven.apache.org/maven2/org/objenesis/objenesis/2.6/objenesis-2.6.jar
[windows-jdk7] [INFO] Downloaded from central: https://repo.maven.apache.org/maven2/org/mockito/mockito-core/2.11.0/mockito-core-2.11.0.jar
(538 kB at 6.6 MB/s)
[windows-jdk7] [INFO] Downloading from central: https://repo.maven.apache.org/maven2/org/apache/maven/shared/maven-dependency-tree/3.0.1/maven-dependency-tree-3.0.1.jar
[windows-jdk7] [INFO] Downloaded from central: https://repo.maven.apache.org/maven2/org/objenesis/objenesis/2.6/objenesis-2.6.jar
(56 kB at 348 kB/s)
[windows-jdk7] [INFO] Downloading from central: https://repo.maven.apache.org/maven2/org/assertj/assertj-core/1.7.1/assertj-core-1.7.1.jar
[windows-jdk7] [INFO] Downloaded from central: https://repo.maven.apache.org/maven2/net/bytebuddy/byte-buddy/1.7.4/byte-buddy-1.7.4.jar
(2.9 MB at 16 MB/s)
[windows-jdk7] [INFO] Downloaded from central: https://repo.maven.apache.org/maven2/org/apache/maven/plugin-testing/maven-plugin-testing-harness/2.1/maven-plugin-testing-harness-2.1.jar
(39 kB at 196 kB/s)
[windows-jdk7] [INFO] Downloaded from central: https://repo.maven.apache.org/maven2/org/assertj/assertj-core/1.7.1/assertj-core-1.7.1.jar
(619 kB at 2.9 MB/s)
[windows-jdk7] [INFO] Downloaded from central: https://repo.maven.apache.org/maven2/org/apache/maven/shared/maven-dependency-tree/3.0.1/maven-dependency-tree-3.0.1.jar
(37 kB at 118 kB/s)
[windows-jdk7] [INFO] Downloaded from central: https://repo.maven.apache.org/maven2/net/bytebuddy/byte-buddy-agent/1.7.4/byte-buddy-agent-1.7.4.jar
(43 kB at 124 kB/s)
[windows-jdk7] [INFO] 
[windows-jdk7] [INFO] --- maven-clean-plugin:3.0.0:clean (default-clean) @ enforcer-rules
---
[windows-jdk7] [INFO] 
[windows-jdk7] [INFO] --- maven-enforcer-plugin:1.4.1:enforce (enforce-maven-version) @ enforcer-rules
---
[windows-jdk7] [INFO] 
[windows-jdk7] [INFO] --- maven-enforcer-plugin:1.4.1:enforce (enforce-bytecode-version) @
enforcer-rules ---
[windows-jdk7] [INFO] 
[windows-jdk7] [INFO] --- maven-enforcer-plugin:1.4.1:enforce (ban-known-bad-maven-versions)
@ enforcer-rules ---
[windows-jdk7] [INFO] 
[windows-jdk7] [INFO] --- apache-rat-plugin:0.12:check (rat-check) @ enforcer-rules ---
[windows-jdk7] [INFO] Enabled default license matchers.
[windows-jdk7] [INFO] Will parse SCM ignores for exclusions...
[windows-jdk7] [INFO] Finished adding exclusions from SCM ignore files.
[windows-jdk7] [INFO] 61 implicit excludes (use -debug for more details).
[windows-jdk7] [INFO] Exclude: .repository/**
[windows-jdk7] [INFO] Exclude: .maven/spy.log
[windows-jdk7] [INFO] Exclude: dependency-reduced-pom.xml
[windows-jdk7] [INFO] Exclude: .java-version
[windows-jdk7] [INFO] 129 resources included (use -debug for more details)
[windows-jdk7] [INFO] Rat check: Summary over all files. Unapproved: 0, unknown: 0, generated:
0, approved: 123 licenses.
[windows-jdk7] [INFO] 
[windows-jdk7] [INFO] --- maven-remote-resources-plugin:1.5:process (process-resource-bundles)
@ enforcer-rules ---
[windows-jdk7] [INFO] 
[windows-jdk7] [INFO] --- maven-resources-plugin:3.0.2:resources (default-resources) @ enforcer-rules
---
[windows-jdk7] [INFO] Using 'UTF-8' encoding to copy filtered resources.
[windows-jdk7] [INFO] skip non existing resourceDirectory F:\jenkins\jenkins-slave\workspace\aven-enforcer_MENFORCER-267-MP35IMKBJP3RUJT6MXIRF6Y74MB6ZBG5J72MQVWQMIGYU26PXDCQ\m\enforcer-rules\src\main\resources
[windows-jdk7] [INFO] Copying 3 resources
[windows-jdk7] [INFO] 
[windows-jdk7] [INFO] --- maven-compiler-plugin:3.7.0:compile (default-compile) @ enforcer-rules
---
[windows-jdk7] [INFO] Changes detected - recompiling the module!
[windows-jdk7] [INFO] Compiling 43 source files to F:\jenkins\jenkins-slave\workspace\aven-enforcer_MENFORCER-267-MP35IMKBJP3RUJT6MXIRF6Y74MB6ZBG5J72MQVWQMIGYU26PXDCQ\m\enforcer-rules\target\classes
[windows-jdk7] [INFO] /F:/jenkins/jenkins-slave/workspace/aven-enforcer_MENFORCER-267-MP35IMKBJP3RUJT6MXIRF6Y74MB6ZBG5J72MQVWQMIGYU26PXDCQ/m/enforcer-rules/src/main/java/org/apache/maven/plugins/enforcer/RequirePluginVersions.java:
Some input files use or override a deprecated API.
[windows-jdk7] [INFO] /F:/jenkins/jenkins-slave/workspace/aven-enforcer_MENFORCER-267-MP35IMKBJP3RUJT6MXIRF6Y74MB6ZBG5J72MQVWQMIGYU26PXDCQ/m/enforcer-rules/src/main/java/org/apache/maven/plugins/enforcer/RequirePluginVersions.java:
Recompile with -Xlint:deprecation for details.
[windows-jdk7] [INFO] /F:/jenkins/jenkins-slave/workspace/aven-enforcer_MENFORCER-267-MP35IMKBJP3RUJT6MXIRF6Y74MB6ZBG5J72MQVWQMIGYU26PXDCQ/m/enforcer-rules/src/main/java/org/apache/maven/plugins/enforcer/RequirePluginVersions.java:
F:\jenkins\jenkins-slave\workspace\aven-enforcer_MENFORCER-267-MP35IMKBJP3RUJT6MXIRF6Y74MB6ZBG5J72MQVWQMIGYU26PXDCQ\m\enforcer-rules\src\main\java\org\apache\maven\plugins\enforcer\RequirePluginVersions.java
uses unchecked or unsafe operations.
[windows-jdk7] [INFO] /F:/jenkins/jenkins-slave/workspace/aven-enforcer_MENFORCER-267-MP35IMKBJP3RUJT6MXIRF6Y74MB6ZBG5J72MQVWQMIGYU26PXDCQ/m/enforcer-rules/src/main/java/org/apache/maven/plugins/enforcer/RequirePluginVersions.java:
Recompile with -Xlint:unchecked for details.
[windows-jdk7] [INFO] -------------------------------------------------------------
[windows-jdk7] [ERROR] COMPILATION ERROR : 
[windows-jdk7] [INFO] -------------------------------------------------------------
[windows-jdk7] [ERROR] /F:/jenkins/jenkins-slave/workspace/aven-enforcer_MENFORCER-267-MP35IMKBJP3RUJT6MXIRF6Y74MB6ZBG5J72MQVWQMIGYU26PXDCQ/m/enforcer-rules/src/main/java/org/apache/maven/plugins/enforcer/RequirePluginVersions.java:[555,26]
cannot find symbol
[windows-jdk7]   symbol:   method resolve(org.apache.maven.artifact.Artifact,java.util.List<org.apache.maven.artifact.repository.ArtifactRepository>,org.apache.maven.artifact.repository.ArtifactRepository)
[windows-jdk7]   location: variable resolver of type org.sonatype.aether.impl.ArtifactResolver
[windows-jdk7] [ERROR] /F:/jenkins/jenkins-slave/workspace/aven-enforcer_MENFORCER-267-MP35IMKBJP3RUJT6MXIRF6Y74MB6ZBG5J72MQVWQMIGYU26PXDCQ/m/enforcer-rules/src/main/java/org/apache/maven/plugins/enforcer/BannedPlugins.java:[35,5]
method does not override or implement a method from a supertype
[windows-jdk7] [INFO] 2 errors 
[windows-jdk7] [INFO] -------------------------------------------------------------
[windows-jdk7] [INFO] ------------------------------------------------------------------------
[windows-jdk7] [INFO] Reactor Summary:
[windows-jdk7] [INFO] 
[windows-jdk7] [INFO] Apache Maven Enforcer .............................. SUCCESS [ 45.385
s]
[windows-jdk7] [INFO] Apache Maven Enforcer API .......................... SUCCESS [  9.770
s]
[windows-jdk7] [INFO] Apache Maven Enforcer Built-In Rules ............... FAILURE [  6.669
s]
[windows-jdk7] [INFO] Apache Maven Enforcer Plugin ....................... SKIPPED
[windows-jdk7] [INFO] ------------------------------------------------------------------------
[windows-jdk7] [INFO] BUILD FAILURE
[windows-jdk7] [INFO] ------------------------------------------------------------------------
[windows-jdk7] [INFO] Total time: 01:03 min
[windows-jdk7] [INFO] Finished at: 2018-10-08T22:32:48-07:00
[windows-jdk7] [INFO] Final Memory: 35M/221M
[windows-jdk7] [INFO] ------------------------------------------------------------------------
[windows-jdk7] [INFO] [jenkins-event-spy] Generated F:\jenkins\jenkins-slave\workspace\aven-enforcer_MENFORCER-267-MP35IMKBJP3RUJT6MXIRF6Y74MB6ZBG5J72MQVWQMIGYU26PXDCQ@tmp\withMaven6a7876b4\maven-spy-20181008-223144-853830254166383296924.log
[windows-jdk7] [ERROR] Failed to execute goal org.apache.maven.plugins:maven-compiler-plugin:3.7.0:compile
(default-compile) on project enforcer-rules: Compilation failure: Compilation failure: 
[windows-jdk7] [ERROR] /F:/jenkins/jenkins-slave/workspace/aven-enforcer_MENFORCER-267-MP35IMKBJP3RUJT6MXIRF6Y74MB6ZBG5J72MQVWQMIGYU26PXDCQ/m/enforcer-rules/src/main/java/org/apache/maven/plugins/enforcer/RequirePluginVersions.java:[555,26]
cannot find symbol
[windows-jdk7] [ERROR]   symbol:   method resolve(org.apache.maven.artifact.Artifact,java.util.List<org.apache.maven.artifact.repository.ArtifactRepository>,org.apache.maven.artifact.repository.ArtifactRepository)
[windows-jdk7] [ERROR]   location: variable resolver of type org.sonatype.aether.impl.ArtifactResolver
[windows-jdk7] [ERROR] /F:/jenkins/jenkins-slave/workspace/aven-enforcer_MENFORCER-267-MP35IMKBJP3RUJT6MXIRF6Y74MB6ZBG5J72MQVWQMIGYU26PXDCQ/m/enforcer-rules/src/main/java/org/apache/maven/plugins/enforcer/BannedPlugins.java:[35,5]
method does not override or implement a method from a supertype
[windows-jdk7] [ERROR] -> [Help 1]
[windows-jdk7] [ERROR] 
[windows-jdk7] [ERROR] To see the full stack trace of the errors, re-run Maven with the -e
switch.
[windows-jdk7] [ERROR] Re-run Maven using the -X switch to enable full debug logging.
[windows-jdk7] [ERROR] 
[windows-jdk7] [ERROR] For more information about the errors and possible solutions, please
read the following articles:
[windows-jdk7] [ERROR] [Help 1] http://cwiki.apache.org/confluence/display/MAVEN/MojoFailureException
[windows-jdk7] [ERROR] 
[windows-jdk7] [ERROR] After correcting the problems, you can resume the build with the command
[windows-jdk7] [ERROR]   mvn <goals> -rf :enforcer-rules
[windows-jdk7] Picked up JAVA_TOOL_OPTIONS: -Dmaven.ext.class.path="f:\jenkins\jenkins-slave\workspace\aven-enforcer_MENFORCER-267-MP35IMKBJP3RUJT6MXIRF6Y74MB6ZBG5J72MQVWQMIGYU26PXDCQ@tmp\withMaven6a7876b4\pipeline-maven-spy.jar"
-Dorg.jenkinsci.plugins.pipeline.maven.reportsFolder="f:\jenkins\jenkins-slave\workspace\aven-enforcer_MENFORCER-267-MP35IMKBJP3RUJT6MXIRF6Y74MB6ZBG5J72MQVWQMIGYU26PXDCQ@tmp\withMaven6a7876b4"

[Pipeline] [windows-jdk7] }
[Pipeline] [windows-jdk7] // dir
[Pipeline] [windows-jdk7] }
[windows-jdk7] [withMaven] junitPublisher - Archive test results for Maven artifact org.apache.maven.enforcer:enforcer-api:3.0.0-SNAPSHOT
generated by maven-surefire-plugin:test (default-test): m\enforcer-api\target\surefire-reports\*.xml
[windows-jdk7] Recording test results
[windows-jdk7] None of the test reports contained any result
[Pipeline] [windows-jdk7] // withMaven
[Pipeline] [windows-jdk7] cleanWs
[windows-jdk7] [WS-CLEANUP] Deleting project workspace...[WS-CLEANUP] done
[Pipeline] [windows-jdk7] cleanWs
[windows-jdk7] [WS-CLEANUP] Deleting project workspace...[WS-CLEANUP] done
[Pipeline] [windows-jdk7] }
[Pipeline] [windows-jdk7] // stage
[Pipeline] [windows-jdk7] }
[Pipeline] [windows-jdk7] // node
[Pipeline] [windows-jdk7] }
[windows-jdk7] Failed in branch windows-jdk7
[Pipeline] // parallel
[Pipeline] stage
[Pipeline] { (Notifications)
[Pipeline] echo
Build result: FAILURE
[Pipeline] jiraIssueSelector
[Pipeline] emailext
Mime
  • Unnamed multipart/mixed (inline, None, 0 bytes)
View raw message