maven-notifications mailing list archives

Site index · List index
Message view « Date » · « Thread »
Top « Date » · « Thread »
From Apache Jenkins Server <jenk...@builds.apache.org>
Subject Build unstable in Jenkins: Maven TLP » maven-scm » SCM-877 #15
Date Fri, 02 Nov 2018 10:10:32 GMT
See https://builds.apache.org/job/maven-box/job/maven-scm/job/SCM-877/15/

No changes.

20 tests failed.
FAILED:  org.apache.maven.scm.plugin.CheckoutMojoTest.testExcludeInclude

Error Message:
Cannot run checkout command : 

Stack Trace:
org.apache.maven.plugin.MojoExecutionException: Cannot run checkout command : 
	at org.apache.maven.scm.plugin.CheckoutMojoTest.testExcludeInclude(CheckoutMojoTest.java:153)
Caused by: org.apache.maven.scm.ScmException: Can't load the scm provider.
	at org.apache.maven.scm.plugin.CheckoutMojoTest.testExcludeInclude(CheckoutMojoTest.java:153)
Caused by: org.apache.maven.scm.repository.ScmRepositoryException: The scm url is invalid.
	at org.apache.maven.scm.plugin.CheckoutMojoTest.testExcludeInclude(CheckoutMojoTest.java:153)


FAILED:  org.apache.maven.scm.plugin.CheckoutMojoTest.testUseExport

Error Message:
Cannot run checkout command : 

Stack Trace:
org.apache.maven.plugin.MojoExecutionException: Cannot run checkout command : 
	at org.apache.maven.scm.plugin.CheckoutMojoTest.testUseExport(CheckoutMojoTest.java:132)
Caused by: org.apache.maven.scm.ScmException: Can't load the scm provider.
	at org.apache.maven.scm.plugin.CheckoutMojoTest.testUseExport(CheckoutMojoTest.java:132)
Caused by: org.apache.maven.scm.repository.ScmRepositoryException: The scm url is invalid.
	at org.apache.maven.scm.plugin.CheckoutMojoTest.testUseExport(CheckoutMojoTest.java:132)


FAILED:  org.apache.maven.scm.plugin.CheckoutMojoTest.testExcludeInclude

Error Message:
Cannot run checkout command : 

Stack Trace:
org.apache.maven.plugin.MojoExecutionException: Cannot run checkout command : 
	at org.apache.maven.scm.plugin.CheckoutMojoTest.testExcludeInclude(CheckoutMojoTest.java:153)
Caused by: org.apache.maven.scm.ScmException: Can't load the scm provider.
	at org.apache.maven.scm.plugin.CheckoutMojoTest.testExcludeInclude(CheckoutMojoTest.java:153)
Caused by: org.apache.maven.scm.repository.ScmRepositoryException: The scm url is invalid.
	at org.apache.maven.scm.plugin.CheckoutMojoTest.testExcludeInclude(CheckoutMojoTest.java:153)


FAILED:  org.apache.maven.scm.plugin.CheckoutMojoTest.testUseExport

Error Message:
Cannot run checkout command : 

Stack Trace:
org.apache.maven.plugin.MojoExecutionException: Cannot run checkout command : 
	at org.apache.maven.scm.plugin.CheckoutMojoTest.testUseExport(CheckoutMojoTest.java:132)
Caused by: org.apache.maven.scm.ScmException: Can't load the scm provider.
	at org.apache.maven.scm.plugin.CheckoutMojoTest.testUseExport(CheckoutMojoTest.java:132)
Caused by: org.apache.maven.scm.repository.ScmRepositoryException: The scm url is invalid.
	at org.apache.maven.scm.plugin.CheckoutMojoTest.testUseExport(CheckoutMojoTest.java:132)


FAILED:  org.apache.maven.scm.plugin.CheckoutMojoTest.testExcludeInclude

Error Message:
Cannot run checkout command : 

Stack Trace:
org.apache.maven.plugin.MojoExecutionException: Cannot run checkout command : 
	at org.apache.maven.scm.plugin.CheckoutMojoTest.testExcludeInclude(CheckoutMojoTest.java:153)
Caused by: org.apache.maven.scm.ScmException: Can't load the scm provider.
	at org.apache.maven.scm.plugin.CheckoutMojoTest.testExcludeInclude(CheckoutMojoTest.java:153)
Caused by: org.apache.maven.scm.repository.ScmRepositoryException: The scm url is invalid.
	at org.apache.maven.scm.plugin.CheckoutMojoTest.testExcludeInclude(CheckoutMojoTest.java:153)


FAILED:  org.apache.maven.scm.plugin.CheckoutMojoTest.testUseExport

Error Message:
Cannot run checkout command : 

Stack Trace:
org.apache.maven.plugin.MojoExecutionException: Cannot run checkout command : 
	at org.apache.maven.scm.plugin.CheckoutMojoTest.testUseExport(CheckoutMojoTest.java:132)
Caused by: org.apache.maven.scm.ScmException: Can't load the scm provider.
	at org.apache.maven.scm.plugin.CheckoutMojoTest.testUseExport(CheckoutMojoTest.java:132)
Caused by: org.apache.maven.scm.repository.ScmRepositoryException: The scm url is invalid.
	at org.apache.maven.scm.plugin.CheckoutMojoTest.testUseExport(CheckoutMojoTest.java:132)


FAILED:  org.apache.maven.scm.plugin.CheckoutMojoTest.testExcludeInclude

Error Message:
Cannot run checkout command : 

Stack Trace:
org.apache.maven.plugin.MojoExecutionException: Cannot run checkout command : 
	at org.apache.maven.scm.plugin.CheckoutMojoTest.testExcludeInclude(CheckoutMojoTest.java:153)
Caused by: org.apache.maven.scm.ScmException: Can't load the scm provider.
	at org.apache.maven.scm.plugin.CheckoutMojoTest.testExcludeInclude(CheckoutMojoTest.java:153)
Caused by: org.apache.maven.scm.repository.ScmRepositoryException: The scm url is invalid.
	at org.apache.maven.scm.plugin.CheckoutMojoTest.testExcludeInclude(CheckoutMojoTest.java:153)


FAILED:  org.apache.maven.scm.plugin.CheckoutMojoTest.testUseExport

Error Message:
Cannot run checkout command : 

Stack Trace:
org.apache.maven.plugin.MojoExecutionException: Cannot run checkout command : 
	at org.apache.maven.scm.plugin.CheckoutMojoTest.testUseExport(CheckoutMojoTest.java:132)
Caused by: org.apache.maven.scm.ScmException: Can't load the scm provider.
	at org.apache.maven.scm.plugin.CheckoutMojoTest.testUseExport(CheckoutMojoTest.java:132)
Caused by: org.apache.maven.scm.repository.ScmRepositoryException: The scm url is invalid.
	at org.apache.maven.scm.plugin.CheckoutMojoTest.testUseExport(CheckoutMojoTest.java:132)


FAILED:  org.apache.maven.scm.plugin.ExportMojoTest.testExcludeInclude

Error Message:
Cannot run export command : 

Stack Trace:
org.apache.maven.plugin.MojoExecutionException: Cannot run export command : 
	at org.apache.maven.scm.plugin.ExportMojoTest.testExcludeInclude(ExportMojoTest.java:90)
Caused by: org.apache.maven.scm.ScmException: Can't load the scm provider.
	at org.apache.maven.scm.plugin.ExportMojoTest.testExcludeInclude(ExportMojoTest.java:90)
Caused by: org.apache.maven.scm.repository.ScmRepositoryException: The scm url is invalid.
	at org.apache.maven.scm.plugin.ExportMojoTest.testExcludeInclude(ExportMojoTest.java:90)


FAILED:  org.apache.maven.scm.plugin.ExportMojoTest.testExport

Error Message:
Cannot run export command : 

Stack Trace:
org.apache.maven.plugin.MojoExecutionException: Cannot run export command : 
	at org.apache.maven.scm.plugin.ExportMojoTest.testExport(ExportMojoTest.java:55)
Caused by: org.apache.maven.scm.ScmException: Can't load the scm provider.
	at org.apache.maven.scm.plugin.ExportMojoTest.testExport(ExportMojoTest.java:55)
Caused by: org.apache.maven.scm.repository.ScmRepositoryException: The scm url is invalid.
	at org.apache.maven.scm.plugin.ExportMojoTest.testExport(ExportMojoTest.java:55)


FAILED:  org.apache.maven.scm.plugin.ExportMojoTest.testExcludeInclude

Error Message:
Cannot run export command : 

Stack Trace:
org.apache.maven.plugin.MojoExecutionException: Cannot run export command : 
	at org.apache.maven.scm.plugin.ExportMojoTest.testExcludeInclude(ExportMojoTest.java:90)
Caused by: org.apache.maven.scm.ScmException: Can't load the scm provider.
	at org.apache.maven.scm.plugin.ExportMojoTest.testExcludeInclude(ExportMojoTest.java:90)
Caused by: org.apache.maven.scm.repository.ScmRepositoryException: The scm url is invalid.
	at org.apache.maven.scm.plugin.ExportMojoTest.testExcludeInclude(ExportMojoTest.java:90)


FAILED:  org.apache.maven.scm.plugin.ExportMojoTest.testExport

Error Message:
Cannot run export command : 

Stack Trace:
org.apache.maven.plugin.MojoExecutionException: Cannot run export command : 
	at org.apache.maven.scm.plugin.ExportMojoTest.testExport(ExportMojoTest.java:55)
Caused by: org.apache.maven.scm.ScmException: Can't load the scm provider.
	at org.apache.maven.scm.plugin.ExportMojoTest.testExport(ExportMojoTest.java:55)
Caused by: org.apache.maven.scm.repository.ScmRepositoryException: The scm url is invalid.
	at org.apache.maven.scm.plugin.ExportMojoTest.testExport(ExportMojoTest.java:55)


FAILED:  org.apache.maven.scm.plugin.ExportMojoTest.testExcludeInclude

Error Message:
Cannot run export command : 

Stack Trace:
org.apache.maven.plugin.MojoExecutionException: Cannot run export command : 
	at org.apache.maven.scm.plugin.ExportMojoTest.testExcludeInclude(ExportMojoTest.java:90)
Caused by: org.apache.maven.scm.ScmException: Can't load the scm provider.
	at org.apache.maven.scm.plugin.ExportMojoTest.testExcludeInclude(ExportMojoTest.java:90)
Caused by: org.apache.maven.scm.repository.ScmRepositoryException: The scm url is invalid.
	at org.apache.maven.scm.plugin.ExportMojoTest.testExcludeInclude(ExportMojoTest.java:90)


FAILED:  org.apache.maven.scm.plugin.ExportMojoTest.testExport

Error Message:
Cannot run export command : 

Stack Trace:
org.apache.maven.plugin.MojoExecutionException: Cannot run export command : 
	at org.apache.maven.scm.plugin.ExportMojoTest.testExport(ExportMojoTest.java:55)
Caused by: org.apache.maven.scm.ScmException: Can't load the scm provider.
	at org.apache.maven.scm.plugin.ExportMojoTest.testExport(ExportMojoTest.java:55)
Caused by: org.apache.maven.scm.repository.ScmRepositoryException: The scm url is invalid.
	at org.apache.maven.scm.plugin.ExportMojoTest.testExport(ExportMojoTest.java:55)


FAILED:  org.apache.maven.scm.plugin.ExportMojoTest.testExcludeInclude

Error Message:
Cannot run export command : 

Stack Trace:
org.apache.maven.plugin.MojoExecutionException: Cannot run export command : 
	at org.apache.maven.scm.plugin.ExportMojoTest.testExcludeInclude(ExportMojoTest.java:90)
Caused by: org.apache.maven.scm.ScmException: Can't load the scm provider.
	at org.apache.maven.scm.plugin.ExportMojoTest.testExcludeInclude(ExportMojoTest.java:90)
Caused by: org.apache.maven.scm.repository.ScmRepositoryException: The scm url is invalid.
	at org.apache.maven.scm.plugin.ExportMojoTest.testExcludeInclude(ExportMojoTest.java:90)


FAILED:  org.apache.maven.scm.plugin.ExportMojoTest.testExport

Error Message:
Cannot run export command : 

Stack Trace:
org.apache.maven.plugin.MojoExecutionException: Cannot run export command : 
	at org.apache.maven.scm.plugin.ExportMojoTest.testExport(ExportMojoTest.java:55)
Caused by: org.apache.maven.scm.ScmException: Can't load the scm provider.
	at org.apache.maven.scm.plugin.ExportMojoTest.testExport(ExportMojoTest.java:55)
Caused by: org.apache.maven.scm.repository.ScmRepositoryException: The scm url is invalid.
	at org.apache.maven.scm.plugin.ExportMojoTest.testExport(ExportMojoTest.java:55)


FAILED:  org.apache.maven.scm.plugin.StatusMojoTest.testStatusMojo

Error Message:
Cannot run status command : 

Stack Trace:
org.apache.maven.plugin.MojoExecutionException: Cannot run status command : 
	at org.apache.maven.scm.plugin.StatusMojoTest.testStatusMojo(StatusMojoTest.java:49)
Caused by: org.apache.maven.scm.ScmException: Can't load the scm provider.
	at org.apache.maven.scm.plugin.StatusMojoTest.testStatusMojo(StatusMojoTest.java:49)
Caused by: org.apache.maven.scm.repository.ScmRepositoryException: The scm url is invalid.
	at org.apache.maven.scm.plugin.StatusMojoTest.testStatusMojo(StatusMojoTest.java:49)


FAILED:  org.apache.maven.scm.plugin.StatusMojoTest.testStatusMojo

Error Message:
Cannot run status command : 

Stack Trace:
org.apache.maven.plugin.MojoExecutionException: Cannot run status command : 
	at org.apache.maven.scm.plugin.StatusMojoTest.testStatusMojo(StatusMojoTest.java:49)
Caused by: org.apache.maven.scm.ScmException: Can't load the scm provider.
	at org.apache.maven.scm.plugin.StatusMojoTest.testStatusMojo(StatusMojoTest.java:49)
Caused by: org.apache.maven.scm.repository.ScmRepositoryException: The scm url is invalid.
	at org.apache.maven.scm.plugin.StatusMojoTest.testStatusMojo(StatusMojoTest.java:49)


FAILED:  org.apache.maven.scm.plugin.StatusMojoTest.testStatusMojo

Error Message:
Cannot run status command : 

Stack Trace:
org.apache.maven.plugin.MojoExecutionException: Cannot run status command : 
	at org.apache.maven.scm.plugin.StatusMojoTest.testStatusMojo(StatusMojoTest.java:49)
Caused by: org.apache.maven.scm.ScmException: Can't load the scm provider.
	at org.apache.maven.scm.plugin.StatusMojoTest.testStatusMojo(StatusMojoTest.java:49)
Caused by: org.apache.maven.scm.repository.ScmRepositoryException: The scm url is invalid.
	at org.apache.maven.scm.plugin.StatusMojoTest.testStatusMojo(StatusMojoTest.java:49)


FAILED:  org.apache.maven.scm.plugin.StatusMojoTest.testStatusMojo

Error Message:
Cannot run status command : 

Stack Trace:
org.apache.maven.plugin.MojoExecutionException: Cannot run status command : 
	at org.apache.maven.scm.plugin.StatusMojoTest.testStatusMojo(StatusMojoTest.java:49)
Caused by: org.apache.maven.scm.ScmException: Can't load the scm provider.
	at org.apache.maven.scm.plugin.StatusMojoTest.testStatusMojo(StatusMojoTest.java:49)
Caused by: org.apache.maven.scm.repository.ScmRepositoryException: The scm url is invalid.
	at org.apache.maven.scm.plugin.StatusMojoTest.testStatusMojo(StatusMojoTest.java:49)




Build log:
[...truncated 7.76 MB...]
[linux-jdk7] [withMaven] artifactsPublisher - Archive artifact m/maven-scm-providers/maven-scm-providers-git/maven-scm-provider-jgit/pom.xml under org/apache/maven/scm/maven-scm-provider-jgit/1.11.1-SNAPSHOT/maven-scm-provider-jgit-1.11.1-SNAPSHOT.pom
[linux-jdk7] [withMaven] artifactsPublisher - Archive artifact m/maven-scm-providers/maven-scm-providers-git/maven-scm-provider-jgit/target/maven-scm-provider-jgit-1.11.1-SNAPSHOT.jar under org/apache/maven/scm/maven-scm-provider-jgit/1.11.1-SNAPSHOT/maven-scm-provider-jgit-1.11.1-SNAPSHOT.jar
[linux-jdk7] [withMaven] artifactsPublisher - Archive artifact m/maven-scm-providers/maven-scm-provider-local/pom.xml under org/apache/maven/scm/maven-scm-provider-local/1.11.1-SNAPSHOT/maven-scm-provider-local-1.11.1-SNAPSHOT.pom
[linux-jdk7] [withMaven] artifactsPublisher - Archive artifact m/maven-scm-providers/maven-scm-provider-local/target/maven-scm-provider-local-1.11.1-SNAPSHOT.jar under org/apache/maven/scm/maven-scm-provider-local/1.11.1-SNAPSHOT/maven-scm-provider-local-1.11.1-SNAPSHOT.jar
[linux-jdk7] [withMaven] artifactsPublisher - Archive artifact m/maven-scm-providers/maven-scm-provider-perforce/pom.xml under org/apache/maven/scm/maven-scm-provider-perforce/1.11.1-SNAPSHOT/maven-scm-provider-perforce-1.11.1-SNAPSHOT.pom
[linux-jdk7] [withMaven] artifactsPublisher - Archive artifact m/maven-scm-providers/maven-scm-provider-perforce/target/maven-scm-provider-perforce-1.11.1-SNAPSHOT.jar under org/apache/maven/scm/maven-scm-provider-perforce/1.11.1-SNAPSHOT/maven-scm-provider-perforce-1.11.1-SNAPSHOT.jar
[linux-jdk7] [withMaven] artifactsPublisher - Archive artifact m/maven-scm-providers/maven-scm-provider-starteam/pom.xml under org/apache/maven/scm/maven-scm-provider-starteam/1.11.1-SNAPSHOT/maven-scm-provider-starteam-1.11.1-SNAPSHOT.pom
[linux-jdk7] [withMaven] artifactsPublisher - Archive artifact m/maven-scm-providers/maven-scm-provider-starteam/target/maven-scm-provider-starteam-1.11.1-SNAPSHOT.jar under org/apache/maven/scm/maven-scm-provider-starteam/1.11.1-SNAPSHOT/maven-scm-provider-starteam-1.11.1-SNAPSHOT.jar
[linux-jdk7] [withMaven] artifactsPublisher - Archive artifact m/maven-scm-providers/maven-scm-providers-svn/pom.xml under org/apache/maven/scm/maven-scm-providers-svn/1.11.1-SNAPSHOT/maven-scm-providers-svn-1.11.1-SNAPSHOT.pom
[linux-jdk7] [withMaven] artifactsPublisher - Archive artifact m/maven-scm-providers/maven-scm-providers-svn/target/maven-scm-providers-svn-1.11.1-SNAPSHOT-site.xml under org/apache/maven/scm/maven-scm-providers-svn/1.11.1-SNAPSHOT/maven-scm-providers-svn-1.11.1-SNAPSHOT-site.xml
[linux-jdk7] [withMaven] artifactsPublisher - Archive artifact m/maven-scm-providers/maven-scm-providers-svn/maven-scm-provider-svn-commons/pom.xml under org/apache/maven/scm/maven-scm-provider-svn-commons/1.11.1-SNAPSHOT/maven-scm-provider-svn-commons-1.11.1-SNAPSHOT.pom
[linux-jdk7] [withMaven] artifactsPublisher - Archive artifact m/maven-scm-providers/maven-scm-providers-svn/maven-scm-provider-svn-commons/target/maven-scm-provider-svn-commons-1.11.1-SNAPSHOT.jar under org/apache/maven/scm/maven-scm-provider-svn-commons/1.11.1-SNAPSHOT/maven-scm-provider-svn-commons-1.11.1-SNAPSHOT.jar
[linux-jdk7] [withMaven] artifactsPublisher - Archive artifact m/maven-scm-providers/maven-scm-providers-svn/maven-scm-provider-svntest/pom.xml under org/apache/maven/scm/maven-scm-provider-svntest/1.11.1-SNAPSHOT/maven-scm-provider-svntest-1.11.1-SNAPSHOT.pom
[linux-jdk7] [withMaven] artifactsPublisher - Archive artifact m/maven-scm-providers/maven-scm-providers-svn/maven-scm-provider-svntest/target/maven-scm-provider-svntest-1.11.1-SNAPSHOT.jar under org/apache/maven/scm/maven-scm-provider-svntest/1.11.1-SNAPSHOT/maven-scm-provider-svntest-1.11.1-SNAPSHOT.jar
[linux-jdk7] [withMaven] artifactsPublisher - Archive artifact m/maven-scm-providers/maven-scm-providers-svn/maven-scm-provider-svnexe/pom.xml under org/apache/maven/scm/maven-scm-provider-svnexe/1.11.1-SNAPSHOT/maven-scm-provider-svnexe-1.11.1-SNAPSHOT.pom
[linux-jdk7] [withMaven] artifactsPublisher - Archive artifact m/maven-scm-providers/maven-scm-providers-svn/maven-scm-provider-svnexe/target/maven-scm-provider-svnexe-1.11.1-SNAPSHOT.jar under org/apache/maven/scm/maven-scm-provider-svnexe/1.11.1-SNAPSHOT/maven-scm-provider-svnexe-1.11.1-SNAPSHOT.jar
[linux-jdk7] [withMaven] artifactsPublisher - Archive artifact m/maven-scm-providers/maven-scm-provider-synergy/pom.xml under org/apache/maven/scm/maven-scm-provider-synergy/1.11.1-SNAPSHOT/maven-scm-provider-synergy-1.11.1-SNAPSHOT.pom
[linux-jdk7] [withMaven] artifactsPublisher - Archive artifact m/maven-scm-providers/maven-scm-provider-synergy/target/maven-scm-provider-synergy-1.11.1-SNAPSHOT.jar under org/apache/maven/scm/maven-scm-provider-synergy/1.11.1-SNAPSHOT/maven-scm-provider-synergy-1.11.1-SNAPSHOT.jar
[linux-jdk7] [withMaven] artifactsPublisher - Archive artifact m/maven-scm-providers/maven-scm-provider-vss/pom.xml under org/apache/maven/scm/maven-scm-provider-vss/1.11.1-SNAPSHOT/maven-scm-provider-vss-1.11.1-SNAPSHOT.pom
[linux-jdk7] [withMaven] artifactsPublisher - Archive artifact m/maven-scm-providers/maven-scm-provider-vss/target/maven-scm-provider-vss-1.11.1-SNAPSHOT.jar under org/apache/maven/scm/maven-scm-provider-vss/1.11.1-SNAPSHOT/maven-scm-provider-vss-1.11.1-SNAPSHOT.jar
[linux-jdk7] [withMaven] artifactsPublisher - Archive artifact m/maven-scm-providers/maven-scm-provider-tfs/pom.xml under org/apache/maven/scm/maven-scm-provider-tfs/1.11.1-SNAPSHOT/maven-scm-provider-tfs-1.11.1-SNAPSHOT.pom
[linux-jdk7] [withMaven] artifactsPublisher - Archive artifact m/maven-scm-providers/maven-scm-provider-tfs/target/maven-scm-provider-tfs-1.11.1-SNAPSHOT.jar under org/apache/maven/scm/maven-scm-provider-tfs/1.11.1-SNAPSHOT/maven-scm-provider-tfs-1.11.1-SNAPSHOT.jar
[linux-jdk7] [withMaven] artifactsPublisher - Archive artifact m/maven-scm-providers/maven-scm-provider-integrity/pom.xml under org/apache/maven/scm/maven-scm-provider-integrity/1.11.1-SNAPSHOT/maven-scm-provider-integrity-1.11.1-SNAPSHOT.pom
[linux-jdk7] [withMaven] artifactsPublisher - Archive artifact m/maven-scm-providers/maven-scm-provider-integrity/target/maven-scm-provider-integrity-1.11.1-SNAPSHOT.jar under org/apache/maven/scm/maven-scm-provider-integrity/1.11.1-SNAPSHOT/maven-scm-provider-integrity-1.11.1-SNAPSHOT.jar
[linux-jdk7] [withMaven] artifactsPublisher - Archive artifact m/maven-scm-providers/maven-scm-provider-jazz/pom.xml under org/apache/maven/scm/maven-scm-provider-jazz/1.11.1-SNAPSHOT/maven-scm-provider-jazz-1.11.1-SNAPSHOT.pom
[linux-jdk7] [withMaven] artifactsPublisher - Archive artifact m/maven-scm-providers/maven-scm-provider-jazz/target/maven-scm-provider-jazz-1.11.1-SNAPSHOT.jar under org/apache/maven/scm/maven-scm-provider-jazz/1.11.1-SNAPSHOT/maven-scm-provider-jazz-1.11.1-SNAPSHOT.jar
[linux-jdk7] [withMaven] artifactsPublisher - Archive artifact m/maven-scm-providers/maven-scm-providers-standard/pom.xml under org/apache/maven/scm/maven-scm-providers-standard/1.11.1-SNAPSHOT/maven-scm-providers-standard-1.11.1-SNAPSHOT.pom
[linux-jdk7] [withMaven] artifactsPublisher - Archive artifact m/maven-scm-client/pom.xml under org/apache/maven/scm/maven-scm-client/1.11.1-SNAPSHOT/maven-scm-client-1.11.1-SNAPSHOT.pom
[linux-jdk7] [withMaven] artifactsPublisher - Archive artifact m/maven-scm-client/target/maven-scm-client-1.11.1-SNAPSHOT.jar under org/apache/maven/scm/maven-scm-client/1.11.1-SNAPSHOT/maven-scm-client-1.11.1-SNAPSHOT.jar
[linux-jdk7] [withMaven] artifactsPublisher - Archive artifact m/maven-scm-client/target/maven-scm-client-1.11.1-SNAPSHOT-jar-with-dependencies.jar under org/apache/maven/scm/maven-scm-client/1.11.1-SNAPSHOT/maven-scm-client-1.11.1-SNAPSHOT-jar-with-dependencies.jar
[linux-jdk7] [withMaven] artifactsPublisher - Archive artifact m/maven-scm-plugin/pom.xml under org/apache/maven/plugins/maven-scm-plugin/1.11.1-SNAPSHOT/maven-scm-plugin-1.11.1-SNAPSHOT.pom
[linux-jdk7] [withMaven] artifactsPublisher - Archive artifact m/maven-scm-plugin/target/maven-scm-plugin-1.11.1-SNAPSHOT.jar under org/apache/maven/plugins/maven-scm-plugin/1.11.1-SNAPSHOT/maven-scm-plugin-1.11.1-SNAPSHOT.jar
[linux-jdk7] [Fast Archiver] Compressed 4.67 MB of artifacts by 35.4% relative to #14
[linux-jdk7] [withMaven] invokerPublisher - Archive invoker results for Maven artifact MavenArtifact{org.apache.maven.plugins:maven-scm-plugin::1.11.1-SNAPSHOT(version: 1.11.1-SNAPSHOT, snapshot:false) } generated by PluginInvocation{org.apache.maven.plugins:maven-invoker-plugin:3.1.0@run  integration-test}: m/maven-scm-plugin/target/invoker-reports/*.xml
[linux-jdk7] performing MavenInvokerRecorder, reportsFilenamePattern:'**/m/maven-scm-plugin/target/invoker-reports/BUILD*.xml', invokerBuildDir:'**/m/maven-scm-plugin/target/it'
[linux-jdk7] Found reports:[]
[linux-jdk7] Found logs:[]
[linux-jdk7] Finished parsing Maven Invoker results (found 0)
[linux-jdk7] [withMaven] junitPublisher - Archive test results for Maven artifact org.apache.maven.scm:maven-scm-api:1.11.1-SNAPSHOT generated by maven-surefire-plugin:test (default-test): m/maven-scm-api/target/surefire-reports/*.xml
[linux-jdk7] Recording test results
[linux-jdk7] [withMaven] junitPublisher - Archive test results for Maven artifact org.apache.maven.scm:maven-scm-manager-plexus:1.11.1-SNAPSHOT generated by maven-surefire-plugin:test (default-test): m/maven-scm-managers/maven-scm-manager-plexus/target/surefire-reports/*.xml
[linux-jdk7] Recording test results
[linux-jdk7] None of the test reports contained any result
[linux-jdk7] [withMaven] junitPublisher - Archive test results for Maven artifact org.apache.maven.scm:maven-scm-test:1.11.1-SNAPSHOT generated by maven-surefire-plugin:test (default-test): m/maven-scm-test/target/surefire-reports/*.xml
[linux-jdk7] Recording test results
[linux-jdk7] [withMaven] junitPublisher - Archive test results for Maven artifact org.apache.maven.scm:maven-scm-provider-accurev:1.11.1-SNAPSHOT generated by maven-surefire-plugin:test (default-test): m/maven-scm-providers/maven-scm-provider-accurev/target/surefire-reports/*.xml
[linux-jdk7] Recording test results
[linux-jdk7] [withMaven] junitPublisher - Archive test results for Maven artifact org.apache.maven.scm:maven-scm-provider-bazaar:1.11.1-SNAPSHOT generated by maven-surefire-plugin:test (default-test): m/maven-scm-providers/maven-scm-provider-bazaar/target/surefire-reports/*.xml
[linux-jdk7] Recording test results
[linux-jdk7] [withMaven] junitPublisher - Archive test results for Maven artifact org.apache.maven.scm:maven-scm-provider-clearcase:1.11.1-SNAPSHOT generated by maven-surefire-plugin:test (default-test): m/maven-scm-providers/maven-scm-provider-clearcase/target/surefire-reports/*.xml
[linux-jdk7] Recording test results
[linux-jdk7] [withMaven] junitPublisher - Archive test results for Maven artifact org.apache.maven.scm:maven-scm-provider-cvstest:1.11.1-SNAPSHOT generated by maven-surefire-plugin:test (default-test): m/maven-scm-providers/maven-scm-providers-cvs/maven-scm-provider-cvstest/target/surefire-reports/*.xml
[linux-jdk7] Recording test results
[linux-jdk7] None of the test reports contained any result
[linux-jdk7] [withMaven] junitPublisher - Archive test results for Maven artifact org.apache.maven.scm:maven-scm-provider-cvs-commons:1.11.1-SNAPSHOT generated by maven-surefire-plugin:test (default-test): m/maven-scm-providers/maven-scm-providers-cvs/maven-scm-provider-cvs-commons/target/surefire-reports/*.xml
[linux-jdk7] Recording test results
[linux-jdk7] [withMaven] junitPublisher - Archive test results for Maven artifact org.apache.maven.scm:maven-scm-provider-cvsexe:1.11.1-SNAPSHOT generated by maven-surefire-plugin:test (default-test): m/maven-scm-providers/maven-scm-providers-cvs/maven-scm-provider-cvsexe/target/surefire-reports/*.xml
[linux-jdk7] Recording test results
[linux-jdk7] [withMaven] junitPublisher - Archive test results for Maven artifact org.apache.maven.scm:maven-scm-provider-cvsjava:1.11.1-SNAPSHOT generated by maven-surefire-plugin:test (default-test): m/maven-scm-providers/maven-scm-providers-cvs/maven-scm-provider-cvsjava/target/surefire-reports/*.xml
[linux-jdk7] Recording test results
[linux-jdk7] [withMaven] junitPublisher - Archive test results for Maven artifact org.apache.maven.scm:maven-scm-provider-hg:1.11.1-SNAPSHOT generated by maven-surefire-plugin:test (default-test): m/maven-scm-providers/maven-scm-provider-hg/target/surefire-reports/*.xml
[linux-jdk7] Recording test results
[linux-jdk7] [withMaven] junitPublisher - Archive test results for Maven artifact org.apache.maven.scm:maven-scm-provider-git-commons:1.11.1-SNAPSHOT generated by maven-surefire-plugin:test (default-test): m/maven-scm-providers/maven-scm-providers-git/maven-scm-provider-git-commons/target/surefire-reports/*.xml
[linux-jdk7] Recording test results
[linux-jdk7] [withMaven] junitPublisher - Archive test results for Maven artifact org.apache.maven.scm:maven-scm-provider-gittest:1.11.1-SNAPSHOT generated by maven-surefire-plugin:test (default-test): m/maven-scm-providers/maven-scm-providers-git/maven-scm-provider-gittest/target/surefire-reports/*.xml
[linux-jdk7] Recording test results
[linux-jdk7] None of the test reports contained any result
[linux-jdk7] [withMaven] junitPublisher - Archive test results for Maven artifact org.apache.maven.scm:maven-scm-provider-gitexe:1.11.1-SNAPSHOT generated by maven-surefire-plugin:test (default-test): m/maven-scm-providers/maven-scm-providers-git/maven-scm-provider-gitexe/target/surefire-reports/*.xml
[linux-jdk7] Recording test results
[linux-jdk7] [withMaven] junitPublisher - Archive test results for Maven artifact org.apache.maven.scm:maven-scm-provider-jgit:1.11.1-SNAPSHOT generated by maven-surefire-plugin:test (default-test): m/maven-scm-providers/maven-scm-providers-git/maven-scm-provider-jgit/target/surefire-reports/*.xml
[linux-jdk7] Recording test results
[linux-jdk7] [withMaven] junitPublisher - Archive test results for Maven artifact org.apache.maven.scm:maven-scm-provider-local:1.11.1-SNAPSHOT generated by maven-surefire-plugin:test (default-test): m/maven-scm-providers/maven-scm-provider-local/target/surefire-reports/*.xml
[linux-jdk7] Recording test results
[linux-jdk7] [withMaven] junitPublisher - Archive test results for Maven artifact org.apache.maven.scm:maven-scm-provider-perforce:1.11.1-SNAPSHOT generated by maven-surefire-plugin:test (default-test): m/maven-scm-providers/maven-scm-provider-perforce/target/surefire-reports/*.xml
[linux-jdk7] Recording test results
[linux-jdk7] [withMaven] junitPublisher - Archive test results for Maven artifact org.apache.maven.scm:maven-scm-provider-starteam:1.11.1-SNAPSHOT generated by maven-surefire-plugin:test (default-test): m/maven-scm-providers/maven-scm-provider-starteam/target/surefire-reports/*.xml
[linux-jdk7] Recording test results
[linux-jdk7] [withMaven] junitPublisher - Archive test results for Maven artifact org.apache.maven.scm:maven-scm-provider-svn-commons:1.11.1-SNAPSHOT generated by maven-surefire-plugin:test (default-test): m/maven-scm-providers/maven-scm-providers-svn/maven-scm-provider-svn-commons/target/surefire-reports/*.xml
[linux-jdk7] Recording test results
[linux-jdk7] [withMaven] junitPublisher - Archive test results for Maven artifact org.apache.maven.scm:maven-scm-provider-svntest:1.11.1-SNAPSHOT generated by maven-surefire-plugin:test (default-test): m/maven-scm-providers/maven-scm-providers-svn/maven-scm-provider-svntest/target/surefire-reports/*.xml
[linux-jdk7] Recording test results
[linux-jdk7] None of the test reports contained any result
[linux-jdk7] [withMaven] junitPublisher - Archive test results for Maven artifact org.apache.maven.scm:maven-scm-provider-svnexe:1.11.1-SNAPSHOT generated by maven-surefire-plugin:test (default-test): m/maven-scm-providers/maven-scm-providers-svn/maven-scm-provider-svnexe/target/surefire-reports/*.xml
[linux-jdk7] Recording test results
[linux-jdk7] [withMaven] junitPublisher - Archive test results for Maven artifact org.apache.maven.scm:maven-scm-provider-synergy:1.11.1-SNAPSHOT generated by maven-surefire-plugin:test (default-test): m/maven-scm-providers/maven-scm-provider-synergy/target/surefire-reports/*.xml
[linux-jdk7] Recording test results
[linux-jdk7] [withMaven] junitPublisher - Archive test results for Maven artifact org.apache.maven.scm:maven-scm-provider-vss:1.11.1-SNAPSHOT generated by maven-surefire-plugin:test (default-test): m/maven-scm-providers/maven-scm-provider-vss/target/surefire-reports/*.xml
[linux-jdk7] Recording test results
[linux-jdk7] [withMaven] junitPublisher - Archive test results for Maven artifact org.apache.maven.scm:maven-scm-provider-tfs:1.11.1-SNAPSHOT generated by maven-surefire-plugin:test (default-test): m/maven-scm-providers/maven-scm-provider-tfs/target/surefire-reports/*.xml
[linux-jdk7] Recording test results
[linux-jdk7] [withMaven] junitPublisher - Archive test results for Maven artifact org.apache.maven.scm:maven-scm-provider-integrity:1.11.1-SNAPSHOT generated by maven-surefire-plugin:test (default-test): m/maven-scm-providers/maven-scm-provider-integrity/target/surefire-reports/*.xml
[linux-jdk7] Recording test results
[linux-jdk7] [withMaven] junitPublisher - Archive test results for Maven artifact org.apache.maven.scm:maven-scm-provider-jazz:1.11.1-SNAPSHOT generated by maven-surefire-plugin:test (default-test): m/maven-scm-providers/maven-scm-provider-jazz/target/surefire-reports/*.xml
[linux-jdk7] Recording test results
[linux-jdk7] [withMaven] junitPublisher - Archive test results for Maven artifact org.apache.maven.scm:maven-scm-client:1.11.1-SNAPSHOT generated by maven-surefire-plugin:test (default-test): m/maven-scm-client/target/surefire-reports/*.xml
[linux-jdk7] Recording test results
[linux-jdk7] None of the test reports contained any result
[linux-jdk7] [withMaven] junitPublisher - Archive test results for Maven artifact org.apache.maven.plugins:maven-scm-plugin:1.11.1-SNAPSHOT generated by maven-surefire-plugin:test (default-test): m/maven-scm-plugin/target/surefire-reports/*.xml
[linux-jdk7] Recording test results
[linux-jdk7] [withMaven] openTasksPublisher - Scan Tasks for Maven artifact org.apache.maven.scm:maven-scm-api:1.11.1-SNAPSHOT in source directory m/maven-scm-api/src/main/java
[linux-jdk7] [withMaven] openTasksPublisher - Scan Tasks for Maven artifact org.apache.maven.scm:maven-scm-manager-plexus:1.11.1-SNAPSHOT in source directory m/maven-scm-managers/maven-scm-manager-plexus/src/main/java
[linux-jdk7] [withMaven] openTasksPublisher - Scan Tasks for Maven artifact org.apache.maven.scm:maven-scm-test:1.11.1-SNAPSHOT in source directory m/maven-scm-test/src/main/java
[linux-jdk7] [withMaven] openTasksPublisher - Scan Tasks for Maven artifact org.apache.maven.scm:maven-scm-provider-accurev:1.11.1-SNAPSHOT in source directory m/maven-scm-providers/maven-scm-provider-accurev/src/main/java
[linux-jdk7] [withMaven] openTasksPublisher - Scan Tasks for Maven artifact org.apache.maven.scm:maven-scm-provider-bazaar:1.11.1-SNAPSHOT in source directory m/maven-scm-providers/maven-scm-provider-bazaar/src/main/java
[linux-jdk7] [withMaven] openTasksPublisher - Scan Tasks for Maven artifact org.apache.maven.scm:maven-scm-provider-clearcase:1.11.1-SNAPSHOT in source directory m/maven-scm-providers/maven-scm-provider-clearcase/src/main/java
[linux-jdk7] [withMaven] openTasksPublisher - Scan Tasks for Maven artifact org.apache.maven.scm:maven-scm-provider-cvstest:1.11.1-SNAPSHOT in source directory m/maven-scm-providers/maven-scm-providers-cvs/maven-scm-provider-cvstest/src/main/java
[linux-jdk7] [withMaven] openTasksPublisher - Scan Tasks for Maven artifact org.apache.maven.scm:maven-scm-provider-cvs-commons:1.11.1-SNAPSHOT in source directory m/maven-scm-providers/maven-scm-providers-cvs/maven-scm-provider-cvs-commons/src/main/java
[linux-jdk7] [withMaven] openTasksPublisher - Scan Tasks for Maven artifact org.apache.maven.scm:maven-scm-provider-cvsexe:1.11.1-SNAPSHOT in source directory m/maven-scm-providers/maven-scm-providers-cvs/maven-scm-provider-cvsexe/src/main/java
[linux-jdk7] [withMaven] openTasksPublisher - Scan Tasks for Maven artifact org.apache.maven.scm:maven-scm-provider-cvsjava:1.11.1-SNAPSHOT in source directory m/maven-scm-providers/maven-scm-providers-cvs/maven-scm-provider-cvsjava/src/main/java
[linux-jdk7] [withMaven] openTasksPublisher - Scan Tasks for Maven artifact org.apache.maven.scm:maven-scm-provider-hg:1.11.1-SNAPSHOT in source directory m/maven-scm-providers/maven-scm-provider-hg/src/main/java
[linux-jdk7] [withMaven] openTasksPublisher - Scan Tasks for Maven artifact org.apache.maven.scm:maven-scm-provider-git-commons:1.11.1-SNAPSHOT in source directory m/maven-scm-providers/maven-scm-providers-git/maven-scm-provider-git-commons/src/main/java
[linux-jdk7] [withMaven] openTasksPublisher - Scan Tasks for Maven artifact org.apache.maven.scm:maven-scm-provider-gittest:1.11.1-SNAPSHOT in source directory m/maven-scm-providers/maven-scm-providers-git/maven-scm-provider-gittest/src/main/java
[linux-jdk7] [withMaven] openTasksPublisher - Scan Tasks for Maven artifact org.apache.maven.scm:maven-scm-provider-gitexe:1.11.1-SNAPSHOT in source directory m/maven-scm-providers/maven-scm-providers-git/maven-scm-provider-gitexe/src/main/java
[linux-jdk7] [withMaven] openTasksPublisher - Scan Tasks for Maven artifact org.apache.maven.scm:maven-scm-provider-jgit:1.11.1-SNAPSHOT in source directory m/maven-scm-providers/maven-scm-providers-git/maven-scm-provider-jgit/src/main/java
[linux-jdk7] [withMaven] openTasksPublisher - Scan Tasks for Maven artifact org.apache.maven.scm:maven-scm-provider-local:1.11.1-SNAPSHOT in source directory m/maven-scm-providers/maven-scm-provider-local/src/main/java
[linux-jdk7] [withMaven] openTasksPublisher - Scan Tasks for Maven artifact org.apache.maven.scm:maven-scm-provider-perforce:1.11.1-SNAPSHOT in source directory m/maven-scm-providers/maven-scm-provider-perforce/src/main/java
[linux-jdk7] [withMaven] openTasksPublisher - Scan Tasks for Maven artifact org.apache.maven.scm:maven-scm-provider-starteam:1.11.1-SNAPSHOT in source directory m/maven-scm-providers/maven-scm-provider-starteam/src/main/java
[linux-jdk7] [withMaven] openTasksPublisher - Scan Tasks for Maven artifact org.apache.maven.scm:maven-scm-provider-svn-commons:1.11.1-SNAPSHOT in source directory m/maven-scm-providers/maven-scm-providers-svn/maven-scm-provider-svn-commons/src/main/java
[linux-jdk7] [withMaven] openTasksPublisher - Scan Tasks for Maven artifact org.apache.maven.scm:maven-scm-provider-svntest:1.11.1-SNAPSHOT in source directory m/maven-scm-providers/maven-scm-providers-svn/maven-scm-provider-svntest/src/main/java
[linux-jdk7] [withMaven] openTasksPublisher - Scan Tasks for Maven artifact org.apache.maven.scm:maven-scm-provider-svnexe:1.11.1-SNAPSHOT in source directory m/maven-scm-providers/maven-scm-providers-svn/maven-scm-provider-svnexe/src/main/java
[linux-jdk7] [withMaven] openTasksPublisher - Scan Tasks for Maven artifact org.apache.maven.scm:maven-scm-provider-synergy:1.11.1-SNAPSHOT in source directory m/maven-scm-providers/maven-scm-provider-synergy/src/main/java
[linux-jdk7] [withMaven] openTasksPublisher - Scan Tasks for Maven artifact org.apache.maven.scm:maven-scm-provider-vss:1.11.1-SNAPSHOT in source directory m/maven-scm-providers/maven-scm-provider-vss/src/main/java
[linux-jdk7] [withMaven] openTasksPublisher - Scan Tasks for Maven artifact org.apache.maven.scm:maven-scm-provider-tfs:1.11.1-SNAPSHOT in source directory m/maven-scm-providers/maven-scm-provider-tfs/src/main/java
[linux-jdk7] [withMaven] openTasksPublisher - Scan Tasks for Maven artifact org.apache.maven.scm:maven-scm-provider-integrity:1.11.1-SNAPSHOT in source directory m/maven-scm-providers/maven-scm-provider-integrity/src/main/java
[linux-jdk7] [withMaven] openTasksPublisher - Scan Tasks for Maven artifact org.apache.maven.scm:maven-scm-provider-jazz:1.11.1-SNAPSHOT in source directory m/maven-scm-providers/maven-scm-provider-jazz/src/main/java
[linux-jdk7] [withMaven] openTasksPublisher - Scan Tasks for Maven artifact org.apache.maven.scm:maven-scm-client:1.11.1-SNAPSHOT in source directory m/maven-scm-client/src/main/java
[linux-jdk7] [withMaven] openTasksPublisher - Scan Tasks for Maven artifact org.apache.maven.plugins:maven-scm-plugin:1.11.1-SNAPSHOT in source directory m/maven-scm-plugin/src/main/java
[linux-jdk7] [TASKS] Scanning folder '/home/jenkins/jenkins-slave/workspace/maven-box_maven-scm_SCM-877-DSWCOEOFAUA5OSXBDUX57FA6ADF7KQLD4OF7IYSX37VIDIGDMIXQ' for files matching the pattern 'm/maven-scm-api/src/main/java/**/*,m/maven-scm-managers/maven-scm-manager-plexus/src/main/java/**/*,m/maven-scm-test/src/main/java/**/*,m/maven-scm-providers/maven-scm-provider-accurev/src/main/java/**/*,m/maven-scm-providers/maven-scm-provider-bazaar/src/main/java/**/*,m/maven-scm-providers/maven-scm-provider-clearcase/src/main/java/**/*,m/maven-scm-providers/maven-scm-providers-cvs/maven-scm-provider-cvstest/src/main/java/**/*,m/maven-scm-providers/maven-scm-providers-cvs/maven-scm-provider-cvs-commons/src/main/java/**/*,m/maven-scm-providers/maven-scm-providers-cvs/maven-scm-provider-cvsexe/src/main/java/**/*,m/maven-scm-providers/maven-scm-providers-cvs/maven-scm-provider-cvsjava/src/main/java/**/*,m/maven-scm-providers/maven-scm-provider-hg/src/main/java/**/*,m/maven-scm-providers/maven-scm-providers-git/maven-scm-provider-git-commons/src/main/java/**/*,m/maven-scm-providers/maven-scm-providers-git/maven-scm-provider-gittest/src/main/java/**/*,m/maven-scm-providers/maven-scm-providers-git/maven-scm-provider-gitexe/src/main/java/**/*,m/maven-scm-providers/maven-scm-providers-git/maven-scm-provider-jgit/src/main/java/**/*,m/maven-scm-providers/maven-scm-provider-local/src/main/java/**/*,m/maven-scm-providers/maven-scm-provider-perforce/src/main/java/**/*,m/maven-scm-providers/maven-scm-provider-starteam/src/main/java/**/*,m/maven-scm-providers/maven-scm-providers-svn/maven-scm-provider-svn-commons/src/main/java/**/*,m/maven-scm-providers/maven-scm-providers-svn/maven-scm-provider-svntest/src/main/java/**/*,m/maven-scm-providers/maven-scm-providers-svn/maven-scm-provider-svnexe/src/main/java/**/*,m/maven-scm-providers/maven-scm-provider-synergy/src/main/java/**/*,m/maven-scm-providers/maven-scm-provider-vss/src/main/java/**/*,m/maven-scm-providers/maven-scm-provider-tfs/src/main/java/**/*,m/maven-scm-providers/maven-scm-provider-integrity/src/main/java/**/*,m/maven-scm-providers/maven-scm-provider-jazz/src/main/java/**/*,m/maven-scm-client/src/main/java/**/*,m/maven-scm-plugin/src/main/java/**/*' - excludes: null
[linux-jdk7] [TASKS] Found 656 files to scan for tasks
[linux-jdk7] [TASKS] Found 90 open tasks.
[linux-jdk7] Skipping warnings blame since pipelines do not have an SCM link.%n
[linux-jdk7] [TASKS] Computing warning deltas based on reference build #14
[Pipeline] [windows-jdk8] }
[windows-jdk8] [withMaven] invokerPublisher - Archive invoker results for Maven artifact MavenArtifact{org.apache.maven.plugins:maven-scm-plugin::1.11.1-SNAPSHOT(version: 1.11.1-SNAPSHOT, snapshot:false) } generated by PluginInvocation{org.apache.maven.plugins:maven-invoker-plugin:3.1.0@run  integration-test}: m\maven-scm-plugin\target\invoker-reports\*.xml
[windows-jdk8] performing MavenInvokerRecorder, reportsFilenamePattern:'**/m\maven-scm-plugin\target\invoker-reports/BUILD*.xml', invokerBuildDir:'**/m\maven-scm-plugin\target\it'
[windows-jdk8] Found reports:[]
[windows-jdk8] Found logs:[]
[windows-jdk8] Finished parsing Maven Invoker results (found 0)
[windows-jdk8] [withMaven] junitPublisher - Archive test results for Maven artifact org.apache.maven.scm:maven-scm-api:1.11.1-SNAPSHOT generated by maven-surefire-plugin:test (default-test): m\maven-scm-api\target\surefire-reports\*.xml
[windows-jdk8] Recording test results
[windows-jdk8] [withMaven] junitPublisher - Archive test results for Maven artifact org.apache.maven.scm:maven-scm-manager-plexus:1.11.1-SNAPSHOT generated by maven-surefire-plugin:test (default-test): m\maven-scm-managers\maven-scm-manager-plexus\target\surefire-reports\*.xml
[windows-jdk8] Recording test results
[windows-jdk8] None of the test reports contained any result
[windows-jdk8] [withMaven] junitPublisher - Archive test results for Maven artifact org.apache.maven.scm:maven-scm-test:1.11.1-SNAPSHOT generated by maven-surefire-plugin:test (default-test): m\maven-scm-test\target\surefire-reports\*.xml
[windows-jdk8] Recording test results
[windows-jdk8] [withMaven] junitPublisher - Archive test results for Maven artifact org.apache.maven.scm:maven-scm-provider-accurev:1.11.1-SNAPSHOT generated by maven-surefire-plugin:test (default-test): m\maven-scm-providers\maven-scm-provider-accurev\target\surefire-reports\*.xml
[windows-jdk8] Recording test results
[windows-jdk8] [withMaven] junitPublisher - Archive test results for Maven artifact org.apache.maven.scm:maven-scm-provider-bazaar:1.11.1-SNAPSHOT generated by maven-surefire-plugin:test (default-test): m\maven-scm-providers\maven-scm-provider-bazaar\target\surefire-reports\*.xml
[windows-jdk8] Recording test results
[windows-jdk8] [withMaven] junitPublisher - Archive test results for Maven artifact org.apache.maven.scm:maven-scm-provider-clearcase:1.11.1-SNAPSHOT generated by maven-surefire-plugin:test (default-test): m\maven-scm-providers\maven-scm-provider-clearcase\target\surefire-reports\*.xml
[windows-jdk8] Recording test results
[windows-jdk8] [withMaven] junitPublisher - Archive test results for Maven artifact org.apache.maven.scm:maven-scm-provider-cvstest:1.11.1-SNAPSHOT generated by maven-surefire-plugin:test (default-test): m\maven-scm-providers\maven-scm-providers-cvs\maven-scm-provider-cvstest\target\surefire-reports\*.xml
[windows-jdk8] Recording test results
[windows-jdk8] None of the test reports contained any result
[windows-jdk8] [withMaven] junitPublisher - Archive test results for Maven artifact org.apache.maven.scm:maven-scm-provider-cvs-commons:1.11.1-SNAPSHOT generated by maven-surefire-plugin:test (default-test): m\maven-scm-providers\maven-scm-providers-cvs\maven-scm-provider-cvs-commons\target\surefire-reports\*.xml
[windows-jdk8] Recording test results
[windows-jdk8] [withMaven] junitPublisher - Archive test results for Maven artifact org.apache.maven.scm:maven-scm-provider-cvsexe:1.11.1-SNAPSHOT generated by maven-surefire-plugin:test (default-test): m\maven-scm-providers\maven-scm-providers-cvs\maven-scm-provider-cvsexe\target\surefire-reports\*.xml
[windows-jdk8] Recording test results
[windows-jdk8] [withMaven] junitPublisher - Archive test results for Maven artifact org.apache.maven.scm:maven-scm-provider-cvsjava:1.11.1-SNAPSHOT generated by maven-surefire-plugin:test (default-test): m\maven-scm-providers\maven-scm-providers-cvs\maven-scm-provider-cvsjava\target\surefire-reports\*.xml
[windows-jdk8] Recording test results
[windows-jdk8] [withMaven] junitPublisher - Archive test results for Maven artifact org.apache.maven.scm:maven-scm-provider-hg:1.11.1-SNAPSHOT generated by maven-surefire-plugin:test (default-test): m\maven-scm-providers\maven-scm-provider-hg\target\surefire-reports\*.xml
[windows-jdk8] Recording test results
[windows-jdk8] [withMaven] junitPublisher - Archive test results for Maven artifact org.apache.maven.scm:maven-scm-provider-git-commons:1.11.1-SNAPSHOT generated by maven-surefire-plugin:test (default-test): m\maven-scm-providers\maven-scm-providers-git\maven-scm-provider-git-commons\target\surefire-reports\*.xml
[windows-jdk8] Recording test results
[windows-jdk8] [withMaven] junitPublisher - Archive test results for Maven artifact org.apache.maven.scm:maven-scm-provider-gittest:1.11.1-SNAPSHOT generated by maven-surefire-plugin:test (default-test): m\maven-scm-providers\maven-scm-providers-git\maven-scm-provider-gittest\target\surefire-reports\*.xml
[windows-jdk8] Recording test results
[windows-jdk8] None of the test reports contained any result
[windows-jdk8] [withMaven] junitPublisher - Archive test results for Maven artifact org.apache.maven.scm:maven-scm-provider-gitexe:1.11.1-SNAPSHOT generated by maven-surefire-plugin:test (default-test): m\maven-scm-providers\maven-scm-providers-git\maven-scm-provider-gitexe\target\surefire-reports\*.xml
[windows-jdk8] Recording test results
[windows-jdk8] [withMaven] junitPublisher - Archive test results for Maven artifact org.apache.maven.scm:maven-scm-provider-jgit:1.11.1-SNAPSHOT generated by maven-surefire-plugin:test (default-test): m\maven-scm-providers\maven-scm-providers-git\maven-scm-provider-jgit\target\surefire-reports\*.xml
[windows-jdk8] Recording test results
[windows-jdk8] [withMaven] junitPublisher - Archive test results for Maven artifact org.apache.maven.scm:maven-scm-provider-local:1.11.1-SNAPSHOT generated by maven-surefire-plugin:test (default-test): m\maven-scm-providers\maven-scm-provider-local\target\surefire-reports\*.xml
[windows-jdk8] Recording test results
[windows-jdk8] [withMaven] junitPublisher - Archive test results for Maven artifact org.apache.maven.scm:maven-scm-provider-perforce:1.11.1-SNAPSHOT generated by maven-surefire-plugin:test (default-test): m\maven-scm-providers\maven-scm-provider-perforce\target\surefire-reports\*.xml
[windows-jdk8] Recording test results
[windows-jdk8] [withMaven] junitPublisher - Archive test results for Maven artifact org.apache.maven.scm:maven-scm-provider-starteam:1.11.1-SNAPSHOT generated by maven-surefire-plugin:test (default-test): m\maven-scm-providers\maven-scm-provider-starteam\target\surefire-reports\*.xml
[windows-jdk8] Recording test results
[windows-jdk8] [withMaven] junitPublisher - Archive test results for Maven artifact org.apache.maven.scm:maven-scm-provider-svn-commons:1.11.1-SNAPSHOT generated by maven-surefire-plugin:test (default-test): m\maven-scm-providers\maven-scm-providers-svn\maven-scm-provider-svn-commons\target\surefire-reports\*.xml
[windows-jdk8] Recording test results
[windows-jdk8] [withMaven] junitPublisher - Archive test results for Maven artifact org.apache.maven.scm:maven-scm-provider-svntest:1.11.1-SNAPSHOT generated by maven-surefire-plugin:test (default-test): m\maven-scm-providers\maven-scm-providers-svn\maven-scm-provider-svntest\target\surefire-reports\*.xml
[windows-jdk8] Recording test results
[windows-jdk8] None of the test reports contained any result
[windows-jdk8] [withMaven] junitPublisher - Archive test results for Maven artifact org.apache.maven.scm:maven-scm-provider-svnexe:1.11.1-SNAPSHOT generated by maven-surefire-plugin:test (default-test): m\maven-scm-providers\maven-scm-providers-svn\maven-scm-provider-svnexe\target\surefire-reports\*.xml
[windows-jdk8] Recording test results
[windows-jdk8] [withMaven] junitPublisher - Archive test results for Maven artifact org.apache.maven.scm:maven-scm-provider-synergy:1.11.1-SNAPSHOT generated by maven-surefire-plugin:test (default-test): m\maven-scm-providers\maven-scm-provider-synergy\target\surefire-reports\*.xml
[windows-jdk8] Recording test results
[windows-jdk8] [withMaven] junitPublisher - Archive test results for Maven artifact org.apache.maven.scm:maven-scm-provider-vss:1.11.1-SNAPSHOT generated by maven-surefire-plugin:test (default-test): m\maven-scm-providers\maven-scm-provider-vss\target\surefire-reports\*.xml
[windows-jdk8] Recording test results
[windows-jdk8] [withMaven] junitPublisher - Archive test results for Maven artifact org.apache.maven.scm:maven-scm-provider-tfs:1.11.1-SNAPSHOT generated by maven-surefire-plugin:test (default-test): m\maven-scm-providers\maven-scm-provider-tfs\target\surefire-reports\*.xml
[windows-jdk8] Recording test results
[windows-jdk8] [withMaven] junitPublisher - Archive test results for Maven artifact org.apache.maven.scm:maven-scm-provider-integrity:1.11.1-SNAPSHOT generated by maven-surefire-plugin:test (default-test): m\maven-scm-providers\maven-scm-provider-integrity\target\surefire-reports\*.xml
[windows-jdk8] Recording test results
[windows-jdk8] [withMaven] junitPublisher - Archive test results for Maven artifact org.apache.maven.scm:maven-scm-provider-jazz:1.11.1-SNAPSHOT generated by maven-surefire-plugin:test (default-test): m\maven-scm-providers\maven-scm-provider-jazz\target\surefire-reports\*.xml
[windows-jdk8] Recording test results
[windows-jdk8] [withMaven] junitPublisher - Archive test results for Maven artifact org.apache.maven.scm:maven-scm-client:1.11.1-SNAPSHOT generated by maven-surefire-plugin:test (default-test): m\maven-scm-client\target\surefire-reports\*.xml
[windows-jdk8] Recording test results
[windows-jdk8] None of the test reports contained any result
[windows-jdk8] [withMaven] junitPublisher - Archive test results for Maven artifact org.apache.maven.plugins:maven-scm-plugin:1.11.1-SNAPSHOT generated by maven-surefire-plugin:test (default-test): m\maven-scm-plugin\target\surefire-reports\*.xml
[windows-jdk8] Recording test results
[Pipeline] [linux-jdk8] // node
[Pipeline] [linux-jdk7] // withMaven
[Pipeline] [windows-jdk8] // withMaven
[Pipeline] [linux-jdk8] }
[Pipeline] [linux-jdk7] cleanWs
[Pipeline] [linux-jdk9] }
[Pipeline] [linux-jdk10] }
[Pipeline] [windows-jdk7] }
[Pipeline] [windows-jdk8] cleanWs
[Pipeline] [windows-jdk9] }
[Pipeline] [windows-jdk10] }
[Pipeline] [linux-jdk9] // stage
[Pipeline] [linux-jdk10] // stage
[Pipeline] [windows-jdk7] // stage
[linux-jdk7] [WS-CLEANUP] Deleting project workspace...[WS-CLEANUP] done
[Pipeline] [windows-jdk9] // stage
[Pipeline] [windows-jdk10] // stage
[windows-jdk8] [WS-CLEANUP] Deleting project workspace...[WS-CLEANUP] done
[Pipeline] [linux-jdk9] }
[Pipeline] [linux-jdk10] }
[Pipeline] [windows-jdk7] }
[Pipeline] [windows-jdk9] }
[Pipeline] [windows-jdk10] }
[Pipeline] [linux-jdk7] }
[Pipeline] [linux-jdk9] // node
[Pipeline] [linux-jdk10] // node
[Pipeline] [windows-jdk7] // node
[Pipeline] [windows-jdk9] // node
[Pipeline] [windows-jdk10] // node
[Pipeline] [linux-jdk9] }
[Pipeline] [linux-jdk10] }
[Pipeline] [windows-jdk7] }
[Pipeline] [windows-jdk9] }
[Pipeline] [windows-jdk10] }
[Pipeline] [windows-jdk8] }
[Pipeline] [linux-jdk7] // stage
[Pipeline] [linux-jdk7] }
[Pipeline] [windows-jdk8] // stage
[Pipeline] [windows-jdk8] }
[Pipeline] [linux-jdk7] // node
[Pipeline] [linux-jdk7] }
[Pipeline] [windows-jdk8] // node
[Pipeline] [windows-jdk8] }
[Pipeline] // parallel
[Pipeline] stage
[Pipeline] { (Notifications)
[Pipeline] echo
Build result: UNSTABLE
[Pipeline] jiraIssueSelector
[Pipeline] emailext
Mime
  • Unnamed multipart/mixed (inline, None, 0 bytes)
View raw message