maven-notifications mailing list archives

Site index · List index
Message view « Date » · « Thread »
Top « Date » · « Thread »
From Apache Jenkins Server <jenk...@builds.apache.org>
Subject Build failed in Jenkins: Maven TLP » maven-scm » SCM-318 #7
Date Thu, 03 Jan 2019 02:28:16 GMT
See https://builds.apache.org/job/maven-box/job/maven-scm/job/SCM-318/7/

No changes.

All tests passed

Build log:
[...truncated 27651 lines...]
[withMaven] openTasksPublisher - Scan Tasks for Maven artifact org.apache.maven.scm:maven-scm-provider-svn-commons:jar:1.11.2-SNAPSHOT
in source directory m/maven-scm-providers/maven-scm-providers-svn/maven-scm-provider-svn-commons/src/main/java
[withMaven] openTasksPublisher - Scan Tasks for Maven artifact org.apache.maven.scm:maven-scm-provider-svntest:jar:1.11.2-SNAPSHOT
in source directory m/maven-scm-providers/maven-scm-providers-svn/maven-scm-provider-svntest/src/main/java
[withMaven] openTasksPublisher - Scan Tasks for Maven artifact org.apache.maven.scm:maven-scm-provider-svnexe:jar:1.11.2-SNAPSHOT
in source directory m/maven-scm-providers/maven-scm-providers-svn/maven-scm-provider-svnexe/src/main/java
[withMaven] openTasksPublisher - Scan Tasks for Maven artifact org.apache.maven.scm:maven-scm-provider-synergy:jar:1.11.2-SNAPSHOT
in source directory m/maven-scm-providers/maven-scm-provider-synergy/src/main/java
[withMaven] openTasksPublisher - Scan Tasks for Maven artifact org.apache.maven.scm:maven-scm-provider-vss:jar:1.11.2-SNAPSHOT
in source directory m/maven-scm-providers/maven-scm-provider-vss/src/main/java
[withMaven] openTasksPublisher - Scan Tasks for Maven artifact org.apache.maven.scm:maven-scm-provider-tfs:jar:1.11.2-SNAPSHOT
in source directory m/maven-scm-providers/maven-scm-provider-tfs/src/main/java
[withMaven] openTasksPublisher - Scan Tasks for Maven artifact org.apache.maven.scm:maven-scm-provider-integrity:jar:1.11.2-SNAPSHOT
in source directory m/maven-scm-providers/maven-scm-provider-integrity/src/main/java
[withMaven] openTasksPublisher - Scan Tasks for Maven artifact org.apache.maven.scm:maven-scm-provider-jazz:jar:1.11.2-SNAPSHOT
in source directory m/maven-scm-providers/maven-scm-provider-jazz/src/main/java
[withMaven] openTasksPublisher - Scan Tasks for Maven artifact org.apache.maven.scm:maven-scm-client:jar:1.11.2-SNAPSHOT
in source directory m/maven-scm-client/src/main/java
[withMaven] openTasksPublisher - Scan Tasks for Maven artifact org.apache.maven.plugins:maven-scm-plugin:maven-plugin:1.11.2-SNAPSHOT
in source directory m/maven-scm-plugin/src/main/java
[TASKS] Scanning folder '/home/jenkins/jenkins-slave/workspace/maven-box_maven-scm_SCM-318'
for files matching the pattern 'm/maven-scm-api/src/main/java/**/*,m/maven-scm-managers/maven-scm-manager-plexus/src/main/java/**/*,m/maven-scm-test/src/main/java/**/*,m/maven-scm-providers/maven-scm-provider-accurev/src/main/java/**/*,m/maven-scm-providers/maven-scm-provider-bazaar/src/main/java/**/*,m/maven-scm-providers/maven-scm-provider-clearcase/src/main/java/**/*,m/maven-scm-providers/maven-scm-providers-cvs/maven-scm-provider-cvstest/src/main/java/**/*,m/maven-scm-providers/maven-scm-providers-cvs/maven-scm-provider-cvs-commons/src/main/java/**/*,m/maven-scm-providers/maven-scm-providers-cvs/maven-scm-provider-cvsexe/src/main/java/**/*,m/maven-scm-providers/maven-scm-providers-cvs/maven-scm-provider-cvsjava/src/main/java/**/*,m/maven-scm-providers/maven-scm-provider-hg/src/main/java/**/*,m/maven-scm-providers/maven-scm-providers-git/maven-scm-provider-git-commons/src/main/java/**/*,m/maven-scm-providers/maven-scm-providers-git/maven-scm-provider-gittest/src/main/java/**/*,m/maven-scm-providers/maven-scm-providers-git/maven-scm-provider-gitexe/src/main/java/**/*,m/maven-scm-providers/maven-scm-providers-git/maven-scm-provider-jgit/src/main/java/**/*,m/maven-scm-providers/maven-scm-provider-local/src/main/java/**/*,m/maven-scm-providers/maven-scm-provider-perforce/src/main/java/**/*,m/maven-scm-providers/maven-scm-provider-starteam/src/main/java/**/*,m/maven-scm-providers/maven-scm-providers-svn/maven-scm-provider-svn-commons/src/main/java/**/*,m/maven-scm-providers/maven-scm-providers-svn/maven-scm-provider-svntest/src/main/java/**/*,m/maven-scm-providers/maven-scm-providers-svn/maven-scm-provider-svnexe/src/main/java/**/*,m/maven-scm-providers/maven-scm-provider-synergy/src/main/java/**/*,m/maven-scm-providers/maven-scm-provider-vss/src/main/java/**/*,m/maven-scm-providers/maven-scm-provider-tfs/src/main/java/**/*,m/maven-scm-providers/maven-scm-provider-integrity/src/main/java/**/*,m/maven-scm-providers/maven-scm-provider-jazz/src/main/java/**/*,m/maven-scm-client/src/main/java/**/*,m/maven-scm-plugin/src/main/java/**/*'
- excludes: null
[TASKS] Found 664 files to scan for tasks
[TASKS] Found 90 open tasks.
Skipping warnings blame since pipelines do not have an SCM link.%n
[TASKS] Computing warning deltas based on reference build #3
[withMaven] Publishers: Pipeline Graph Publisher: 19 ms, Generated Artifacts Publisher: 37762
ms, Invoker Publisher: 3372 ms, Junit Publisher: 225503 ms, Concordion Publisher: 2 ms, Dependencies
Fingerprint Publisher: 21217 ms, Findbugs Publisher: 1 ms, JGiven Publisher: 1 ms, Jacoco
Publisher: 1 ms, SpotBugs Publisher: 1 ms, Open Task Scanner Publisher: 16202 ms
[Pipeline] // withMaven
[Pipeline] cleanWs
[WS-CLEANUP] Deleting project workspace...
[WS-CLEANUP] Deferred wipeout is used...
[WS-CLEANUP] done
[Pipeline] }
[Pipeline] // stage
[Pipeline] }
[Pipeline] // node
[Pipeline] }
Running on windows-2012-3 in f:\jenkins\jenkins-slave\workspace\maven-box_maven-scm_SCM-318
[Pipeline] {
[Pipeline] stage
[Pipeline] { (Checkout windows-jdk7)
[Pipeline] dir
Running in f:\jenkins\jenkins-slave\workspace\maven-box_maven-scm_SCM-318\m
[Pipeline] {
[Pipeline] checkout
[Pipeline] }
[Pipeline] // dir
[Pipeline] }
[Pipeline] // stage
[Pipeline] stage
[Pipeline] { (Build windows-jdk7)
[Pipeline] withMaven
[withMaven] Options: [org.jenkinsci.plugins.pipeline.maven.publishers.GeneratedArtifactsPublisher[disabled=true],
JunitTestsPublisher[disabled=false,healthScaleFactor=,keepLongStdio=false,ignoreAttachments=false],
org.jenkinsci.plugins.pipeline.maven.publishers.FindbugsAnalysisPublisher[disabled='true',
healthy='', unHealthy='', thresholdLimit='low'], org.jenkinsci.plugins.pipeline.maven.publishers.TasksScannerPublisher[disabled='true',
healthy='', unHealthy='', thresholdLimit='low'], org.jenkinsci.plugins.pipeline.maven.publishers.DependenciesFingerprintPublisher[disabled=false,
scopes=[compile, provided, runtime], versions={snapshot:true, release:false}], org.jenkinsci.plugins.pipeline.maven.publishers.InvokerRunsPublisher[disabled=false],
org.jenkinsci.plugins.pipeline.maven.publishers.PipelineGraphPublisher[disabled=false, scopes=[compile,
provided, runtime], versions={snapshot:true, release:false}, skipDownstreamTriggers=false,
lifecycleThreshold=deploy, ignoreUpstreamTriggers=false]]
[withMaven] Available options: 
[withMaven] using JDK installation JDK 1.7 (latest)
[withMaven] using Maven installation 'Maven 3.5.2 (Windows)'
[Pipeline] {
[Pipeline] dir
Running in f:\jenkins\jenkins-slave\workspace\maven-box_maven-scm_SCM-318\m
[Pipeline] {
[Pipeline] isUnix
[Pipeline] bat

f:\jenkins\jenkins-slave\workspace\maven-box_maven-scm_SCM-318\m>mvn -P+run-its -Dmaven.test.failure.ignore=true
-Dfindbugs.failOnError=false -Dfindbugs.skip=true -Dhttps.protocols=TLSv1.2 clean verify 
----- withMaven Wrapper script -----
Apache Maven 3.5.2 (138edd61fd100ec658bfa2d307c43b76940a5d7d; 2017-10-18T07:58:13Z)
Maven home: F:\jenkins\tools\maven\apache-maven-3.5.2\bin\..
Java version: 1.7.0_79, vendor: Oracle Corporation
Java home: f:\jenkins\tools\java\latest1.7\jre
Default locale: en_US, platform encoding: Cp1252
OS name: "windows server 2012 r2", version: "6.3", arch: "amd64", family: "windows"
[INFO] [jenkins-event-spy] Generate F:\jenkins\jenkins-slave\workspace\maven-box_maven-scm_SCM-318@tmp\withMavendc87f6e8\maven-spy-20190103-022804-2615745831171227696352.log.tmp
...
[INFO] Scanning for projects...
[INFO] ------------------------------------------------------------------------
[INFO] BUILD FAILURE
[INFO] ------------------------------------------------------------------------
[INFO] Total time: 0.203 s
[INFO] Finished at: 2019-01-03T02:28:04Z
[INFO] Final Memory: 8M/184M
[INFO] ------------------------------------------------------------------------
[WARNING] The requested profile "run-its" could not be activated because it does not exist.
[INFO] [jenkins-event-spy] Generated F:\jenkins\jenkins-slave\workspace\maven-box_maven-scm_SCM-318@tmp\withMavendc87f6e8\maven-spy-20190103-022804-2615745831171227696352.log
[ERROR] The goal you specified requires a project to execute but there is no POM in this directory
(f:\jenkins\jenkins-slave\workspace\maven-box_maven-scm_SCM-318\m). Please verify you invoked
Maven from the correct directory. -> [Help 1]
[ERROR] 
[ERROR] To see the full stack trace of the errors, re-run Maven with the -e switch.
[ERROR] Re-run Maven using the -X switch to enable full debug logging.
[ERROR] 
[ERROR] For more information about the errors and possible solutions, please read the following
articles:
[ERROR] [Help 1] http://cwiki.apache.org/confluence/display/MAVEN/MissingProjectException
Picked up JAVA_TOOL_OPTIONS: -Dmaven.ext.class.path="f:\jenkins\jenkins-slave\workspace\maven-box_maven-scm_SCM-318@tmp\withMavendc87f6e8\pipeline-maven-spy.jar"
-Dorg.jenkinsci.plugins.pipeline.maven.reportsFolder="f:\jenkins\jenkins-slave\workspace\maven-box_maven-scm_SCM-318@tmp\withMavendc87f6e8"

[Pipeline] }
[Pipeline] // dir
[Pipeline] }
[withMaven] Publishers: 
[Pipeline] // withMaven
[Pipeline] cleanWs
[WS-CLEANUP] Deleting project workspace...
[WS-CLEANUP] Deferred wipeout is used...
[WS-CLEANUP] done
[Pipeline] cleanWs
[WS-CLEANUP] Deleting project workspace...
[WS-CLEANUP] Deferred wipeout is used...
[WS-CLEANUP] done
[Pipeline] }
[Pipeline] // stage
[Pipeline] }
[Pipeline] // node
[Pipeline] }
Failed in branch windows-jdk7
Running on windows-2012-3 in f:\jenkins\jenkins-slave\workspace\maven-box_maven-scm_SCM-318
[Pipeline] {
[Pipeline] stage
[Pipeline] { (Checkout windows-jdk8)
[Pipeline] dir
Running in f:\jenkins\jenkins-slave\workspace\maven-box_maven-scm_SCM-318\m
[Pipeline] {
[Pipeline] checkout
[Pipeline] }
[Pipeline] // dir
[Pipeline] }
[Pipeline] // stage
[Pipeline] stage
[Pipeline] { (Build windows-jdk8)
[Pipeline] withMaven
[withMaven] Options: [org.jenkinsci.plugins.pipeline.maven.publishers.GeneratedArtifactsPublisher[disabled=true],
JunitTestsPublisher[disabled=false,healthScaleFactor=,keepLongStdio=false,ignoreAttachments=false],
org.jenkinsci.plugins.pipeline.maven.publishers.FindbugsAnalysisPublisher[disabled='true',
healthy='', unHealthy='', thresholdLimit='low'], org.jenkinsci.plugins.pipeline.maven.publishers.TasksScannerPublisher[disabled='true',
healthy='', unHealthy='', thresholdLimit='low'], org.jenkinsci.plugins.pipeline.maven.publishers.DependenciesFingerprintPublisher[disabled=false,
scopes=[compile, provided, runtime], versions={snapshot:true, release:false}], org.jenkinsci.plugins.pipeline.maven.publishers.InvokerRunsPublisher[disabled=false],
org.jenkinsci.plugins.pipeline.maven.publishers.PipelineGraphPublisher[disabled=false, scopes=[compile,
provided, runtime], versions={snapshot:true, release:false}, skipDownstreamTriggers=false,
lifecycleThreshold=deploy, ignoreUpstreamTriggers=false]]
[withMaven] Available options: 
[withMaven] using JDK installation JDK 1.8 (latest)
[withMaven] using Maven installation 'Maven 3.5.2 (Windows)'
[Pipeline] {
[Pipeline] dir
Running in f:\jenkins\jenkins-slave\workspace\maven-box_maven-scm_SCM-318\m
[Pipeline] {
[Pipeline] isUnix
[Pipeline] bat

f:\jenkins\jenkins-slave\workspace\maven-box_maven-scm_SCM-318\m>mvn -P+run-its -Dmaven.test.failure.ignore=true
-Dfindbugs.failOnError=false -Dfindbugs.skip=true clean verify 
----- withMaven Wrapper script -----
Apache Maven 3.5.2 (138edd61fd100ec658bfa2d307c43b76940a5d7d; 2017-10-18T07:58:13Z)
Maven home: F:\jenkins\tools\maven\apache-maven-3.5.2\bin\..
Java version: 1.8.0_152, vendor: Oracle Corporation
Java home: f:\jenkins\tools\java\latest1.8\jre
Default locale: en_US, platform encoding: Cp1252
OS name: "windows server 2012 r2", version: "6.3", arch: "amd64", family: "windows"
[INFO] [jenkins-event-spy] Generate F:\jenkins\jenkins-slave\workspace\maven-box_maven-scm_SCM-318@tmp\withMaven231e654d\maven-spy-20190103-022809-2586099054361151292876.log.tmp
...
[INFO] Scanning for projects...
[INFO] ------------------------------------------------------------------------
[INFO] BUILD FAILURE
[INFO] ------------------------------------------------------------------------
[INFO] Total time: 0.233 s
[INFO] Finished at: 2019-01-03T02:28:09Z
[INFO] Final Memory: 8M/184M
[INFO] ------------------------------------------------------------------------
[WARNING] The requested profile "run-its" could not be activated because it does not exist.
[INFO] [jenkins-event-spy] Generated F:\jenkins\jenkins-slave\workspace\maven-box_maven-scm_SCM-318@tmp\withMaven231e654d\maven-spy-20190103-022809-2586099054361151292876.log
[ERROR] The goal you specified requires a project to execute but there is no POM in this directory
(f:\jenkins\jenkins-slave\workspace\maven-box_maven-scm_SCM-318\m). Please verify you invoked
Maven from the correct directory. -> [Help 1]
[ERROR] 
[ERROR] To see the full stack trace of the errors, re-run Maven with the -e switch.
[ERROR] Re-run Maven using the -X switch to enable full debug logging.
[ERROR] 
[ERROR] For more information about the errors and possible solutions, please read the following
articles:
[ERROR] [Help 1] http://cwiki.apache.org/confluence/display/MAVEN/MissingProjectException
Picked up JAVA_TOOL_OPTIONS: -Dmaven.ext.class.path="f:\jenkins\jenkins-slave\workspace\maven-box_maven-scm_SCM-318@tmp\withMaven231e654d\pipeline-maven-spy.jar"
-Dorg.jenkinsci.plugins.pipeline.maven.reportsFolder="f:\jenkins\jenkins-slave\workspace\maven-box_maven-scm_SCM-318@tmp\withMaven231e654d"

[Pipeline] }
[Pipeline] // dir
[Pipeline] }
[withMaven] Publishers: 
[Pipeline] // withMaven
[Pipeline] cleanWs
[WS-CLEANUP] Deleting project workspace...
[WS-CLEANUP] Deferred wipeout is used...
[WS-CLEANUP] done
[Pipeline] cleanWs
[WS-CLEANUP] Deleting project workspace...
[WS-CLEANUP] Deferred wipeout is used...
[WS-CLEANUP] done
[Pipeline] }
[Pipeline] // stage
[Pipeline] }
[Pipeline] // node
[Pipeline] }
Failed in branch windows-jdk8
Running on windows-2012-3 in f:\jenkins\jenkins-slave\workspace\maven-box_maven-scm_SCM-318
[Pipeline] {
[Pipeline] stage
[Pipeline] { (Checkout windows-jdk11)
[Pipeline] dir
Running in f:\jenkins\jenkins-slave\workspace\maven-box_maven-scm_SCM-318\m
[Pipeline] {
[Pipeline] checkout
[Pipeline] }
[Pipeline] // dir
[Pipeline] }
[Pipeline] // stage
[Pipeline] stage
[Pipeline] { (Build windows-jdk11)
[Pipeline] withMaven
[withMaven] Options: [org.jenkinsci.plugins.pipeline.maven.publishers.GeneratedArtifactsPublisher[disabled=true],
JunitTestsPublisher[disabled=false,healthScaleFactor=,keepLongStdio=false,ignoreAttachments=false],
org.jenkinsci.plugins.pipeline.maven.publishers.FindbugsAnalysisPublisher[disabled='true',
healthy='', unHealthy='', thresholdLimit='low'], org.jenkinsci.plugins.pipeline.maven.publishers.TasksScannerPublisher[disabled='true',
healthy='', unHealthy='', thresholdLimit='low'], org.jenkinsci.plugins.pipeline.maven.publishers.DependenciesFingerprintPublisher[disabled=false,
scopes=[compile, provided, runtime], versions={snapshot:true, release:false}], org.jenkinsci.plugins.pipeline.maven.publishers.InvokerRunsPublisher[disabled=false],
org.jenkinsci.plugins.pipeline.maven.publishers.PipelineGraphPublisher[disabled=false, scopes=[compile,
provided, runtime], versions={snapshot:true, release:false}, skipDownstreamTriggers=false,
lifecycleThreshold=deploy, ignoreUpstreamTriggers=false]]
[withMaven] Available options: 
[withMaven] using JDK installation JDK 11 (latest)
[withMaven] using Maven installation 'Maven 3.5.2 (Windows)'
[Pipeline] {
[Pipeline] dir
Running in f:\jenkins\jenkins-slave\workspace\maven-box_maven-scm_SCM-318\m
[Pipeline] {
[Pipeline] isUnix
[Pipeline] bat

f:\jenkins\jenkins-slave\workspace\maven-box_maven-scm_SCM-318\m>mvn -P+run-its -Dmaven.test.failure.ignore=true
-Dfindbugs.failOnError=false -Dfindbugs.skip=true clean verify 
----- withMaven Wrapper script -----
Picked up JAVA_TOOL_OPTIONS: -Dmaven.ext.class.path="f:\jenkins\jenkins-slave\workspace\maven-box_maven-scm_SCM-318@tmp\withMavenc00398a7\pipeline-maven-spy.jar"
-Dorg.jenkinsci.plugins.pipeline.maven.reportsFolder="f:\jenkins\jenkins-slave\workspace\maven-box_maven-scm_SCM-318@tmp\withMavenc00398a7"

Apache Maven 3.5.2 (138edd61fd100ec658bfa2d307c43b76940a5d7d; 2017-10-18T07:58:13Z)
Maven home: F:\jenkins\tools\maven\apache-maven-3.5.2\bin\..
Java version: 11, vendor: Oracle Corporation
Java home: f:\jenkins\tools\java\latest11
Default locale: en_US, platform encoding: Cp1252
OS name: "windows server 2012 r2", version: "6.3", arch: "amd64", family: "windows"
[INFO] [jenkins-event-spy] Generate F:\jenkins\jenkins-slave\workspace\maven-box_maven-scm_SCM-318@tmp\withMavenc00398a7\maven-spy-20190103-022814-3318712802726659820592.log.tmp
...
[INFO] Scanning for projects...
[INFO] ------------------------------------------------------------------------
[INFO] BUILD FAILURE
[INFO] ------------------------------------------------------------------------
[INFO] Total time: 0.153 s
[INFO] Finished at: 2019-01-03T02:28:14Z
[INFO] Final Memory: 5M/24M
[INFO] ------------------------------------------------------------------------
[WARNING] The requested profile "run-its" could not be activated because it does not exist.
[INFO] [jenkins-event-spy] Generated F:\jenkins\jenkins-slave\workspace\maven-box_maven-scm_SCM-318@tmp\withMavenc00398a7\maven-spy-20190103-022814-3318712802726659820592.log
[ERROR] The goal you specified requires a project to execute but there is no POM in this directory
(f:\jenkins\jenkins-slave\workspace\maven-box_maven-scm_SCM-318\m). Please verify you invoked
Maven from the correct directory. -> [Help 1]
[ERROR] 
[ERROR] To see the full stack trace of the errors, re-run Maven with the -e switch.
[ERROR] Re-run Maven using the -X switch to enable full debug logging.
[ERROR] 
[ERROR] For more information about the errors and possible solutions, please read the following
articles:
[ERROR] [Help 1] http://cwiki.apache.org/confluence/display/MAVEN/MissingProjectException
[Pipeline] }
[Pipeline] // dir
[Pipeline] }
[withMaven] Publishers: 
[Pipeline] // withMaven
[Pipeline] cleanWs
[WS-CLEANUP] Deleting project workspace...
[WS-CLEANUP] Deferred wipeout is used...
[WS-CLEANUP] done
[Pipeline] cleanWs
[WS-CLEANUP] Deleting project workspace...
[WS-CLEANUP] Deferred wipeout is used...
[WS-CLEANUP] done
[Pipeline] }
[Pipeline] // stage
[Pipeline] }
[Pipeline] // node
[Pipeline] }
Failed in branch windows-jdk11
[Pipeline] // parallel
[Pipeline] stage
[Pipeline] { (Notifications)
[Pipeline] echo
Build result: FAILURE
[Pipeline] jiraIssueSelector
[Pipeline] emailext
Mime
  • Unnamed multipart/mixed (inline, None, 0 bytes)
View raw message