maven-notifications mailing list archives

Site index · List index
Message view « Date » · « Thread »
Top « Date » · « Thread »
From Apache Jenkins Server <jenk...@builds.apache.org>
Subject Build failed in Jenkins: Maven TLP » maven-wagon » master #63
Date Sun, 03 Feb 2019 12:48:40 GMT
See https://builds.apache.org/job/maven-box/job/maven-wagon/job/master/63/

Changes:

* [WAGON-550] Upgrade JSoup to 1.11.3
* [WAGON-551] Uprade JSch to 0.1.55
* [WAGON-549] Upgrade Commons Net to 3.6
* [WAGON-550] Upgrade JSoup to 1.11.3
* [WAGON-551] Uprade JSch to 0.1.55
* [WAGON-549] Upgrade Commons Net to 3.6
* [WAGON-550] Upgrade JSoup to 1.11.3
* [WAGON-551] Uprade JSch to 0.1.55
* [WAGON-549] Upgrade Commons Net to 3.6
* [WAGON-550] Upgrade JSoup to 1.11.3
* [WAGON-551] Uprade JSch to 0.1.55
* [WAGON-549] Upgrade Commons Net to 3.6
* [WAGON-550] Upgrade JSoup to 1.11.3
* [WAGON-551] Uprade JSch to 0.1.55
* [WAGON-549] Upgrade Commons Net to 3.6
* [WAGON-550] Upgrade JSoup to 1.11.3
* [WAGON-551] Uprade JSch to 0.1.55
* [WAGON-549] Upgrade Commons Net to 3.6

15 tests failed.
FAILED:  org.apache.maven.wagon.providers.scm.ScmGitExeWagonTest.linux-jdk11 / Build linux-jdk11
/ testWagonPutDirectory

Error Message:
Error interacting with SCM: Unable to commit file. The git-commit command failed. 
*** Please tell me who you are.

Run

  git config --global user.email "you@example.com"
  git config --global user.name "Your Name"

to set your account's default identity.
Omit --global to set the identity only in this repository.

fatal:********@asf929.gq1.ygridcore.net>) not allowed


Stack Trace:
org.apache.maven.wagon.TransferFailedException: 
Error interacting with SCM: Unable to commit file. The git-commit command failed. 
*** Please tell me who you are.

Run

  git config --global user.email "you@example.com"
  git config --global user.name "Your Name"

to set your account's default identity.
Omit --global to set the identity only in this repository.

fatal:********@asf929.gq1.ygridcore.net>) not allowed

Caused by: org.apache.maven.scm.ScmException: 
Unable to commit file. The git-commit command failed. 
*** Please tell me who you are.

Run

  git config --global user.email "you@example.com"
  git config --global user.name "Your Name"

to set your account's default identity.
Omit --global to set the identity only in this repository.

fatal:********@asf929.gq1.ygridcore.net>) not allowed



FAILED:  org.apache.maven.wagon.providers.scm.ScmGitExeWagonTest.linux-jdk11 / Build linux-jdk11
/ testWagonPutDirectoryDeepDestination

Error Message:
Error interacting with SCM: Unable to commit file. The git-commit command failed. 
*** Please tell me who you are.

Run

  git config --global user.email "you@example.com"
  git config --global user.name "Your Name"

to set your account's default identity.
Omit --global to set the identity only in this repository.

fatal:********@asf929.gq1.ygridcore.net>) not allowed


Stack Trace:
org.apache.maven.wagon.TransferFailedException: 
Error interacting with SCM: Unable to commit file. The git-commit command failed. 
*** Please tell me who you are.

Run

  git config --global user.email "you@example.com"
  git config --global user.name "Your Name"

to set your account's default identity.
Omit --global to set the identity only in this repository.

fatal:********@asf929.gq1.ygridcore.net>) not allowed

Caused by: org.apache.maven.scm.ScmException: 
Unable to commit file. The git-commit command failed. 
*** Please tell me who you are.

Run

  git config --global user.email "you@example.com"
  git config --global user.name "Your Name"

to set your account's default identity.
Omit --global to set the identity only in this repository.

fatal:********@asf929.gq1.ygridcore.net>) not allowed



FAILED:  org.apache.maven.wagon.providers.scm.ScmGitExeWagonTest.linux-jdk11 / Build linux-jdk11
/ testWagon

Error Message:

  Unexpected method call TransferListener.transferError(TransferEvent[PUT|ERROR|Repository[scm:git:file:///home/jenkins/jenkins-slave/workspace/maven-box_maven-wagon_master/m/wagon-providers/wagon-scm/target/test-classes/test-repo-git-test/]|null|test-resource[len
= 18; mod = 1549197914095]]):
    TransferListener.transferCompleted(TransferEvent[PUT|COMPLETED|Repository[scm:git:file:///home/jenkins/jenkins-slave/workspace/maven-box_maven-wagon_master/m/wagon-providers/wagon-scm/target/test-classes/test-repo-git-test/]|/home/jenkins/jenkins-slave/workspace/maven-box_maven-wagon_master/m/wagon-providers/wagon-scm/target/test-output/test-resource|test-resource[len
= 18; mod = 1549197914095]]): expected: 1, actual: 0

Stack Trace:
java.lang.AssertionError: 

  Unexpected method call TransferListener.transferError(TransferEvent[PUT|ERROR|Repository[scm:git:file:///home/jenkins/jenkins-slave/workspace/maven-box_maven-wagon_master/m/wagon-providers/wagon-scm/target/test-classes/test-repo-git-test/]|null|test-resource[len
= 18; mod = 1549197914095]]):
    TransferListener.transferCompleted(TransferEvent[PUT|COMPLETED|Repository[scm:git:file:///home/jenkins/jenkins-slave/workspace/maven-box_maven-wagon_master/m/wagon-providers/wagon-scm/target/test-classes/test-repo-git-test/]|/home/jenkins/jenkins-slave/workspace/maven-box_maven-wagon_master/m/wagon-providers/wagon-scm/target/test-output/test-resource|test-resource[len
= 18; mod = 1549197914095]]): expected: 1, actual: 0


FAILED:  org.apache.maven.wagon.providers.scm.ScmGitExeWagonTest.linux-jdk11 / Build linux-jdk11
/ testWagonPutDirectoryForDot

Error Message:
Error interacting with SCM: Unable to commit file. The git-commit command failed. 
*** Please tell me who you are.

Run

  git config --global user.email "you@example.com"
  git config --global user.name "Your Name"

to set your account's default identity.
Omit --global to set the identity only in this repository.

fatal:********@asf929.gq1.ygridcore.net>) not allowed


Stack Trace:
org.apache.maven.wagon.TransferFailedException: 
Error interacting with SCM: Unable to commit file. The git-commit command failed. 
*** Please tell me who you are.

Run

  git config --global user.email "you@example.com"
  git config --global user.name "Your Name"

to set your account's default identity.
Omit --global to set the identity only in this repository.

fatal:********@asf929.gq1.ygridcore.net>) not allowed

Caused by: org.apache.maven.scm.ScmException: 
Unable to commit file. The git-commit command failed. 
*** Please tell me who you are.

Run

  git config --global user.email "you@example.com"
  git config --global user.name "Your Name"

to set your account's default identity.
Omit --global to set the identity only in this repository.

fatal:********@asf929.gq1.ygridcore.net>) not allowed



FAILED:  org.apache.maven.wagon.providers.scm.ScmGitExeWagonTest.linux-jdk11 / Build linux-jdk11
/ testWagonPutDirectoryWhenDirectoryAlreadyExists

Error Message:
Error interacting with SCM: Unable to commit file. The git-commit command failed. 
*** Please tell me who you are.

Run

  git config --global user.email "you@example.com"
  git config --global user.name "Your Name"

to set your account's default identity.
Omit --global to set the identity only in this repository.

fatal:********@asf929.gq1.ygridcore.net>) not allowed


Stack Trace:
org.apache.maven.wagon.TransferFailedException: 
Error interacting with SCM: Unable to commit file. The git-commit command failed. 
*** Please tell me who you are.

Run

  git config --global user.email "you@example.com"
  git config --global user.name "Your Name"

to set your account's default identity.
Omit --global to set the identity only in this repository.

fatal:********@asf929.gq1.ygridcore.net>) not allowed

Caused by: org.apache.maven.scm.ScmException: 
Unable to commit file. The git-commit command failed. 
*** Please tell me who you are.

Run

  git config --global user.email "you@example.com"
  git config --global user.name "Your Name"

to set your account's default identity.
Omit --global to set the identity only in this repository.

fatal:********@asf929.gq1.ygridcore.net>) not allowed



FAILED:  org.apache.maven.wagon.providers.scm.ScmGitExeWagonTest.linux-jdk7 / Build linux-jdk7
/ testWagonPutDirectory

Error Message:
Error interacting with SCM: Unable to commit file. The git-commit command failed. 
*** Please tell me who you are.

Run

  git config --global user.email "you@example.com"
  git config --global user.name "Your Name"

to set your account's default identity.
Omit --global to set the identity only in this repository.

fatal:********@asf934.gq1.ygridcore.net>) not allowed


Stack Trace:
org.apache.maven.wagon.TransferFailedException: 
Error interacting with SCM: Unable to commit file. The git-commit command failed. 
*** Please tell me who you are.

Run

  git config --global user.email "you@example.com"
  git config --global user.name "Your Name"

to set your account's default identity.
Omit --global to set the identity only in this repository.

fatal:********@asf934.gq1.ygridcore.net>) not allowed

Caused by: org.apache.maven.scm.ScmException: 
Unable to commit file. The git-commit command failed. 
*** Please tell me who you are.

Run

  git config --global user.email "you@example.com"
  git config --global user.name "Your Name"

to set your account's default identity.
Omit --global to set the identity only in this repository.

fatal:********@asf934.gq1.ygridcore.net>) not allowed



FAILED:  org.apache.maven.wagon.providers.scm.ScmGitExeWagonTest.linux-jdk7 / Build linux-jdk7
/ testWagonPutDirectoryDeepDestination

Error Message:
Error interacting with SCM: Unable to commit file. The git-commit command failed. 
*** Please tell me who you are.

Run

  git config --global user.email "you@example.com"
  git config --global user.name "Your Name"

to set your account's default identity.
Omit --global to set the identity only in this repository.

fatal:********@asf934.gq1.ygridcore.net>) not allowed


Stack Trace:
org.apache.maven.wagon.TransferFailedException: 
Error interacting with SCM: Unable to commit file. The git-commit command failed. 
*** Please tell me who you are.

Run

  git config --global user.email "you@example.com"
  git config --global user.name "Your Name"

to set your account's default identity.
Omit --global to set the identity only in this repository.

fatal:********@asf934.gq1.ygridcore.net>) not allowed

Caused by: org.apache.maven.scm.ScmException: 
Unable to commit file. The git-commit command failed. 
*** Please tell me who you are.

Run

  git config --global user.email "you@example.com"
  git config --global user.name "Your Name"

to set your account's default identity.
Omit --global to set the identity only in this repository.

fatal:********@asf934.gq1.ygridcore.net>) not allowed



FAILED:  org.apache.maven.wagon.providers.scm.ScmGitExeWagonTest.linux-jdk7 / Build linux-jdk7
/ testWagon

Error Message:

  Unexpected method call TransferListener.transferError(TransferEvent[PUT|ERROR|Repository[scm:git:file:///home/jenkins/jenkins-slave/workspace/maven-box_maven-wagon_master/m/wagon-providers/wagon-scm/target/test-classes/test-repo-git-test/]|null|test-resource[len
= 18; mod = 1549197904000]]):
    TransferListener.transferCompleted(TransferEvent[PUT|COMPLETED|Repository[scm:git:file:///home/jenkins/jenkins-slave/workspace/maven-box_maven-wagon_master/m/wagon-providers/wagon-scm/target/test-classes/test-repo-git-test/]|/home/jenkins/jenkins-slave/workspace/maven-box_maven-wagon_master/m/wagon-providers/wagon-scm/target/test-output/test-resource|test-resource[len
= 18; mod = 1549197904000]]): expected: 1, actual: 0

Stack Trace:
java.lang.AssertionError: 

  Unexpected method call TransferListener.transferError(TransferEvent[PUT|ERROR|Repository[scm:git:file:///home/jenkins/jenkins-slave/workspace/maven-box_maven-wagon_master/m/wagon-providers/wagon-scm/target/test-classes/test-repo-git-test/]|null|test-resource[len
= 18; mod = 1549197904000]]):
    TransferListener.transferCompleted(TransferEvent[PUT|COMPLETED|Repository[scm:git:file:///home/jenkins/jenkins-slave/workspace/maven-box_maven-wagon_master/m/wagon-providers/wagon-scm/target/test-classes/test-repo-git-test/]|/home/jenkins/jenkins-slave/workspace/maven-box_maven-wagon_master/m/wagon-providers/wagon-scm/target/test-output/test-resource|test-resource[len
= 18; mod = 1549197904000]]): expected: 1, actual: 0


FAILED:  org.apache.maven.wagon.providers.scm.ScmGitExeWagonTest.linux-jdk7 / Build linux-jdk7
/ testWagonPutDirectoryForDot

Error Message:
Error interacting with SCM: Unable to commit file. The git-commit command failed. 
*** Please tell me who you are.

Run

  git config --global user.email "you@example.com"
  git config --global user.name "Your Name"

to set your account's default identity.
Omit --global to set the identity only in this repository.

fatal:********@asf934.gq1.ygridcore.net>) not allowed


Stack Trace:
org.apache.maven.wagon.TransferFailedException: 
Error interacting with SCM: Unable to commit file. The git-commit command failed. 
*** Please tell me who you are.

Run

  git config --global user.email "you@example.com"
  git config --global user.name "Your Name"

to set your account's default identity.
Omit --global to set the identity only in this repository.

fatal:********@asf934.gq1.ygridcore.net>) not allowed

Caused by: org.apache.maven.scm.ScmException: 
Unable to commit file. The git-commit command failed. 
*** Please tell me who you are.

Run

  git config --global user.email "you@example.com"
  git config --global user.name "Your Name"

to set your account's default identity.
Omit --global to set the identity only in this repository.

fatal:********@asf934.gq1.ygridcore.net>) not allowed



FAILED:  org.apache.maven.wagon.providers.scm.ScmGitExeWagonTest.linux-jdk7 / Build linux-jdk7
/ testWagonPutDirectoryWhenDirectoryAlreadyExists

Error Message:
Error interacting with SCM: Unable to commit file. The git-commit command failed. 
*** Please tell me who you are.

Run

  git config --global user.email "you@example.com"
  git config --global user.name "Your Name"

to set your account's default identity.
Omit --global to set the identity only in this repository.

fatal:********@asf934.gq1.ygridcore.net>) not allowed


Stack Trace:
org.apache.maven.wagon.TransferFailedException: 
Error interacting with SCM: Unable to commit file. The git-commit command failed. 
*** Please tell me who you are.

Run

  git config --global user.email "you@example.com"
  git config --global user.name "Your Name"

to set your account's default identity.
Omit --global to set the identity only in this repository.

fatal:********@asf934.gq1.ygridcore.net>) not allowed

Caused by: org.apache.maven.scm.ScmException: 
Unable to commit file. The git-commit command failed. 
*** Please tell me who you are.

Run

  git config --global user.email "you@example.com"
  git config --global user.name "Your Name"

to set your account's default identity.
Omit --global to set the identity only in this repository.

fatal:********@asf934.gq1.ygridcore.net>) not allowed



FAILED:  org.apache.maven.wagon.providers.scm.ScmGitExeWagonTest.linux-jdk8 / Build linux-jdk8
/ testWagonPutDirectory

Error Message:
Error interacting with SCM: Unable to commit file. The git-commit command failed. 
*** Please tell me who you are.

Run

  git config --global user.email "you@example.com"
  git config --global user.name "Your Name"

to set your account's default identity.
Omit --global to set the identity only in this repository.

fatal:********@asf930.gq1.ygridcore.net>) not allowed


Stack Trace:
org.apache.maven.wagon.TransferFailedException: 
Error interacting with SCM: Unable to commit file. The git-commit command failed. 
*** Please tell me who you are.

Run

  git config --global user.email "you@example.com"
  git config --global user.name "Your Name"

to set your account's default identity.
Omit --global to set the identity only in this repository.

fatal:********@asf930.gq1.ygridcore.net>) not allowed

Caused by: org.apache.maven.scm.ScmException: 
Unable to commit file. The git-commit command failed. 
*** Please tell me who you are.

Run

  git config --global user.email "you@example.com"
  git config --global user.name "Your Name"

to set your account's default identity.
Omit --global to set the identity only in this repository.

fatal:********@asf930.gq1.ygridcore.net>) not allowed



FAILED:  org.apache.maven.wagon.providers.scm.ScmGitExeWagonTest.linux-jdk8 / Build linux-jdk8
/ testWagonPutDirectoryDeepDestination

Error Message:
Error interacting with SCM: Unable to commit file. The git-commit command failed. 
*** Please tell me who you are.

Run

  git config --global user.email "you@example.com"
  git config --global user.name "Your Name"

to set your account's default identity.
Omit --global to set the identity only in this repository.

fatal:********@asf930.gq1.ygridcore.net>) not allowed


Stack Trace:
org.apache.maven.wagon.TransferFailedException: 
Error interacting with SCM: Unable to commit file. The git-commit command failed. 
*** Please tell me who you are.

Run

  git config --global user.email "you@example.com"
  git config --global user.name "Your Name"

to set your account's default identity.
Omit --global to set the identity only in this repository.

fatal:********@asf930.gq1.ygridcore.net>) not allowed

Caused by: org.apache.maven.scm.ScmException: 
Unable to commit file. The git-commit command failed. 
*** Please tell me who you are.

Run

  git config --global user.email "you@example.com"
  git config --global user.name "Your Name"

to set your account's default identity.
Omit --global to set the identity only in this repository.

fatal:********@asf930.gq1.ygridcore.net>) not allowed



FAILED:  org.apache.maven.wagon.providers.scm.ScmGitExeWagonTest.linux-jdk8 / Build linux-jdk8
/ testWagon

Error Message:

  Unexpected method call TransferListener.transferError(TransferEvent[PUT|ERROR|Repository[scm:git:file:///home/jenkins/jenkins-slave/workspace/maven-box_maven-wagon_master/m/wagon-providers/wagon-scm/target/test-classes/test-repo-git-test/]|null|test-resource[len
= 18; mod = 1549197923000]]):
    TransferListener.transferCompleted(TransferEvent[PUT|COMPLETED|Repository[scm:git:file:///home/jenkins/jenkins-slave/workspace/maven-box_maven-wagon_master/m/wagon-providers/wagon-scm/target/test-classes/test-repo-git-test/]|/home/jenkins/jenkins-slave/workspace/maven-box_maven-wagon_master/m/wagon-providers/wagon-scm/target/test-output/test-resource|test-resource[len
= 18; mod = 1549197923000]]): expected: 1, actual: 0

Stack Trace:
java.lang.AssertionError: 

  Unexpected method call TransferListener.transferError(TransferEvent[PUT|ERROR|Repository[scm:git:file:///home/jenkins/jenkins-slave/workspace/maven-box_maven-wagon_master/m/wagon-providers/wagon-scm/target/test-classes/test-repo-git-test/]|null|test-resource[len
= 18; mod = 1549197923000]]):
    TransferListener.transferCompleted(TransferEvent[PUT|COMPLETED|Repository[scm:git:file:///home/jenkins/jenkins-slave/workspace/maven-box_maven-wagon_master/m/wagon-providers/wagon-scm/target/test-classes/test-repo-git-test/]|/home/jenkins/jenkins-slave/workspace/maven-box_maven-wagon_master/m/wagon-providers/wagon-scm/target/test-output/test-resource|test-resource[len
= 18; mod = 1549197923000]]): expected: 1, actual: 0


FAILED:  org.apache.maven.wagon.providers.scm.ScmGitExeWagonTest.linux-jdk8 / Build linux-jdk8
/ testWagonPutDirectoryForDot

Error Message:
Error interacting with SCM: Unable to commit file. The git-commit command failed. 
*** Please tell me who you are.

Run

  git config --global user.email "you@example.com"
  git config --global user.name "Your Name"

to set your account's default identity.
Omit --global to set the identity only in this repository.

fatal:********@asf930.gq1.ygridcore.net>) not allowed


Stack Trace:
org.apache.maven.wagon.TransferFailedException: 
Error interacting with SCM: Unable to commit file. The git-commit command failed. 
*** Please tell me who you are.

Run

  git config --global user.email "you@example.com"
  git config --global user.name "Your Name"

to set your account's default identity.
Omit --global to set the identity only in this repository.

fatal:********@asf930.gq1.ygridcore.net>) not allowed

Caused by: org.apache.maven.scm.ScmException: 
Unable to commit file. The git-commit command failed. 
*** Please tell me who you are.

Run

  git config --global user.email "you@example.com"
  git config --global user.name "Your Name"

to set your account's default identity.
Omit --global to set the identity only in this repository.

fatal:********@asf930.gq1.ygridcore.net>) not allowed



FAILED:  org.apache.maven.wagon.providers.scm.ScmGitExeWagonTest.linux-jdk8 / Build linux-jdk8
/ testWagonPutDirectoryWhenDirectoryAlreadyExists

Error Message:
Error interacting with SCM: Unable to commit file. The git-commit command failed. 
*** Please tell me who you are.

Run

  git config --global user.email "you@example.com"
  git config --global user.name "Your Name"

to set your account's default identity.
Omit --global to set the identity only in this repository.

fatal:********@asf930.gq1.ygridcore.net>) not allowed


Stack Trace:
org.apache.maven.wagon.TransferFailedException: 
Error interacting with SCM: Unable to commit file. The git-commit command failed. 
*** Please tell me who you are.

Run

  git config --global user.email "you@example.com"
  git config --global user.name "Your Name"

to set your account's default identity.
Omit --global to set the identity only in this repository.

fatal:********@asf930.gq1.ygridcore.net>) not allowed

Caused by: org.apache.maven.scm.ScmException: 
Unable to commit file. The git-commit command failed. 
*** Please tell me who you are.

Run

  git config --global user.email "you@example.com"
  git config --global user.name "Your Name"

to set your account's default identity.
Omit --global to set the identity only in this repository.

fatal:********@asf930.gq1.ygridcore.net>) not allowed





Build log:
[...truncated 17944 lines...]
[INFO] 
[INFO] --- maven-compiler-plugin:3.7.0:testCompile (default-testCompile) @ wagon-webdav-jackrabbit
---
[INFO] Changes detected - recompiling the module!
[INFO] Compiling 4 source files to F:\jenkins\jenkins-slave\workspace\maven-box_maven-wagon_master\m\wagon-providers\wagon-webdav-jackrabbit\target\test-classes
[INFO] /F:/jenkins/jenkins-slave/workspace/maven-box_maven-wagon_master/m/wagon-providers/wagon-webdav-jackrabbit/src/test/java/org/apache/maven/wagon/providers/webdav/HttpClientWagonTest.java:
F:\jenkins\jenkins-slave\workspace\maven-box_maven-wagon_master\m\wagon-providers\wagon-webdav-jackrabbit\src\test\java\org\apache\maven\wagon\providers\webdav\HttpClientWagonTest.java
uses or overrides a deprecated API.
[INFO] /F:/jenkins/jenkins-slave/workspace/maven-box_maven-wagon_master/m/wagon-providers/wagon-webdav-jackrabbit/src/test/java/org/apache/maven/wagon/providers/webdav/HttpClientWagonTest.java:
Recompile with -Xlint:deprecation for details.
[INFO] 
[INFO] --- maven-surefire-plugin:2.20:test (default-test) @ wagon-webdav-jackrabbit ---
[INFO] 
[INFO] -------------------------------------------------------
[INFO]  T E S T S
[INFO] -------------------------------------------------------
[INFO] Running org.apache.maven.wagon.providers.webdav.HttpClientWagonTest
[INFO] Tests run: 6, Failures: 0, Errors: 0, Skipped: 0, Time elapsed: 1.136 s - in org.apache.maven.wagon.providers.webdav.HttpClientWagonTest
[INFO] Running org.apache.maven.wagon.providers.webdav.PathNavigatorTest
[INFO] Tests run: 1, Failures: 0, Errors: 0, Skipped: 0, Time elapsed: 0 s - in org.apache.maven.wagon.providers.webdav.PathNavigatorTest
[INFO] Running org.apache.maven.wagon.providers.webdav.WebDavsWagonTest
[withMaven] junitPublisher - Archive test results for Maven artifact org.apache.maven.wagon:wagon-scm:jar:3.3.2-SNAPSHOT
generated by maven-surefire-plugin:test (default-test): m/wagon-providers/wagon-scm/target/surefire-reports/*.xml
Recording test results
[withMaven] junitPublisher - Archive test results for Maven artifact org.apache.maven.wagon:wagon-scm:jar:3.3.2-SNAPSHOT
generated by maven-surefire-plugin:test (default-test): m/wagon-providers/wagon-scm/target/surefire-reports/*.xml
Recording test results
[withMaven] junitPublisher - Archive test results for Maven artifact org.apache.maven.wagon:wagon-tck-http:jar:3.3.2-SNAPSHOT
generated by maven-surefire-plugin:test (default-test): m/wagon-tcks/wagon-tck-http/target/surefire-reports/*.xml
Recording test results
[withMaven] junitPublisher - Archive test results for Maven artifact org.apache.maven.wagon:wagon-ssh-common:jar:3.3.2-SNAPSHOT
generated by maven-surefire-plugin:test (default-test): m/wagon-providers/wagon-ssh-common/target/surefire-reports/*.xml
Recording test results
[withMaven] junitPublisher - Archive test results for Maven artifact org.apache.maven.wagon:wagon-ssh-common:jar:3.3.2-SNAPSHOT
generated by maven-surefire-plugin:test (default-test): m/wagon-providers/wagon-ssh-common/target/surefire-reports/*.xml
Recording test results
[withMaven] junitPublisher - Archive test results for Maven artifact org.apache.maven.wagon:wagon-scm:jar:3.3.2-SNAPSHOT
generated by maven-surefire-plugin:test (default-test): m\wagon-providers\wagon-scm\target\surefire-reports\*.xml
Recording test results
[withMaven] junitPublisher - Archive test results for Maven artifact org.apache.maven.wagon:wagon-ssh-common-test:jar:3.3.2-SNAPSHOT
generated by maven-surefire-plugin:test (default-test): m/wagon-providers/wagon-ssh-common-test/target/surefire-reports/*.xml
Recording test results
[withMaven] junitPublisher - Archive test results for Maven artifact org.apache.maven.wagon:wagon-ssh-common-test:jar:3.3.2-SNAPSHOT
generated by maven-surefire-plugin:test (default-test): m/wagon-providers/wagon-ssh-common-test/target/surefire-reports/*.xml
Recording test results
None of the test reports contained any result
[withMaven] junitPublisher - Archive test results for Maven artifact org.apache.maven.wagon:wagon-http:jar:3.3.2-SNAPSHOT
generated by maven-surefire-plugin:test (default-test): m/wagon-providers/wagon-http/target/surefire-reports/*.xml
Recording test results
None of the test reports contained any result
[withMaven] junitPublisher - Archive test results for Maven artifact org.apache.maven.wagon:wagon-ssh-external:jar:3.3.2-SNAPSHOT
generated by maven-surefire-plugin:test (default-test): m/wagon-providers/wagon-ssh-external/target/surefire-reports/*.xml
Recording test results
[withMaven] junitPublisher - Archive test results for Maven artifact org.apache.maven.wagon:wagon-ssh-common:jar:3.3.2-SNAPSHOT
generated by maven-surefire-plugin:test (default-test): m\wagon-providers\wagon-ssh-common\target\surefire-reports\*.xml
Recording test results
None of the test reports contained any result
[withMaven] junitPublisher - Archive test results for Maven artifact org.apache.maven.wagon:wagon-ssh:jar:3.3.2-SNAPSHOT
generated by maven-surefire-plugin:test (default-test): m/wagon-providers/wagon-ssh/target/surefire-reports/*.xml
Recording test results
None of the test reports contained any result
[withMaven] junitPublisher - Archive test results for Maven artifact org.apache.maven.wagon:wagon-ssh-external:jar:3.3.2-SNAPSHOT
generated by maven-surefire-plugin:test (default-test): m/wagon-providers/wagon-ssh-external/target/surefire-reports/*.xml
Recording test results
[withMaven] junitPublisher - Archive test results for Maven artifact org.apache.maven.wagon:wagon-http-lightweight:jar:3.3.2-SNAPSHOT
generated by maven-surefire-plugin:test (default-test): m/wagon-providers/wagon-http-lightweight/target/surefire-reports/*.xml
Recording test results
[withMaven] junitPublisher - Archive test results for Maven artifact org.apache.maven.wagon:wagon-ssh-common-test:jar:3.3.2-SNAPSHOT
generated by maven-surefire-plugin:test (default-test): m\wagon-providers\wagon-ssh-common-test\target\surefire-reports\*.xml
Recording test results
[withMaven] junitPublisher - Archive test results for Maven artifact org.apache.maven.wagon:wagon-scm:jar:3.3.2-SNAPSHOT
generated by maven-surefire-plugin:test (default-test): m/wagon-providers/wagon-scm/target/surefire-reports/*.xml
Recording test results
None of the test reports contained any result
[withMaven] junitPublisher - Archive test results for Maven artifact org.apache.maven.wagon:wagon-ssh:jar:3.3.2-SNAPSHOT
generated by maven-surefire-plugin:test (default-test): m/wagon-providers/wagon-ssh/target/surefire-reports/*.xml
Recording test results
None of the test reports contained any result
[withMaven] junitPublisher - Archive test results for Maven artifact org.apache.maven.wagon:wagon-webdav-jackrabbit:jar:3.3.2-SNAPSHOT
generated by maven-surefire-plugin:test (default-test): m/wagon-providers/wagon-webdav-jackrabbit/target/surefire-reports/*.xml
Recording test results
None of the test reports contained any result
[withMaven] junitPublisher - Archive test results for Maven artifact org.apache.maven.wagon:wagon-ssh-external:jar:3.3.2-SNAPSHOT
generated by maven-surefire-plugin:test (default-test): m\wagon-providers\wagon-ssh-external\target\surefire-reports\*.xml
Recording test results
None of the test reports contained any result
[withMaven] junitPublisher - Archive test results for Maven artifact org.apache.maven.wagon:wagon-webdav-jackrabbit:jar:3.3.2-SNAPSHOT
generated by maven-surefire-plugin:test (default-test): m/wagon-providers/wagon-webdav-jackrabbit/target/surefire-reports/*.xml
Recording test results
[withMaven] junitPublisher - Archive test results for Maven artifact org.apache.maven.wagon:wagon-ssh-common:jar:3.3.2-SNAPSHOT
generated by maven-surefire-plugin:test (default-test): m/wagon-providers/wagon-ssh-common/target/surefire-reports/*.xml
Recording test results
None of the test reports contained any result
[withMaven] junitPublisher - Archive test results for Maven artifact org.apache.maven.wagon:wagon-ssh:jar:3.3.2-SNAPSHOT
generated by maven-surefire-plugin:test (default-test): m\wagon-providers\wagon-ssh\target\surefire-reports\*.xml
Recording test results
[INFO] Tests run: 69, Failures: 0, Errors: 0, Skipped: 0, Time elapsed: 31.082 s - in org.apache.maven.wagon.providers.webdav.WebDavsWagonTest
[INFO] Running org.apache.maven.wagon.providers.webdav.WebDavWagonTest
[withMaven] junitPublisher - Archive test results for Maven artifact org.apache.maven.wagon:wagon-ssh-common-test:jar:3.3.2-SNAPSHOT
generated by maven-surefire-plugin:test (default-test): m/wagon-providers/wagon-ssh-common-test/target/surefire-reports/*.xml
Recording test results
None of the test reports contained any result
[withMaven] junitPublisher - Archive test results for Maven artifact org.apache.maven.wagon:wagon-webdav-jackrabbit:jar:3.3.2-SNAPSHOT
generated by maven-surefire-plugin:test (default-test): m\wagon-providers\wagon-webdav-jackrabbit\target\surefire-reports\*.xml
Recording test results
None of the test reports contained any result
[withMaven] junitPublisher - Archive test results for Maven artifact org.apache.maven.wagon:wagon-ssh-external:jar:3.3.2-SNAPSHOT
generated by maven-surefire-plugin:test (default-test): m/wagon-providers/wagon-ssh-external/target/surefire-reports/*.xml
Recording test results
None of the test reports contained any result
[withMaven] junitPublisher - Archive test results for Maven artifact org.apache.maven.wagon:wagon-ssh:jar:3.3.2-SNAPSHOT
generated by maven-surefire-plugin:test (default-test): m/wagon-providers/wagon-ssh/target/surefire-reports/*.xml
Recording test results
None of the test reports contained any result
[withMaven] junitPublisher - Archive test results for Maven artifact org.apache.maven.wagon:wagon-webdav-jackrabbit:jar:3.3.2-SNAPSHOT
generated by maven-surefire-plugin:test (default-test): m/wagon-providers/wagon-webdav-jackrabbit/target/surefire-reports/*.xml
Recording test results
[withMaven] Publishers: Pipeline Graph Publisher: 10 ms, Junit Publisher: 73862 ms, Concordion
Publisher: 1 ms, Dependencies Fingerprint Publisher: 680 ms, JGiven Publisher: 1 ms
[Pipeline] // withMaven
[Pipeline] cleanWs
[WS-CLEANUP] Deleting project workspace...
[WS-CLEANUP] Deferred wipeout is used...
[WS-CLEANUP] done
[Pipeline] }
[withMaven] Publishers: Pipeline Graph Publisher: 15 ms, Invoker Publisher: 2 ms, Junit Publisher:
92374 ms, Concordion Publisher: 1 ms, Dependencies Fingerprint Publisher: 6851 ms, JGiven
Publisher: 1 ms
[Pipeline] // stage
[Pipeline] }
[Pipeline] // withMaven
[Pipeline] // node
[Pipeline] }
[Pipeline] cleanWs
[WS-CLEANUP] Deleting project workspace...
[WS-CLEANUP] Deferred wipeout is used...
[WS-CLEANUP] done
[Pipeline] }
[Pipeline] // stage
[Pipeline] }
[Pipeline] // node
[Pipeline] }
[withMaven] openTasksPublisher - Scan Tasks for Maven artifact org.apache.maven.wagon:wagon-provider-api:jar:3.3.2-SNAPSHOT
in source directory m/wagon-provider-api/src/main/java
[withMaven] openTasksPublisher - Scan Tasks for Maven artifact org.apache.maven.wagon:wagon-provider-test:jar:3.3.2-SNAPSHOT
in source directory m/wagon-provider-test/src/main/java
[withMaven] openTasksPublisher - Scan Tasks for Maven artifact org.apache.maven.wagon:wagon-file:jar:3.3.2-SNAPSHOT
in source directory m/wagon-providers/wagon-file/src/main/java
[withMaven] openTasksPublisher - Scan Tasks for Maven artifact org.apache.maven.wagon:wagon-ftp:jar:3.3.2-SNAPSHOT
in source directory m/wagon-providers/wagon-ftp/src/main/java
[withMaven] openTasksPublisher - Scan Tasks for Maven artifact org.apache.maven.wagon:wagon-http-shared:jar:3.3.2-SNAPSHOT
in source directory m/wagon-providers/wagon-http-shared/src/main/java
[withMaven] openTasksPublisher - Scan Tasks for Maven artifact org.apache.maven.wagon:wagon-tck-http:jar:3.3.2-SNAPSHOT
in source directory m/wagon-tcks/wagon-tck-http/src/main/java
[withMaven] openTasksPublisher - Scan Tasks for Maven artifact org.apache.maven.wagon:wagon-http:jar:3.3.2-SNAPSHOT
in source directory m/wagon-providers/wagon-http/src/main/java
[withMaven] openTasksPublisher - Scan Tasks for Maven artifact org.apache.maven.wagon:wagon-http-lightweight:jar:3.3.2-SNAPSHOT
in source directory m/wagon-providers/wagon-http-lightweight/src/main/java
[withMaven] openTasksPublisher - Scan Tasks for Maven artifact org.apache.maven.wagon:wagon-scm:jar:3.3.2-SNAPSHOT
in source directory m/wagon-providers/wagon-scm/src/main/java
[withMaven] openTasksPublisher - Scan Tasks for Maven artifact org.apache.maven.wagon:wagon-ssh-common:jar:3.3.2-SNAPSHOT
in source directory m/wagon-providers/wagon-ssh-common/src/main/java
[withMaven] openTasksPublisher - Scan Tasks for Maven artifact org.apache.maven.wagon:wagon-ssh-common-test:jar:3.3.2-SNAPSHOT
in source directory m/wagon-providers/wagon-ssh-common-test/src/main/java
[withMaven] openTasksPublisher - Scan Tasks for Maven artifact org.apache.maven.wagon:wagon-ssh-external:jar:3.3.2-SNAPSHOT
in source directory m/wagon-providers/wagon-ssh-external/src/main/java
[withMaven] openTasksPublisher - Scan Tasks for Maven artifact org.apache.maven.wagon:wagon-ssh:jar:3.3.2-SNAPSHOT
in source directory m/wagon-providers/wagon-ssh/src/main/java
[withMaven] openTasksPublisher - Scan Tasks for Maven artifact org.apache.maven.wagon:wagon-webdav-jackrabbit:jar:3.3.2-SNAPSHOT
in source directory m/wagon-providers/wagon-webdav-jackrabbit/src/main/java
[TASKS] Scanning folder '/home/jenkins/jenkins-slave/workspace/maven-box_maven-wagon_master'
for files matching the pattern 'm/wagon-provider-api/src/main/java/**/*,m/wagon-provider-test/src/main/java/**/*,m/wagon-providers/wagon-file/src/main/java/**/*,m/wagon-providers/wagon-ftp/src/main/java/**/*,m/wagon-providers/wagon-http-shared/src/main/java/**/*,m/wagon-tcks/wagon-tck-http/src/main/java/**/*,m/wagon-providers/wagon-http/src/main/java/**/*,m/wagon-providers/wagon-http-lightweight/src/main/java/**/*,m/wagon-providers/wagon-scm/src/main/java/**/*,m/wagon-providers/wagon-ssh-common/src/main/java/**/*,m/wagon-providers/wagon-ssh-common-test/src/main/java/**/*,m/wagon-providers/wagon-ssh-external/src/main/java/**/*,m/wagon-providers/wagon-ssh/src/main/java/**/*,m/wagon-providers/wagon-webdav-jackrabbit/src/main/java/**/*'
- excludes: null
[TASKS] Found 114 files to scan for tasks
[TASKS] Found 31 open tasks.
Skipping warnings blame since pipelines do not have an SCM link.%n
[TASKS] Computing warning deltas based on reference build #4
[withMaven] Publishers: Pipeline Graph Publisher: 7 ms, Junit Publisher: 73158 ms, Concordion
Publisher: 1 ms, Dependencies Fingerprint Publisher: 6838 ms, JGiven Publisher: 1 ms, Jacoco
Publisher: 1 ms, SpotBugs Publisher: 1 ms
[withMaven] Publishers: Pipeline Graph Publisher: 15 ms, Generated Artifacts Publisher: 14770
ms, Invoker Publisher: 5 ms, Junit Publisher: 89002 ms, Concordion Publisher: 1 ms, Dependencies
Fingerprint Publisher: 6859 ms, Findbugs Publisher: 1 ms, JGiven Publisher: 1 ms, Jacoco Publisher:
1 ms, SpotBugs Publisher: 1 ms, Open Task Scanner Publisher: 5189 ms
[Pipeline] // withMaven
[Pipeline] cleanWs
[Pipeline] // withMaven
[Pipeline] cleanWs
[WS-CLEANUP] Deleting project workspace...
[WS-CLEANUP] Deferred wipeout is used...
[WS-CLEANUP] Deleting project workspace...
[WS-CLEANUP] Deferred wipeout is used...
[WS-CLEANUP] done
[Pipeline] }
[Pipeline] // stage
[Pipeline] }
[Pipeline] // node
[Pipeline] }
[WS-CLEANUP] done
[Pipeline] }
[Pipeline] // stage
[Pipeline] }
[Pipeline] // node
[Pipeline] }
[INFO] Tests run: 69, Failures: 0, Errors: 0, Skipped: 0, Time elapsed: 26.317 s - in org.apache.maven.wagon.providers.webdav.WebDavWagonTest
[INFO] 
[INFO] Results:
[INFO] 
[INFO] Tests run: 145, Failures: 0, Errors: 0, Skipped: 0
[INFO] 
[INFO] 
[INFO] --- maven-jar-plugin:3.1.0:jar (default-jar) @ wagon-webdav-jackrabbit ---
[INFO] Building jar: F:\jenkins\jenkins-slave\workspace\maven-box_maven-wagon_master\m\wagon-providers\wagon-webdav-jackrabbit\target\wagon-webdav-jackrabbit-3.3.2-SNAPSHOT.jar
[INFO] 
[INFO] --- maven-site-plugin:3.7.1:attach-descriptor (attach-descriptor) @ wagon-webdav-jackrabbit
---
[INFO] Skipping because packaging 'jar' is not pom.
[INFO] 
[INFO] --- maven-checkstyle-plugin:3.0.0:check (checkstyle-check) @ wagon-webdav-jackrabbit
---
[INFO] ------------------------------------------------------------------------
[INFO] Reactor Summary:
[INFO] 
[INFO] Apache Maven Wagon ................................. SUCCESS [ 41.691 s]
[INFO] Apache Maven Wagon :: API .......................... SUCCESS [ 12.305 s]
[INFO] Apache Maven Wagon :: Provider Test ................ SUCCESS [  3.713 s]
[INFO] Apache Maven Wagon :: Providers .................... SUCCESS [  1.339 s]
[INFO] Apache Maven Wagon :: Providers :: File Provider ... SUCCESS [  4.517 s]
[INFO] Apache Maven Wagon :: Providers :: FTP Provider .... SUCCESS [  7.760 s]
[INFO] Apache Maven Wagon :: Providers :: HTTP Shared Library SUCCESS [  5.013 s]
[INFO] Apache Maven Wagon :: Test Compatibility Kits ...... SUCCESS [  1.543 s]
[INFO] Apache Maven Wagon :: HTTP Test Compatibility Kit .. SUCCESS [  2.871 s]
[INFO] Apache Maven Wagon :: Providers :: HTTP Provider ... SUCCESS [04:57 min]
[INFO] Apache Maven Wagon :: Providers :: Lightweight HTTP Provider SUCCESS [02:12 min]
[INFO] Apache Maven Wagon :: Providers :: SCM Provider .... SUCCESS [01:23 min]
[INFO] Apache Maven Wagon :: Providers :: SSH Common Library SUCCESS [  3.980 s]
[INFO] Apache Maven Wagon :: Providers :: SSH Common Tests  SUCCESS [  3.574 s]
[INFO] Apache Maven Wagon :: Providers :: SSH External Provider SUCCESS [  2.383 s]
[INFO] Apache Maven Wagon :: Providers :: SSH Provider .... SUCCESS [  4.766 s]
[INFO] Apache Maven Wagon :: Providers :: WebDAV Provider . SUCCESS [01:03 min]
[INFO] ------------------------------------------------------------------------
[INFO] BUILD SUCCESS
[INFO] ------------------------------------------------------------------------
[INFO] Total time: 11:14 min
[INFO] Finished at: 2019-02-03T04:48:33-08:00
[INFO] Final Memory: 64M/698M
[INFO] ------------------------------------------------------------------------
[WARNING] The requested profile "run-its" could not be activated because it does not exist.
[INFO] [jenkins-event-spy] Generated F:\jenkins\jenkins-slave\workspace\maven-box_maven-wagon_master@tmp\withMaven580285f2\maven-spy-20190203-043718-868768907925276812764.log
Picked up JAVA_TOOL_OPTIONS: -Dmaven.ext.class.path="f:\jenkins\jenkins-slave\workspace\maven-box_maven-wagon_master@tmp\withMaven580285f2\pipeline-maven-spy.jar"
-Dorg.jenkinsci.plugins.pipeline.maven.reportsFolder="f:\jenkins\jenkins-slave\workspace\maven-box_maven-wagon_master@tmp\withMaven580285f2"

[Pipeline] }
[Pipeline] // dir
[Pipeline] }
[withMaven] junitPublisher - Archive test results for Maven artifact org.apache.maven.wagon:wagon-provider-api:jar:3.3.2-SNAPSHOT
generated by maven-surefire-plugin:test (default-test): m\wagon-provider-api\target\surefire-reports\*.xml
Recording test results
[withMaven] junitPublisher - Archive test results for Maven artifact org.apache.maven.wagon:wagon-provider-test:jar:3.3.2-SNAPSHOT
generated by maven-surefire-plugin:test (default-test): m\wagon-provider-test\target\surefire-reports\*.xml
Recording test results
None of the test reports contained any result
[withMaven] junitPublisher - Archive test results for Maven artifact org.apache.maven.wagon:wagon-file:jar:3.3.2-SNAPSHOT
generated by maven-surefire-plugin:test (default-test): m\wagon-providers\wagon-file\target\surefire-reports\*.xml
Recording test results
[withMaven] junitPublisher - Archive test results for Maven artifact org.apache.maven.wagon:wagon-ftp:jar:3.3.2-SNAPSHOT
generated by maven-surefire-plugin:test (default-test): m\wagon-providers\wagon-ftp\target\surefire-reports\*.xml
Recording test results
[withMaven] junitPublisher - Archive test results for Maven artifact org.apache.maven.wagon:wagon-http-shared:jar:3.3.2-SNAPSHOT
generated by maven-surefire-plugin:test (default-test): m\wagon-providers\wagon-http-shared\target\surefire-reports\*.xml
Recording test results
[withMaven] junitPublisher - Archive test results for Maven artifact org.apache.maven.wagon:wagon-tck-http:jar:3.3.2-SNAPSHOT
generated by maven-surefire-plugin:test (default-test): m\wagon-tcks\wagon-tck-http\target\surefire-reports\*.xml
Recording test results
None of the test reports contained any result
[withMaven] junitPublisher - Archive test results for Maven artifact org.apache.maven.wagon:wagon-http:jar:3.3.2-SNAPSHOT
generated by maven-surefire-plugin:test (default-test): m\wagon-providers\wagon-http\target\surefire-reports\*.xml
Recording test results
[withMaven] junitPublisher - Archive test results for Maven artifact org.apache.maven.wagon:wagon-http-lightweight:jar:3.3.2-SNAPSHOT
generated by maven-surefire-plugin:test (default-test): m\wagon-providers\wagon-http-lightweight\target\surefire-reports\*.xml
Recording test results
[withMaven] junitPublisher - Archive test results for Maven artifact org.apache.maven.wagon:wagon-scm:jar:3.3.2-SNAPSHOT
generated by maven-surefire-plugin:test (default-test): m\wagon-providers\wagon-scm\target\surefire-reports\*.xml
Recording test results
[withMaven] junitPublisher - Archive test results for Maven artifact org.apache.maven.wagon:wagon-ssh-common:jar:3.3.2-SNAPSHOT
generated by maven-surefire-plugin:test (default-test): m\wagon-providers\wagon-ssh-common\target\surefire-reports\*.xml
Recording test results
[withMaven] junitPublisher - Archive test results for Maven artifact org.apache.maven.wagon:wagon-ssh-common-test:jar:3.3.2-SNAPSHOT
generated by maven-surefire-plugin:test (default-test): m\wagon-providers\wagon-ssh-common-test\target\surefire-reports\*.xml
Recording test results
None of the test reports contained any result
[withMaven] junitPublisher - Archive test results for Maven artifact org.apache.maven.wagon:wagon-ssh-external:jar:3.3.2-SNAPSHOT
generated by maven-surefire-plugin:test (default-test): m\wagon-providers\wagon-ssh-external\target\surefire-reports\*.xml
Recording test results
None of the test reports contained any result
[withMaven] junitPublisher - Archive test results for Maven artifact org.apache.maven.wagon:wagon-ssh:jar:3.3.2-SNAPSHOT
generated by maven-surefire-plugin:test (default-test): m\wagon-providers\wagon-ssh\target\surefire-reports\*.xml
Recording test results
None of the test reports contained any result
[withMaven] junitPublisher - Archive test results for Maven artifact org.apache.maven.wagon:wagon-webdav-jackrabbit:jar:3.3.2-SNAPSHOT
generated by maven-surefire-plugin:test (default-test): m\wagon-providers\wagon-webdav-jackrabbit\target\surefire-reports\*.xml
Recording test results
[withMaven] Publishers: Pipeline Graph Publisher: 12 ms, Invoker Publisher: 1 ms, Junit Publisher:
5019 ms, Concordion Publisher: 1 ms, Dependencies Fingerprint Publisher: 677 ms, JGiven Publisher:
1 ms, Jacoco Publisher: 1 ms
[Pipeline] // withMaven
[Pipeline] cleanWs
[WS-CLEANUP] Deleting project workspace...
[WS-CLEANUP] Deferred wipeout is used...
[WS-CLEANUP] done
[Pipeline] }
[Pipeline] // stage
[Pipeline] }
[Pipeline] // node
[Pipeline] }
[Pipeline] // parallel
[Pipeline] echo
[FAILURE-001] org.jenkinsci.plugins.scriptsecurity.sandbox.RejectedAccessException: Scripts
not permitted to use method org.jenkinsci.plugins.workflow.support.steps.build.RunWrapper
getRawBuild
[Pipeline] stage
[Pipeline] { (Notifications)
[Pipeline] echo
Build result: FAILURE
[Pipeline] jiraIssueSelector
[Pipeline] emailext
Mime
  • Unnamed multipart/mixed (inline, None, 0 bytes)
View raw message