maven-notifications mailing list archives

Site index · List index
Message view « Date » · « Thread »
Top « Date » · « Thread »
From Apache Jenkins Server <jenk...@builds.apache.org>
Subject Build failed in Jenkins: Maven TLP » maven-wagon » WAGON-552 #1
Date Sun, 03 Feb 2019 13:15:56 GMT
See https://builds.apache.org/job/maven-box/job/maven-wagon/job/WAGON-552/1/

No changes.

62 tests failed.
FAILED:  org.apache.maven.wagon.providers.ftp.FtpWagonTest.windows-jdk8 / Build windows-jdk8 / testFailedGetToStream

Error Message:
Failed to bind to address 0.0.0.0/0.0.0.0:10023, check configuration

Stack Trace:
org.apache.ftpserver.FtpServerConfigurationException: Failed to bind to address 0.0.0.0/0.0.0.0:10023, check configuration
	at org.apache.maven.wagon.providers.ftp.FtpWagonTest.setupWagonTestingFixtures(FtpWagonTest.java:106)
Caused by: java.net.BindException: Address already in use: bind


FAILED:  org.apache.maven.wagon.providers.ftp.FtpWagonTest.windows-jdk8 / Build windows-jdk8 / testWagonGetIfNewerToStreamIsNewer

Error Message:
Failed to bind to address 0.0.0.0/0.0.0.0:10023, check configuration

Stack Trace:
org.apache.ftpserver.FtpServerConfigurationException: Failed to bind to address 0.0.0.0/0.0.0.0:10023, check configuration
	at org.apache.maven.wagon.providers.ftp.FtpWagonTest.setupWagonTestingFixtures(FtpWagonTest.java:106)
Caused by: java.net.BindException: Address already in use: bind


FAILED:  org.apache.maven.wagon.providers.ftp.FtpWagonTest.windows-jdk8 / Build windows-jdk8 / testWagonGetIfNewerToStreamIsOlder

Error Message:

  Unexpected method call TransferListener.transferError(TransferEvent[PUT|ERROR|Repository[ftp://localhost:10023]|null|test-resource[len = 18; mod = 1549199116129]]):
    TransferListener.transferStarted(TransferEvent[PUT|STARTED|Repository[ftp://localhost:10023]|F:\jenkins\jenkins-slave\workspace\maven-box_maven-wagon_WAGON-552@2\m\wagon-providers\wagon-ftp\target\test-output\test-resource|test-resource[len = 18; mod = 1549199116129]]): expected: 1, actual: 0
    TransferListener.transferCompleted(TransferEvent[PUT|COMPLETED|Repository[ftp://localhost:10023]|F:\jenkins\jenkins-slave\workspace\maven-box_maven-wagon_WAGON-552@2\m\wagon-providers\wagon-ftp\target\test-output\test-resource|test-resource[len = 18; mod = 1549199116129]]): expected: 1, actual: 0

Stack Trace:
java.lang.AssertionError: 

  Unexpected method call TransferListener.transferError(TransferEvent[PUT|ERROR|Repository[ftp://localhost:10023]|null|test-resource[len = 18; mod = 1549199116129]]):
    TransferListener.transferStarted(TransferEvent[PUT|STARTED|Repository[ftp://localhost:10023]|F:\jenkins\jenkins-slave\workspace\maven-box_maven-wagon_WAGON-552@2\m\wagon-providers\wagon-ftp\target\test-output\test-resource|test-resource[len = 18; mod = 1549199116129]]): expected: 1, actual: 0
    TransferListener.transferCompleted(TransferEvent[PUT|COMPLETED|Repository[ftp://localhost:10023]|F:\jenkins\jenkins-slave\workspace\maven-box_maven-wagon_WAGON-552@2\m\wagon-providers\wagon-ftp\target\test-output\test-resource|test-resource[len = 18; mod = 1549199116129]]): expected: 1, actual: 0


FAILED:  org.apache.maven.wagon.providers.ftp.FtpWagonTest.windows-jdk8 / Build windows-jdk8 / testStreamingWagon

Error Message:
Could not connect to server.

Stack Trace:
org.apache.maven.wagon.authentication.AuthenticationException: Could not connect to server.
Caused by: java.net.ConnectException: Connection refused: connect


FAILED:  org.apache.maven.wagon.providers.ftp.FtpWagonTest.windows-jdk8 / Build windows-jdk8 / testWagonGetIfNewerToStreamIsSame

Error Message:

  Unexpected method call TransferListener.transferStarted(TransferEvent[GET|STARTED|Repository[ftp://localhost:10023]|null|test-resource[len = 18; mod = 1549199100000]]):

Stack Trace:
java.lang.AssertionError: 

  Unexpected method call TransferListener.transferStarted(TransferEvent[GET|STARTED|Repository[ftp://localhost:10023]|null|test-resource[len = 18; mod = 1549199100000]]):


FAILED:  org.apache.maven.wagon.providers.ftp.FtpWagonTest.windows-jdk8 / Build windows-jdk8 / testWagonPutDirectoryDeepDestination

Error Message:
Error transferring file via FTP

Stack Trace:
org.apache.maven.wagon.TransferFailedException: Error transferring file via FTP
Caused by: org.apache.commons.net.ftp.FTPConnectionClosedException: Connection closed without indication.


FAILED:  org.apache.maven.wagon.providers.ftp.FtpWagonTest.windows-jdk8 / Build windows-jdk8 / testWagon

Error Message:
Failed to bind to address 0.0.0.0/0.0.0.0:10023, check configuration

Stack Trace:
org.apache.ftpserver.FtpServerConfigurationException: Failed to bind to address 0.0.0.0/0.0.0.0:10023, check configuration
	at org.apache.maven.wagon.providers.ftp.FtpWagonTest.setupWagonTestingFixtures(FtpWagonTest.java:106)
Caused by: java.net.BindException: Address already in use: bind


FAILED:  org.apache.maven.wagon.providers.ftp.FtpWagonTest.windows-jdk8 / Build windows-jdk8 / testWagonPutDirectoryForDot

Error Message:
Error transferring file via FTP

Stack Trace:
org.apache.maven.wagon.TransferFailedException: Error transferring file via FTP
Caused by: org.apache.commons.net.ftp.FTPConnectionClosedException: Connection closed without indication.


FAILED:  org.apache.maven.wagon.providers.ftp.FtpWagonTest.windows-jdk8 / Build windows-jdk8 / testWagonGetIfNewerIsNewer

Error Message:
Could not connect to server.

Stack Trace:
org.apache.maven.wagon.authentication.AuthenticationException: Could not connect to server.
Caused by: java.net.ConnectException: Connection refused: connect


FAILED:  org.apache.maven.wagon.providers.ftp.FtpWagonTest.windows-jdk8 / Build windows-jdk8 / testWagonGetIfNewerIsOlder

Error Message:
Could not connect to server.

Stack Trace:
org.apache.maven.wagon.authentication.AuthenticationException: Could not connect to server.
Caused by: java.net.ConnectException: Connection refused: connect


FAILED:  org.apache.maven.wagon.providers.ftp.FtpWagonTest.windows-jdk8 / Build windows-jdk8 / testWagonGetFileList

Error Message:
Could not connect to server.

Stack Trace:
org.apache.maven.wagon.authentication.AuthenticationException: Could not connect to server.
Caused by: java.net.ConnectException: Connection refused: connect


FAILED:  org.apache.maven.wagon.providers.ftp.FtpWagonTest.windows-jdk8 / Build windows-jdk8 / testFailedGet

Error Message:
Could not connect to server.

Stack Trace:
org.apache.maven.wagon.authentication.AuthenticationException: Could not connect to server.
Caused by: java.net.ConnectException: Connection refused: connect


FAILED:  org.apache.maven.wagon.providers.ftp.FtpWagonTest.windows-jdk8 / Build windows-jdk8 / testWagonPutDirectoryWhenDirectoryAlreadyExists

Error Message:
Could not connect to server.

Stack Trace:
org.apache.maven.wagon.authentication.AuthenticationException: Could not connect to server.
Caused by: java.net.ConnectException: Connection refused: connect


FAILED:  org.apache.maven.wagon.providers.ftp.FtpWagonTest.windows-jdk8 / Build windows-jdk8 / testWagonResourceExists

Error Message:
Could not connect to server.

Stack Trace:
org.apache.maven.wagon.authentication.AuthenticationException: Could not connect to server.
Caused by: java.net.ConnectException: Connection refused: connect


FAILED:  org.apache.maven.wagon.providers.ftp.FtpWagonTest.windows-jdk8 / Build windows-jdk8 / testFailedGetIfNewer

Error Message:
Could not connect to server.

Stack Trace:
org.apache.maven.wagon.authentication.AuthenticationException: Could not connect to server.
Caused by: java.net.ConnectException: Connection refused: connect


FAILED:  org.apache.maven.wagon.providers.ftp.FtpWagonTest.windows-jdk8 / Build windows-jdk8 / testWagonResourceNotExists

Error Message:
Could not connect to server.

Stack Trace:
org.apache.maven.wagon.authentication.AuthenticationException: Could not connect to server.
Caused by: java.net.ConnectException: Connection refused: connect


FAILED:  org.apache.maven.wagon.providers.ftp.FtpWagonTest.windows-jdk8 / Build windows-jdk8 / testWagonPutDirectory

Error Message:
Could not connect to server.

Stack Trace:
org.apache.maven.wagon.authentication.AuthenticationException: Could not connect to server.
Caused by: java.net.ConnectException: Connection refused: connect


FAILED:  org.apache.maven.wagon.providers.ftp.FtpWagonTest.windows-jdk8 / Build windows-jdk8 / testWagonGetIfNewerIsSame

Error Message:
Could not connect to server.

Stack Trace:
org.apache.maven.wagon.authentication.AuthenticationException: Could not connect to server.
Caused by: java.net.ConnectException: Connection refused: connect


FAILED:  org.apache.maven.wagon.providers.http.HttpWagonTimeoutTest.linux-jdk8 / Build linux-jdk8 / testResourceExits

Error Message:
Address already in use

Stack Trace:
java.net.BindException: Address already in use
	at org.apache.maven.wagon.providers.http.HttpWagonTimeoutTest.setUp(HttpWagonTimeoutTest.java:45)


FAILED:  org.apache.maven.wagon.providers.http.HttpWagonTimeoutTest.linux-jdk8 / Build linux-jdk8 / testGetTimeout

Error Message:
Address already in use

Stack Trace:
java.net.BindException: Address already in use
	at org.apache.maven.wagon.providers.http.HttpWagonTimeoutTest.setUp(HttpWagonTimeoutTest.java:45)


FAILED:  org.apache.maven.wagon.providers.http.HttpWagonTimeoutTest.linux-jdk8 / Build linux-jdk8 / testConnectionTimeout

Error Message:
Address already in use

Stack Trace:
java.net.BindException: Address already in use
	at org.apache.maven.wagon.providers.http.HttpWagonTimeoutTest.setUp(HttpWagonTimeoutTest.java:45)


FAILED:  org.apache.maven.wagon.providers.http.HttpWagonTimeoutTest.linux-jdk8 / Build linux-jdk8 / testGetFileList

Error Message:
Address already in use

Stack Trace:
java.net.BindException: Address already in use
	at org.apache.maven.wagon.providers.http.HttpWagonTimeoutTest.setUp(HttpWagonTimeoutTest.java:45)


FAILED:  org.apache.maven.wagon.providers.http.HttpWagonTimeoutTest.windows-jdk7 / Build windows-jdk7 / testConnectionTimeout

Error Message:
Address already in use: bind

Stack Trace:
java.net.BindException: Address already in use: bind
	at org.apache.maven.wagon.providers.http.HttpWagonTimeoutTest.setUp(HttpWagonTimeoutTest.java:45)


FAILED:  org.apache.maven.wagon.providers.http.HttpWagonTimeoutTest.windows-jdk7 / Build windows-jdk7 / testGetFileList

Error Message:
Address already in use: bind

Stack Trace:
java.net.BindException: Address already in use: bind
	at org.apache.maven.wagon.providers.http.HttpWagonTimeoutTest.setUp(HttpWagonTimeoutTest.java:45)


FAILED:  org.apache.maven.wagon.providers.scm.ScmGitExeWagonTest.linux-jdk11 / Build linux-jdk11 / testWagonPutDirectory

Error Message:
Error interacting with SCM: Unable to commit file. The git-commit command failed. 
*** Please tell me who you are.

Run

  git config --global user.email "you@example.com"
  git config --global user.name "Your Name"

to set your account's default identity.
Omit --global to set the identity only in this repository.

fatal:********@asf928.gq1.ygridcore.net>) not allowed


Stack Trace:
org.apache.maven.wagon.TransferFailedException: 
Error interacting with SCM: Unable to commit file. The git-commit command failed. 
*** Please tell me who you are.

Run

  git config --global user.email "you@example.com"
  git config --global user.name "Your Name"

to set your account's default identity.
Omit --global to set the identity only in this repository.

fatal:********@asf928.gq1.ygridcore.net>) not allowed

Caused by: org.apache.maven.scm.ScmException: 
Unable to commit file. The git-commit command failed. 
*** Please tell me who you are.

Run

  git config --global user.email "you@example.com"
  git config --global user.name "Your Name"

to set your account's default identity.
Omit --global to set the identity only in this repository.

fatal:********@asf928.gq1.ygridcore.net>) not allowed



FAILED:  org.apache.maven.wagon.providers.scm.ScmGitExeWagonTest.linux-jdk11 / Build linux-jdk11 / testWagonPutDirectoryDeepDestination

Error Message:
Error interacting with SCM: Unable to commit file. The git-commit command failed. 
*** Please tell me who you are.

Run

  git config --global user.email "you@example.com"
  git config --global user.name "Your Name"

to set your account's default identity.
Omit --global to set the identity only in this repository.

fatal:********@asf928.gq1.ygridcore.net>) not allowed


Stack Trace:
org.apache.maven.wagon.TransferFailedException: 
Error interacting with SCM: Unable to commit file. The git-commit command failed. 
*** Please tell me who you are.

Run

  git config --global user.email "you@example.com"
  git config --global user.name "Your Name"

to set your account's default identity.
Omit --global to set the identity only in this repository.

fatal:********@asf928.gq1.ygridcore.net>) not allowed

Caused by: org.apache.maven.scm.ScmException: 
Unable to commit file. The git-commit command failed. 
*** Please tell me who you are.

Run

  git config --global user.email "you@example.com"
  git config --global user.name "Your Name"

to set your account's default identity.
Omit --global to set the identity only in this repository.

fatal:********@asf928.gq1.ygridcore.net>) not allowed



FAILED:  org.apache.maven.wagon.providers.scm.ScmGitExeWagonTest.linux-jdk11 / Build linux-jdk11 / testWagon

Error Message:

  Unexpected method call TransferListener.transferError(TransferEvent[PUT|ERROR|Repository[scm:git:file:///home/jenkins/jenkins-slave/workspace/maven-box_maven-wagon_WAGON-552/m/wagon-providers/wagon-scm/target/test-classes/test-repo-git-test/]|null|test-resource[len = 18; mod = 1549199477298]]):
    TransferListener.transferCompleted(TransferEvent[PUT|COMPLETED|Repository[scm:git:file:///home/jenkins/jenkins-slave/workspace/maven-box_maven-wagon_WAGON-552/m/wagon-providers/wagon-scm/target/test-classes/test-repo-git-test/]|/home/jenkins/jenkins-slave/workspace/maven-box_maven-wagon_WAGON-552/m/wagon-providers/wagon-scm/target/test-output/test-resource|test-resource[len = 18; mod = 1549199477298]]): expected: 1, actual: 0

Stack Trace:
java.lang.AssertionError: 

  Unexpected method call TransferListener.transferError(TransferEvent[PUT|ERROR|Repository[scm:git:file:///home/jenkins/jenkins-slave/workspace/maven-box_maven-wagon_WAGON-552/m/wagon-providers/wagon-scm/target/test-classes/test-repo-git-test/]|null|test-resource[len = 18; mod = 1549199477298]]):
    TransferListener.transferCompleted(TransferEvent[PUT|COMPLETED|Repository[scm:git:file:///home/jenkins/jenkins-slave/workspace/maven-box_maven-wagon_WAGON-552/m/wagon-providers/wagon-scm/target/test-classes/test-repo-git-test/]|/home/jenkins/jenkins-slave/workspace/maven-box_maven-wagon_WAGON-552/m/wagon-providers/wagon-scm/target/test-output/test-resource|test-resource[len = 18; mod = 1549199477298]]): expected: 1, actual: 0


FAILED:  org.apache.maven.wagon.providers.scm.ScmGitExeWagonTest.linux-jdk11 / Build linux-jdk11 / testWagonPutDirectoryForDot

Error Message:
Error interacting with SCM: Unable to commit file. The git-commit command failed. 
*** Please tell me who you are.

Run

  git config --global user.email "you@example.com"
  git config --global user.name "Your Name"

to set your account's default identity.
Omit --global to set the identity only in this repository.

fatal:********@asf928.gq1.ygridcore.net>) not allowed


Stack Trace:
org.apache.maven.wagon.TransferFailedException: 
Error interacting with SCM: Unable to commit file. The git-commit command failed. 
*** Please tell me who you are.

Run

  git config --global user.email "you@example.com"
  git config --global user.name "Your Name"

to set your account's default identity.
Omit --global to set the identity only in this repository.

fatal:********@asf928.gq1.ygridcore.net>) not allowed

Caused by: org.apache.maven.scm.ScmException: 
Unable to commit file. The git-commit command failed. 
*** Please tell me who you are.

Run

  git config --global user.email "you@example.com"
  git config --global user.name "Your Name"

to set your account's default identity.
Omit --global to set the identity only in this repository.

fatal:********@asf928.gq1.ygridcore.net>) not allowed



FAILED:  org.apache.maven.wagon.providers.scm.ScmGitExeWagonTest.linux-jdk11 / Build linux-jdk11 / testWagonPutDirectoryWhenDirectoryAlreadyExists

Error Message:
Error interacting with SCM: Unable to commit file. The git-commit command failed. 
*** Please tell me who you are.

Run

  git config --global user.email "you@example.com"
  git config --global user.name "Your Name"

to set your account's default identity.
Omit --global to set the identity only in this repository.

fatal:********@asf928.gq1.ygridcore.net>) not allowed


Stack Trace:
org.apache.maven.wagon.TransferFailedException: 
Error interacting with SCM: Unable to commit file. The git-commit command failed. 
*** Please tell me who you are.

Run

  git config --global user.email "you@example.com"
  git config --global user.name "Your Name"

to set your account's default identity.
Omit --global to set the identity only in this repository.

fatal:********@asf928.gq1.ygridcore.net>) not allowed

Caused by: org.apache.maven.scm.ScmException: 
Unable to commit file. The git-commit command failed. 
*** Please tell me who you are.

Run

  git config --global user.email "you@example.com"
  git config --global user.name "Your Name"

to set your account's default identity.
Omit --global to set the identity only in this repository.

fatal:********@asf928.gq1.ygridcore.net>) not allowed



FAILED:  org.apache.maven.wagon.providers.scm.ScmGitExeWagonTest.linux-jdk8 / Build linux-jdk8 / testWagonPutDirectory

Error Message:
Error checking out: command failed: Cloning into 'checkout-org.apache.maven.scm.provider.git.gitexe.GitExeScmProvider'...
fatal: '/m/wagon-providers/wagon-scm/target/test-classes/test-repo-git-test/' does not appear to be a git repository
fatal: Could not read from remote repository.

Please make sure you have the correct access rights
and the repository exists.

Stack Trace:
org.apache.maven.wagon.TransferFailedException: 
Error checking out: command failed: Cloning into 'checkout-org.apache.maven.scm.provider.git.gitexe.GitExeScmProvider'...
fatal: '/m/wagon-providers/wagon-scm/target/test-classes/test-repo-git-test/' does not appear to be a git repository
fatal: Could not read from remote repository.

Please make sure you have the correct access rights
and the repository exists.
Caused by: org.apache.maven.scm.ScmException: 
command failed: Cloning into 'checkout-org.apache.maven.scm.provider.git.gitexe.GitExeScmProvider'...
fatal: '/m/wagon-providers/wagon-scm/target/test-classes/test-repo-git-test/' does not appear to be a git repository
fatal: Could not read from remote repository.

Please make sure you have the correct access rights
and the repository exists.


FAILED:  org.apache.maven.wagon.providers.scm.ScmGitExeWagonTest.linux-jdk8 / Build linux-jdk8 / testWagonPutDirectoryDeepDestination

Error Message:
Error checking out: command failed: Cloning into 'checkout-org.apache.maven.scm.provider.git.gitexe.GitExeScmProvider'...
fatal: '/m/wagon-providers/wagon-scm/target/test-classes/test-repo-git-test/' does not appear to be a git repository
fatal: Could not read from remote repository.

Please make sure you have the correct access rights
and the repository exists.

Stack Trace:
org.apache.maven.wagon.TransferFailedException: 
Error checking out: command failed: Cloning into 'checkout-org.apache.maven.scm.provider.git.gitexe.GitExeScmProvider'...
fatal: '/m/wagon-providers/wagon-scm/target/test-classes/test-repo-git-test/' does not appear to be a git repository
fatal: Could not read from remote repository.

Please make sure you have the correct access rights
and the repository exists.
Caused by: org.apache.maven.scm.ScmException: 
command failed: Cloning into 'checkout-org.apache.maven.scm.provider.git.gitexe.GitExeScmProvider'...
fatal: '/m/wagon-providers/wagon-scm/target/test-classes/test-repo-git-test/' does not appear to be a git repository
fatal: Could not read from remote repository.

Please make sure you have the correct access rights
and the repository exists.


FAILED:  org.apache.maven.wagon.providers.scm.ScmGitExeWagonTest.linux-jdk8 / Build linux-jdk8 / testWagon

Error Message:

  Unexpected method call TransferListener.transferError(TransferEvent[GET|ERROR|Repository[scm:git:file://2/m/wagon-providers/wagon-scm/target/test-classes/test-repo-git-test/]|null|test-resource[len = 18; mod = 1549199560000]]):
    TransferListener.transferCompleted(TransferEvent[PUT|COMPLETED|Repository[scm:git:file://2/m/wagon-providers/wagon-scm/target/test-classes/test-repo-git-test/]|/home/jenkins/jenkins-slave/workspace/maven-box_maven-wagon_WAGON-552@2/m/wagon-providers/wagon-scm/target/test-output/test-resource|test-resource[len = 18; mod = 1549199560000]]): expected: 1, actual: 0

Stack Trace:
java.lang.AssertionError: 

  Unexpected method call TransferListener.transferError(TransferEvent[GET|ERROR|Repository[scm:git:file://2/m/wagon-providers/wagon-scm/target/test-classes/test-repo-git-test/]|null|test-resource[len = 18; mod = 1549199560000]]):
    TransferListener.transferCompleted(TransferEvent[PUT|COMPLETED|Repository[scm:git:file://2/m/wagon-providers/wagon-scm/target/test-classes/test-repo-git-test/]|/home/jenkins/jenkins-slave/workspace/maven-box_maven-wagon_WAGON-552@2/m/wagon-providers/wagon-scm/target/test-output/test-resource|test-resource[len = 18; mod = 1549199560000]]): expected: 1, actual: 0


FAILED:  org.apache.maven.wagon.providers.scm.ScmGitExeWagonTest.linux-jdk8 / Build linux-jdk8 / testWagonPutDirectoryForDot

Error Message:
Error checking out: command failed: Cloning into 'checkout-org.apache.maven.scm.provider.git.gitexe.GitExeScmProvider'...
fatal: '/m/wagon-providers/wagon-scm/target/test-classes/test-repo-git-test/' does not appear to be a git repository
fatal: Could not read from remote repository.

Please make sure you have the correct access rights
and the repository exists.

Stack Trace:
org.apache.maven.wagon.TransferFailedException: 
Error checking out: command failed: Cloning into 'checkout-org.apache.maven.scm.provider.git.gitexe.GitExeScmProvider'...
fatal: '/m/wagon-providers/wagon-scm/target/test-classes/test-repo-git-test/' does not appear to be a git repository
fatal: Could not read from remote repository.

Please make sure you have the correct access rights
and the repository exists.
Caused by: org.apache.maven.scm.ScmException: 
command failed: Cloning into 'checkout-org.apache.maven.scm.provider.git.gitexe.GitExeScmProvider'...
fatal: '/m/wagon-providers/wagon-scm/target/test-classes/test-repo-git-test/' does not appear to be a git repository
fatal: Could not read from remote repository.

Please make sure you have the correct access rights
and the repository exists.


FAILED:  org.apache.maven.wagon.providers.scm.ScmGitExeWagonTest.linux-jdk8 / Build linux-jdk8 / testFailedGet

Error Message:
Error getting file from SCM

Stack Trace:
org.apache.maven.wagon.TransferFailedException: Error getting file from SCM
Caused by: org.apache.maven.scm.ScmException: 
command failed: Cloning into 'checkout-org.apache.maven.scm.provider.git.gitexe.GitExeScmProvider'...
fatal: '/m/wagon-providers/wagon-scm/target/test-classes/test-repo-git-test/' does not appear to be a git repository
fatal: Could not read from remote repository.

Please make sure you have the correct access rights
and the repository exists.


FAILED:  org.apache.maven.wagon.providers.scm.ScmGitExeWagonTest.linux-jdk8 / Build linux-jdk8 / testWagonPutDirectoryWhenDirectoryAlreadyExists

Error Message:
Error checking out: command failed: Cloning into 'checkout-org.apache.maven.scm.provider.git.gitexe.GitExeScmProvider'...
fatal: '/m/wagon-providers/wagon-scm/target/test-classes/test-repo-git-test/' does not appear to be a git repository
fatal: Could not read from remote repository.

Please make sure you have the correct access rights
and the repository exists.

Stack Trace:
org.apache.maven.wagon.TransferFailedException: 
Error checking out: command failed: Cloning into 'checkout-org.apache.maven.scm.provider.git.gitexe.GitExeScmProvider'...
fatal: '/m/wagon-providers/wagon-scm/target/test-classes/test-repo-git-test/' does not appear to be a git repository
fatal: Could not read from remote repository.

Please make sure you have the correct access rights
and the repository exists.
Caused by: org.apache.maven.scm.ScmException: 
command failed: Cloning into 'checkout-org.apache.maven.scm.provider.git.gitexe.GitExeScmProvider'...
fatal: '/m/wagon-providers/wagon-scm/target/test-classes/test-repo-git-test/' does not appear to be a git repository
fatal: Could not read from remote repository.

Please make sure you have the correct access rights
and the repository exists.


FAILED:  org.apache.maven.wagon.providers.scm.ScmGitExeWagonTest.linux-jdk7 / Build linux-jdk7 / testWagonPutDirectory

Error Message:
Error interacting with SCM: Unable to commit file. The git-commit command failed. 
*** Please tell me who you are.

Run

  git config --global user.email "you@example.com"
  git config --global user.name "Your Name"

to set your account's default identity.
Omit --global to set the identity only in this repository.

fatal:********@asf940.gq1.ygridcore.net>) not allowed


Stack Trace:
org.apache.maven.wagon.TransferFailedException: 
Error interacting with SCM: Unable to commit file. The git-commit command failed. 
*** Please tell me who you are.

Run

  git config --global user.email "you@example.com"
  git config --global user.name "Your Name"

to set your account's default identity.
Omit --global to set the identity only in this repository.

fatal:********@asf940.gq1.ygridcore.net>) not allowed

Caused by: org.apache.maven.scm.ScmException: 
Unable to commit file. The git-commit command failed. 
*** Please tell me who you are.

Run

  git config --global user.email "you@example.com"
  git config --global user.name "Your Name"

to set your account's default identity.
Omit --global to set the identity only in this repository.

fatal:********@asf940.gq1.ygridcore.net>) not allowed



FAILED:  org.apache.maven.wagon.providers.scm.ScmGitExeWagonTest.linux-jdk7 / Build linux-jdk7 / testWagonPutDirectoryDeepDestination

Error Message:
Error interacting with SCM: Unable to commit file. The git-commit command failed. 
*** Please tell me who you are.

Run

  git config --global user.email "you@example.com"
  git config --global user.name "Your Name"

to set your account's default identity.
Omit --global to set the identity only in this repository.

fatal:********@asf940.gq1.ygridcore.net>) not allowed


Stack Trace:
org.apache.maven.wagon.TransferFailedException: 
Error interacting with SCM: Unable to commit file. The git-commit command failed. 
*** Please tell me who you are.

Run

  git config --global user.email "you@example.com"
  git config --global user.name "Your Name"

to set your account's default identity.
Omit --global to set the identity only in this repository.

fatal:********@asf940.gq1.ygridcore.net>) not allowed

Caused by: org.apache.maven.scm.ScmException: 
Unable to commit file. The git-commit command failed. 
*** Please tell me who you are.

Run

  git config --global user.email "you@example.com"
  git config --global user.name "Your Name"

to set your account's default identity.
Omit --global to set the identity only in this repository.

fatal:********@asf940.gq1.ygridcore.net>) not allowed



FAILED:  org.apache.maven.wagon.providers.scm.ScmGitExeWagonTest.linux-jdk7 / Build linux-jdk7 / testWagon

Error Message:

  Unexpected method call TransferListener.transferError(TransferEvent[PUT|ERROR|Repository[scm:git:file:///home/jenkins/jenkins-slave/workspace/maven-box_maven-wagon_WAGON-552/m/wagon-providers/wagon-scm/target/test-classes/test-repo-git-test/]|null|test-resource[len = 18; mod = 1549199574000]]):
    TransferListener.transferCompleted(TransferEvent[PUT|COMPLETED|Repository[scm:git:file:///home/jenkins/jenkins-slave/workspace/maven-box_maven-wagon_WAGON-552/m/wagon-providers/wagon-scm/target/test-classes/test-repo-git-test/]|/home/jenkins/jenkins-slave/workspace/maven-box_maven-wagon_WAGON-552/m/wagon-providers/wagon-scm/target/test-output/test-resource|test-resource[len = 18; mod = 1549199574000]]): expected: 1, actual: 0

Stack Trace:
java.lang.AssertionError: 

  Unexpected method call TransferListener.transferError(TransferEvent[PUT|ERROR|Repository[scm:git:file:///home/jenkins/jenkins-slave/workspace/maven-box_maven-wagon_WAGON-552/m/wagon-providers/wagon-scm/target/test-classes/test-repo-git-test/]|null|test-resource[len = 18; mod = 1549199574000]]):
    TransferListener.transferCompleted(TransferEvent[PUT|COMPLETED|Repository[scm:git:file:///home/jenkins/jenkins-slave/workspace/maven-box_maven-wagon_WAGON-552/m/wagon-providers/wagon-scm/target/test-classes/test-repo-git-test/]|/home/jenkins/jenkins-slave/workspace/maven-box_maven-wagon_WAGON-552/m/wagon-providers/wagon-scm/target/test-output/test-resource|test-resource[len = 18; mod = 1549199574000]]): expected: 1, actual: 0


FAILED:  org.apache.maven.wagon.providers.scm.ScmGitExeWagonTest.linux-jdk7 / Build linux-jdk7 / testWagonPutDirectoryForDot

Error Message:
Error interacting with SCM: Unable to commit file. The git-commit command failed. 
*** Please tell me who you are.

Run

  git config --global user.email "you@example.com"
  git config --global user.name "Your Name"

to set your account's default identity.
Omit --global to set the identity only in this repository.

fatal:********@asf940.gq1.ygridcore.net>) not allowed


Stack Trace:
org.apache.maven.wagon.TransferFailedException: 
Error interacting with SCM: Unable to commit file. The git-commit command failed. 
*** Please tell me who you are.

Run

  git config --global user.email "you@example.com"
  git config --global user.name "Your Name"

to set your account's default identity.
Omit --global to set the identity only in this repository.

fatal:********@asf940.gq1.ygridcore.net>) not allowed

Caused by: org.apache.maven.scm.ScmException: 
Unable to commit file. The git-commit command failed. 
*** Please tell me who you are.

Run

  git config --global user.email "you@example.com"
  git config --global user.name "Your Name"

to set your account's default identity.
Omit --global to set the identity only in this repository.

fatal:********@asf940.gq1.ygridcore.net>) not allowed



FAILED:  org.apache.maven.wagon.providers.scm.ScmGitExeWagonTest.linux-jdk7 / Build linux-jdk7 / testWagonPutDirectoryWhenDirectoryAlreadyExists

Error Message:
Error interacting with SCM: Unable to commit file. The git-commit command failed. 
*** Please tell me who you are.

Run

  git config --global user.email "you@example.com"
  git config --global user.name "Your Name"

to set your account's default identity.
Omit --global to set the identity only in this repository.

fatal:********@asf940.gq1.ygridcore.net>) not allowed


Stack Trace:
org.apache.maven.wagon.TransferFailedException: 
Error interacting with SCM: Unable to commit file. The git-commit command failed. 
*** Please tell me who you are.

Run

  git config --global user.email "you@example.com"
  git config --global user.name "Your Name"

to set your account's default identity.
Omit --global to set the identity only in this repository.

fatal:********@asf940.gq1.ygridcore.net>) not allowed

Caused by: org.apache.maven.scm.ScmException: 
Unable to commit file. The git-commit command failed. 
*** Please tell me who you are.

Run

  git config --global user.email "you@example.com"
  git config --global user.name "Your Name"

to set your account's default identity.
Omit --global to set the identity only in this repository.

fatal:********@asf940.gq1.ygridcore.net>) not allowed



FAILED:  org.apache.maven.wagon.providers.scm.ScmGitExeWagonTest.windows-jdk8 / Build windows-jdk8 / testWagonPutDirectory

Error Message:
Error checking out: command failed: Cloning into 'checkout-org.apache.maven.scm.provider.git.gitexe.GitExeScmProvider'...
fatal: '//2/m/wagon-providers/wagon-scm/target/test-classes/test-repo-git-test/' does not appear to be a git repository
fatal: Could not read from remote repository.

Please make sure you have the correct access rights
and the repository exists.

Stack Trace:
org.apache.maven.wagon.TransferFailedException: 
Error checking out: command failed: Cloning into 'checkout-org.apache.maven.scm.provider.git.gitexe.GitExeScmProvider'...
fatal: '//2/m/wagon-providers/wagon-scm/target/test-classes/test-repo-git-test/' does not appear to be a git repository
fatal: Could not read from remote repository.

Please make sure you have the correct access rights
and the repository exists.
Caused by: org.apache.maven.scm.ScmException: 
command failed: Cloning into 'checkout-org.apache.maven.scm.provider.git.gitexe.GitExeScmProvider'...
fatal: '//2/m/wagon-providers/wagon-scm/target/test-classes/test-repo-git-test/' does not appear to be a git repository
fatal: Could not read from remote repository.

Please make sure you have the correct access rights
and the repository exists.


FAILED:  org.apache.maven.wagon.providers.scm.ScmGitExeWagonTest.windows-jdk8 / Build windows-jdk8 / testWagonPutDirectoryDeepDestination

Error Message:
Error checking out: command failed: Cloning into 'checkout-org.apache.maven.scm.provider.git.gitexe.GitExeScmProvider'...
fatal: '//2/m/wagon-providers/wagon-scm/target/test-classes/test-repo-git-test/' does not appear to be a git repository
fatal: Could not read from remote repository.

Please make sure you have the correct access rights
and the repository exists.

Stack Trace:
org.apache.maven.wagon.TransferFailedException: 
Error checking out: command failed: Cloning into 'checkout-org.apache.maven.scm.provider.git.gitexe.GitExeScmProvider'...
fatal: '//2/m/wagon-providers/wagon-scm/target/test-classes/test-repo-git-test/' does not appear to be a git repository
fatal: Could not read from remote repository.

Please make sure you have the correct access rights
and the repository exists.
Caused by: org.apache.maven.scm.ScmException: 
command failed: Cloning into 'checkout-org.apache.maven.scm.provider.git.gitexe.GitExeScmProvider'...
fatal: '//2/m/wagon-providers/wagon-scm/target/test-classes/test-repo-git-test/' does not appear to be a git repository
fatal: Could not read from remote repository.

Please make sure you have the correct access rights
and the repository exists.


FAILED:  org.apache.maven.wagon.providers.scm.ScmGitExeWagonTest.windows-jdk8 / Build windows-jdk8 / testWagon

Error Message:

  Unexpected method call TransferListener.transferError(TransferEvent[GET|ERROR|Repository[scm:git:file://2/m/wagon-providers/wagon-scm/target/test-classes/test-repo-git-test/]|null|test-resource[len = 18; mod = 1549199584685]]):
    TransferListener.transferCompleted(TransferEvent[PUT|COMPLETED|Repository[scm:git:file://2/m/wagon-providers/wagon-scm/target/test-classes/test-repo-git-test/]|F:\jenkins\jenkins-slave\workspace\maven-box_maven-wagon_WAGON-552@2\m\wagon-providers\wagon-scm\target\test-output\test-resource|test-resource[len = 18; mod = 1549199584685]]): expected: 1, actual: 0

Stack Trace:
java.lang.AssertionError: 

  Unexpected method call TransferListener.transferError(TransferEvent[GET|ERROR|Repository[scm:git:file://2/m/wagon-providers/wagon-scm/target/test-classes/test-repo-git-test/]|null|test-resource[len = 18; mod = 1549199584685]]):
    TransferListener.transferCompleted(TransferEvent[PUT|COMPLETED|Repository[scm:git:file://2/m/wagon-providers/wagon-scm/target/test-classes/test-repo-git-test/]|F:\jenkins\jenkins-slave\workspace\maven-box_maven-wagon_WAGON-552@2\m\wagon-providers\wagon-scm\target\test-output\test-resource|test-resource[len = 18; mod = 1549199584685]]): expected: 1, actual: 0


FAILED:  org.apache.maven.wagon.providers.scm.ScmGitExeWagonTest.windows-jdk8 / Build windows-jdk8 / testWagonPutDirectoryForDot

Error Message:
Error checking out: command failed: Cloning into 'checkout-org.apache.maven.scm.provider.git.gitexe.GitExeScmProvider'...
fatal: '//2/m/wagon-providers/wagon-scm/target/test-classes/test-repo-git-test/' does not appear to be a git repository
fatal: Could not read from remote repository.

Please make sure you have the correct access rights
and the repository exists.

Stack Trace:
org.apache.maven.wagon.TransferFailedException: 
Error checking out: command failed: Cloning into 'checkout-org.apache.maven.scm.provider.git.gitexe.GitExeScmProvider'...
fatal: '//2/m/wagon-providers/wagon-scm/target/test-classes/test-repo-git-test/' does not appear to be a git repository
fatal: Could not read from remote repository.

Please make sure you have the correct access rights
and the repository exists.
Caused by: org.apache.maven.scm.ScmException: 
command failed: Cloning into 'checkout-org.apache.maven.scm.provider.git.gitexe.GitExeScmProvider'...
fatal: '//2/m/wagon-providers/wagon-scm/target/test-classes/test-repo-git-test/' does not appear to be a git repository
fatal: Could not read from remote repository.

Please make sure you have the correct access rights
and the repository exists.


FAILED:  org.apache.maven.wagon.providers.scm.ScmGitExeWagonTest.windows-jdk8 / Build windows-jdk8 / testFailedGet

Error Message:
Error getting file from SCM

Stack Trace:
org.apache.maven.wagon.TransferFailedException: Error getting file from SCM
Caused by: org.apache.maven.scm.ScmException: 
command failed: Cloning into 'checkout-org.apache.maven.scm.provider.git.gitexe.GitExeScmProvider'...
fatal: '//2/m/wagon-providers/wagon-scm/target/test-classes/test-repo-git-test/' does not appear to be a git repository
fatal: Could not read from remote repository.

Please make sure you have the correct access rights
and the repository exists.


FAILED:  org.apache.maven.wagon.providers.scm.ScmGitExeWagonTest.windows-jdk8 / Build windows-jdk8 / testWagonPutDirectoryWhenDirectoryAlreadyExists

Error Message:
Error checking out: command failed: Cloning into 'checkout-org.apache.maven.scm.provider.git.gitexe.GitExeScmProvider'...
fatal: '//2/m/wagon-providers/wagon-scm/target/test-classes/test-repo-git-test/' does not appear to be a git repository
fatal: Could not read from remote repository.

Please make sure you have the correct access rights
and the repository exists.

Stack Trace:
org.apache.maven.wagon.TransferFailedException: 
Error checking out: command failed: Cloning into 'checkout-org.apache.maven.scm.provider.git.gitexe.GitExeScmProvider'...
fatal: '//2/m/wagon-providers/wagon-scm/target/test-classes/test-repo-git-test/' does not appear to be a git repository
fatal: Could not read from remote repository.

Please make sure you have the correct access rights
and the repository exists.
Caused by: org.apache.maven.scm.ScmException: 
command failed: Cloning into 'checkout-org.apache.maven.scm.provider.git.gitexe.GitExeScmProvider'...
fatal: '//2/m/wagon-providers/wagon-scm/target/test-classes/test-repo-git-test/' does not appear to be a git repository
fatal: Could not read from remote repository.

Please make sure you have the correct access rights
and the repository exists.


FAILED:  org.apache.maven.wagon.providers.scm.ScmSvnExeWagonTest.linux-jdk8 / Build linux-jdk8 / testWagonPutDirectory

Error Message:
Error checking out: command failed: svn: E170013: Unable to connect to a repository at URL 'file://2/m/wagon-providers/wagon-scm/target/test-classes/test-repo-svn-test'
svn: E170000: Local URL 'file://2/m/wagon-providers/wagon-scm/target/test-classes/test-repo-svn-test' contains unsupported hostname

Stack Trace:
org.apache.maven.wagon.TransferFailedException: 
Error checking out: command failed: svn: E170013: Unable to connect to a repository at URL 'file://2/m/wagon-providers/wagon-scm/target/test-classes/test-repo-svn-test'
svn: E170000: Local URL 'file://2/m/wagon-providers/wagon-scm/target/test-classes/test-repo-svn-test' contains unsupported hostname
Caused by: org.apache.maven.scm.ScmException: 
command failed: svn: E170013: Unable to connect to a repository at URL 'file://2/m/wagon-providers/wagon-scm/target/test-classes/test-repo-svn-test'
svn: E170000: Local URL 'file://2/m/wagon-providers/wagon-scm/target/test-classes/test-repo-svn-test' contains unsupported hostname


FAILED:  org.apache.maven.wagon.providers.scm.ScmSvnExeWagonTest.linux-jdk8 / Build linux-jdk8 / testWagonPutDirectoryDeepDestination

Error Message:
Error checking out: command failed: svn: E170013: Unable to connect to a repository at URL 'file://2/m/wagon-providers/wagon-scm/target/test-classes/test-repo-svn-test'
svn: E170000: Local URL 'file://2/m/wagon-providers/wagon-scm/target/test-classes/test-repo-svn-test' contains unsupported hostname

Stack Trace:
org.apache.maven.wagon.TransferFailedException: 
Error checking out: command failed: svn: E170013: Unable to connect to a repository at URL 'file://2/m/wagon-providers/wagon-scm/target/test-classes/test-repo-svn-test'
svn: E170000: Local URL 'file://2/m/wagon-providers/wagon-scm/target/test-classes/test-repo-svn-test' contains unsupported hostname
Caused by: org.apache.maven.scm.ScmException: 
command failed: svn: E170013: Unable to connect to a repository at URL 'file://2/m/wagon-providers/wagon-scm/target/test-classes/test-repo-svn-test'
svn: E170000: Local URL 'file://2/m/wagon-providers/wagon-scm/target/test-classes/test-repo-svn-test' contains unsupported hostname


FAILED:  org.apache.maven.wagon.providers.scm.ScmSvnExeWagonTest.linux-jdk8 / Build linux-jdk8 / testWagon

Error Message:

  Unexpected method call TransferListener.transferError(TransferEvent[GET|ERROR|Repository[scm:svn:file://2/m/wagon-providers/wagon-scm/target/test-classes/test-repo-svn-test]|null|test-resource[len = 18; mod = 1549199560000]]):
    TransferListener.transferCompleted(TransferEvent[PUT|COMPLETED|Repository[scm:svn:file://2/m/wagon-providers/wagon-scm/target/test-classes/test-repo-svn-test]|/home/jenkins/jenkins-slave/workspace/maven-box_maven-wagon_WAGON-552@2/m/wagon-providers/wagon-scm/target/test-output/test-resource|test-resource[len = 18; mod = 1549199560000]]): expected: 1, actual: 0

Stack Trace:
java.lang.AssertionError: 

  Unexpected method call TransferListener.transferError(TransferEvent[GET|ERROR|Repository[scm:svn:file://2/m/wagon-providers/wagon-scm/target/test-classes/test-repo-svn-test]|null|test-resource[len = 18; mod = 1549199560000]]):
    TransferListener.transferCompleted(TransferEvent[PUT|COMPLETED|Repository[scm:svn:file://2/m/wagon-providers/wagon-scm/target/test-classes/test-repo-svn-test]|/home/jenkins/jenkins-slave/workspace/maven-box_maven-wagon_WAGON-552@2/m/wagon-providers/wagon-scm/target/test-output/test-resource|test-resource[len = 18; mod = 1549199560000]]): expected: 1, actual: 0


FAILED:  org.apache.maven.wagon.providers.scm.ScmSvnExeWagonTest.linux-jdk8 / Build linux-jdk8 / testWagonPutDirectoryForDot

Error Message:
Error checking out: command failed: svn: E170013: Unable to connect to a repository at URL 'file://2/m/wagon-providers/wagon-scm/target/test-classes/test-repo-svn-test'
svn: E170000: Local URL 'file://2/m/wagon-providers/wagon-scm/target/test-classes/test-repo-svn-test' contains unsupported hostname

Stack Trace:
org.apache.maven.wagon.TransferFailedException: 
Error checking out: command failed: svn: E170013: Unable to connect to a repository at URL 'file://2/m/wagon-providers/wagon-scm/target/test-classes/test-repo-svn-test'
svn: E170000: Local URL 'file://2/m/wagon-providers/wagon-scm/target/test-classes/test-repo-svn-test' contains unsupported hostname
Caused by: org.apache.maven.scm.ScmException: 
command failed: svn: E170013: Unable to connect to a repository at URL 'file://2/m/wagon-providers/wagon-scm/target/test-classes/test-repo-svn-test'
svn: E170000: Local URL 'file://2/m/wagon-providers/wagon-scm/target/test-classes/test-repo-svn-test' contains unsupported hostname


FAILED:  org.apache.maven.wagon.providers.scm.ScmSvnExeWagonTest.linux-jdk8 / Build linux-jdk8 / testWagonGetFileList

Error Message:

  Unexpected method call TransferListener.transferError(TransferEvent[GET|ERROR|Repository[scm:svn:file://2/m/wagon-providers/wagon-scm/target/test-classes/test-repo-svn-test]|null|file-list/test-resource.txt[len = 18; mod = 1549199560000]]):
    TransferListener.transferCompleted(TransferEvent[PUT|COMPLETED|Repository[scm:svn:file://2/m/wagon-providers/wagon-scm/target/test-classes/test-repo-svn-test]|/home/jenkins/jenkins-slave/workspace/maven-box_maven-wagon_WAGON-552@2/m/wagon-providers/wagon-scm/target/test-output/file-list/test-resource.txt|file-list/test-resource.txt[len = 18; mod = 1549199560000]]): expected: 1, actual: 0

Stack Trace:
java.lang.AssertionError: 

  Unexpected method call TransferListener.transferError(TransferEvent[GET|ERROR|Repository[scm:svn:file://2/m/wagon-providers/wagon-scm/target/test-classes/test-repo-svn-test]|null|file-list/test-resource.txt[len = 18; mod = 1549199560000]]):
    TransferListener.transferCompleted(TransferEvent[PUT|COMPLETED|Repository[scm:svn:file://2/m/wagon-providers/wagon-scm/target/test-classes/test-repo-svn-test]|/home/jenkins/jenkins-slave/workspace/maven-box_maven-wagon_WAGON-552@2/m/wagon-providers/wagon-scm/target/test-output/file-list/test-resource.txt|file-list/test-resource.txt[len = 18; mod = 1549199560000]]): expected: 1, actual: 0


FAILED:  org.apache.maven.wagon.providers.scm.ScmSvnExeWagonTest.linux-jdk8 / Build linux-jdk8 / testFailedGet

Error Message:
Error getting file from SCM

Stack Trace:
org.apache.maven.wagon.TransferFailedException: Error getting file from SCM
Caused by: org.apache.maven.scm.ScmException: 
command failed: svn: E170013: Unable to connect to a repository at URL 'file://2/m/wagon-providers/wagon-scm/target/test-classes/test-repo-svn-test'
svn: E170000: Local URL 'file://2/m/wagon-providers/wagon-scm/target/test-classes/test-repo-svn-test' contains unsupported hostname


FAILED:  org.apache.maven.wagon.providers.scm.ScmSvnExeWagonTest.linux-jdk8 / Build linux-jdk8 / testWagonPutDirectoryWhenDirectoryAlreadyExists

Error Message:
Error checking out: command failed: svn: E170013: Unable to connect to a repository at URL 'file://2/m/wagon-providers/wagon-scm/target/test-classes/test-repo-svn-test'
svn: E170000: Local URL 'file://2/m/wagon-providers/wagon-scm/target/test-classes/test-repo-svn-test' contains unsupported hostname

Stack Trace:
org.apache.maven.wagon.TransferFailedException: 
Error checking out: command failed: svn: E170013: Unable to connect to a repository at URL 'file://2/m/wagon-providers/wagon-scm/target/test-classes/test-repo-svn-test'
svn: E170000: Local URL 'file://2/m/wagon-providers/wagon-scm/target/test-classes/test-repo-svn-test' contains unsupported hostname
Caused by: org.apache.maven.scm.ScmException: 
command failed: svn: E170013: Unable to connect to a repository at URL 'file://2/m/wagon-providers/wagon-scm/target/test-classes/test-repo-svn-test'
svn: E170000: Local URL 'file://2/m/wagon-providers/wagon-scm/target/test-classes/test-repo-svn-test' contains unsupported hostname


FAILED:  org.apache.maven.wagon.providers.scm.ScmSvnExeWagonTest.linux-jdk8 / Build linux-jdk8 / testWagonResourceExists

Error Message:

  Unexpected method call TransferListener.transferError(TransferEvent[GET|ERROR|Repository[scm:svn:file://2/m/wagon-providers/wagon-scm/target/test-classes/test-repo-svn-test]|null|test-resource[len = 18; mod = 1549199561000]]):
    TransferListener.transferCompleted(TransferEvent[PUT|COMPLETED|Repository[scm:svn:file://2/m/wagon-providers/wagon-scm/target/test-classes/test-repo-svn-test]|/home/jenkins/jenkins-slave/workspace/maven-box_maven-wagon_WAGON-552@2/m/wagon-providers/wagon-scm/target/test-output/test-resource|test-resource[len = 18; mod = 1549199561000]]): expected: 1, actual: 0

Stack Trace:
java.lang.AssertionError: 

  Unexpected method call TransferListener.transferError(TransferEvent[GET|ERROR|Repository[scm:svn:file://2/m/wagon-providers/wagon-scm/target/test-classes/test-repo-svn-test]|null|test-resource[len = 18; mod = 1549199561000]]):
    TransferListener.transferCompleted(TransferEvent[PUT|COMPLETED|Repository[scm:svn:file://2/m/wagon-providers/wagon-scm/target/test-classes/test-repo-svn-test]|/home/jenkins/jenkins-slave/workspace/maven-box_maven-wagon_WAGON-552@2/m/wagon-providers/wagon-scm/target/test-output/test-resource|test-resource[len = 18; mod = 1549199561000]]): expected: 1, actual: 0


FAILED:  org.apache.maven.wagon.providers.scm.ScmSvnExeWagonTest.windows-jdk8 / Build windows-jdk8 / testWagonPutDirectory

Error Message:
Error checking out: command failed: svn: E180001: Unable to connect to a repository at URL 'file://2/m/wagon-providers/wagon-scm/target/test-classes/test-repo-svn-test'
svn: E180001: Unable to open an ra_local session to URL
svn: E180001: Unable to open repository 'file://2/m/wagon-providers/wagon-scm/target/test-classes/test-repo-svn-test'

Stack Trace:
org.apache.maven.wagon.TransferFailedException: 
Error checking out: command failed: svn: E180001: Unable to connect to a repository at URL 'file://2/m/wagon-providers/wagon-scm/target/test-classes/test-repo-svn-test'
svn: E180001: Unable to open an ra_local session to URL
svn: E180001: Unable to open repository 'file://2/m/wagon-providers/wagon-scm/target/test-classes/test-repo-svn-test'
Caused by: org.apache.maven.scm.ScmException: 
command failed: svn: E180001: Unable to connect to a repository at URL 'file://2/m/wagon-providers/wagon-scm/target/test-classes/test-repo-svn-test'
svn: E180001: Unable to open an ra_local session to URL
svn: E180001: Unable to open repository 'file://2/m/wagon-providers/wagon-scm/target/test-classes/test-repo-svn-test'


FAILED:  org.apache.maven.wagon.providers.scm.ScmSvnExeWagonTest.windows-jdk8 / Build windows-jdk8 / testWagonPutDirectoryDeepDestination

Error Message:
Error checking out: command failed: svn: E180001: Unable to connect to a repository at URL 'file://2/m/wagon-providers/wagon-scm/target/test-classes/test-repo-svn-test'
svn: E180001: Unable to open an ra_local session to URL
svn: E180001: Unable to open repository 'file://2/m/wagon-providers/wagon-scm/target/test-classes/test-repo-svn-test'

Stack Trace:
org.apache.maven.wagon.TransferFailedException: 
Error checking out: command failed: svn: E180001: Unable to connect to a repository at URL 'file://2/m/wagon-providers/wagon-scm/target/test-classes/test-repo-svn-test'
svn: E180001: Unable to open an ra_local session to URL
svn: E180001: Unable to open repository 'file://2/m/wagon-providers/wagon-scm/target/test-classes/test-repo-svn-test'
Caused by: org.apache.maven.scm.ScmException: 
command failed: svn: E180001: Unable to connect to a repository at URL 'file://2/m/wagon-providers/wagon-scm/target/test-classes/test-repo-svn-test'
svn: E180001: Unable to open an ra_local session to URL
svn: E180001: Unable to open repository 'file://2/m/wagon-providers/wagon-scm/target/test-classes/test-repo-svn-test'


FAILED:  org.apache.maven.wagon.providers.scm.ScmSvnExeWagonTest.windows-jdk8 / Build windows-jdk8 / testWagon

Error Message:

  Unexpected method call TransferListener.transferError(TransferEvent[GET|ERROR|Repository[scm:svn:file://2/m/wagon-providers/wagon-scm/target/test-classes/test-repo-svn-test]|null|test-resource[len = 18; mod = 1549199588326]]):
    TransferListener.transferCompleted(TransferEvent[PUT|COMPLETED|Repository[scm:svn:file://2/m/wagon-providers/wagon-scm/target/test-classes/test-repo-svn-test]|F:\jenkins\jenkins-slave\workspace\maven-box_maven-wagon_WAGON-552@2\m\wagon-providers\wagon-scm\target\test-output\test-resource|test-resource[len = 18; mod = 1549199588326]]): expected: 1, actual: 0

Stack Trace:
java.lang.AssertionError: 

  Unexpected method call TransferListener.transferError(TransferEvent[GET|ERROR|Repository[scm:svn:file://2/m/wagon-providers/wagon-scm/target/test-classes/test-repo-svn-test]|null|test-resource[len = 18; mod = 1549199588326]]):
    TransferListener.transferCompleted(TransferEvent[PUT|COMPLETED|Repository[scm:svn:file://2/m/wagon-providers/wagon-scm/target/test-classes/test-repo-svn-test]|F:\jenkins\jenkins-slave\workspace\maven-box_maven-wagon_WAGON-552@2\m\wagon-providers\wagon-scm\target\test-output\test-resource|test-resource[len = 18; mod = 1549199588326]]): expected: 1, actual: 0


FAILED:  org.apache.maven.wagon.providers.scm.ScmSvnExeWagonTest.windows-jdk8 / Build windows-jdk8 / testWagonPutDirectoryForDot

Error Message:
Error checking out: command failed: svn: E180001: Unable to connect to a repository at URL 'file://2/m/wagon-providers/wagon-scm/target/test-classes/test-repo-svn-test'
svn: E180001: Unable to open an ra_local session to URL
svn: E180001: Unable to open repository 'file://2/m/wagon-providers/wagon-scm/target/test-classes/test-repo-svn-test'

Stack Trace:
org.apache.maven.wagon.TransferFailedException: 
Error checking out: command failed: svn: E180001: Unable to connect to a repository at URL 'file://2/m/wagon-providers/wagon-scm/target/test-classes/test-repo-svn-test'
svn: E180001: Unable to open an ra_local session to URL
svn: E180001: Unable to open repository 'file://2/m/wagon-providers/wagon-scm/target/test-classes/test-repo-svn-test'
Caused by: org.apache.maven.scm.ScmException: 
command failed: svn: E180001: Unable to connect to a repository at URL 'file://2/m/wagon-providers/wagon-scm/target/test-classes/test-repo-svn-test'
svn: E180001: Unable to open an ra_local session to URL
svn: E180001: Unable to open repository 'file://2/m/wagon-providers/wagon-scm/target/test-classes/test-repo-svn-test'


FAILED:  org.apache.maven.wagon.providers.scm.ScmSvnExeWagonTest.windows-jdk8 / Build windows-jdk8 / testWagonGetFileList

Error Message:

  Unexpected method call TransferListener.transferError(TransferEvent[GET|ERROR|Repository[scm:svn:file://2/m/wagon-providers/wagon-scm/target/test-classes/test-repo-svn-test]|null|file-list/test-resource.txt[len = 18; mod = 1549199589171]]):
    TransferListener.transferCompleted(TransferEvent[PUT|COMPLETED|Repository[scm:svn:file://2/m/wagon-providers/wagon-scm/target/test-classes/test-repo-svn-test]|F:\jenkins\jenkins-slave\workspace\maven-box_maven-wagon_WAGON-552@2\m\wagon-providers\wagon-scm\target\test-output\file-list\test-resource.txt|file-list/test-resource.txt[len = 18; mod = 1549199589171]]): expected: 1, actual: 0

Stack Trace:
java.lang.AssertionError: 

  Unexpected method call TransferListener.transferError(TransferEvent[GET|ERROR|Repository[scm:svn:file://2/m/wagon-providers/wagon-scm/target/test-classes/test-repo-svn-test]|null|file-list/test-resource.txt[len = 18; mod = 1549199589171]]):
    TransferListener.transferCompleted(TransferEvent[PUT|COMPLETED|Repository[scm:svn:file://2/m/wagon-providers/wagon-scm/target/test-classes/test-repo-svn-test]|F:\jenkins\jenkins-slave\workspace\maven-box_maven-wagon_WAGON-552@2\m\wagon-providers\wagon-scm\target\test-output\file-list\test-resource.txt|file-list/test-resource.txt[len = 18; mod = 1549199589171]]): expected: 1, actual: 0


FAILED:  org.apache.maven.wagon.providers.scm.ScmSvnExeWagonTest.windows-jdk8 / Build windows-jdk8 / testFailedGet

Error Message:
Error getting file from SCM

Stack Trace:
org.apache.maven.wagon.TransferFailedException: Error getting file from SCM
Caused by: org.apache.maven.scm.ScmException: 
command failed: svn: E180001: Unable to connect to a repository at URL 'file://2/m/wagon-providers/wagon-scm/target/test-classes/test-repo-svn-test'
svn: E180001: Unable to open an ra_local session to URL
svn: E180001: Unable to open repository 'file://2/m/wagon-providers/wagon-scm/target/test-classes/test-repo-svn-test'


FAILED:  org.apache.maven.wagon.providers.scm.ScmSvnExeWagonTest.windows-jdk8 / Build windows-jdk8 / testWagonPutDirectoryWhenDirectoryAlreadyExists

Error Message:
Error checking out: command failed: svn: E180001: Unable to connect to a repository at URL 'file://2/m/wagon-providers/wagon-scm/target/test-classes/test-repo-svn-test'
svn: E180001: Unable to open an ra_local session to URL
svn: E180001: Unable to open repository 'file://2/m/wagon-providers/wagon-scm/target/test-classes/test-repo-svn-test'

Stack Trace:
org.apache.maven.wagon.TransferFailedException: 
Error checking out: command failed: svn: E180001: Unable to connect to a repository at URL 'file://2/m/wagon-providers/wagon-scm/target/test-classes/test-repo-svn-test'
svn: E180001: Unable to open an ra_local session to URL
svn: E180001: Unable to open repository 'file://2/m/wagon-providers/wagon-scm/target/test-classes/test-repo-svn-test'
Caused by: org.apache.maven.scm.ScmException: 
command failed: svn: E180001: Unable to connect to a repository at URL 'file://2/m/wagon-providers/wagon-scm/target/test-classes/test-repo-svn-test'
svn: E180001: Unable to open an ra_local session to URL
svn: E180001: Unable to open repository 'file://2/m/wagon-providers/wagon-scm/target/test-classes/test-repo-svn-test'


FAILED:  org.apache.maven.wagon.providers.scm.ScmSvnExeWagonTest.windows-jdk8 / Build windows-jdk8 / testWagonResourceExists

Error Message:

  Unexpected method call TransferListener.transferError(TransferEvent[GET|ERROR|Repository[scm:svn:file://2/m/wagon-providers/wagon-scm/target/test-classes/test-repo-svn-test]|null|test-resource[len = 18; mod = 1549199590081]]):
    TransferListener.transferCompleted(TransferEvent[PUT|COMPLETED|Repository[scm:svn:file://2/m/wagon-providers/wagon-scm/target/test-classes/test-repo-svn-test]|F:\jenkins\jenkins-slave\workspace\maven-box_maven-wagon_WAGON-552@2\m\wagon-providers\wagon-scm\target\test-output\test-resource|test-resource[len = 18; mod = 1549199590081]]): expected: 1, actual: 0

Stack Trace:
java.lang.AssertionError: 

  Unexpected method call TransferListener.transferError(TransferEvent[GET|ERROR|Repository[scm:svn:file://2/m/wagon-providers/wagon-scm/target/test-classes/test-repo-svn-test]|null|test-resource[len = 18; mod = 1549199590081]]):
    TransferListener.transferCompleted(TransferEvent[PUT|COMPLETED|Repository[scm:svn:file://2/m/wagon-providers/wagon-scm/target/test-classes/test-repo-svn-test]|F:\jenkins\jenkins-slave\workspace\maven-box_maven-wagon_WAGON-552@2\m\wagon-providers\wagon-scm\target\test-output\test-resource|test-resource[len = 18; mod = 1549199590081]]): expected: 1, actual: 0




Build log:
[...truncated 18292 lines...]
[INFO] Enabled default license matchers.
[INFO] Will parse SCM ignores for exclusions...
[INFO] Finished adding exclusions from SCM ignore files.
[INFO] 61 implicit excludes (use -debug for more details).
[INFO] Exclude: .checkstyle
[INFO] Exclude: **/*.odg
[INFO] Exclude: src/test/resources/**
[INFO] Exclude: src/main/resources/default-server-root/**
[INFO] Exclude: src/main/resources/ssh-keys/**
[INFO] Exclude: src/test/ssh-keys/**
[INFO] Exclude: .repository/**
[INFO] Exclude: out/**
[INFO] Exclude: .repository/**
[INFO] Exclude: .maven/spy.log
[INFO] Exclude: dependency-reduced-pom.xml
[INFO] Exclude: .java-version
[INFO] 12 resources included (use -debug for more details)
[withMaven] junitPublisher - Archive test results for Maven artifact org.apache.maven.wagon:wagon-ftp:jar:3.3.2-SNAPSHOT generated by maven-surefire-plugin:test (default-test): m\wagon-providers\wagon-ftp\target\surefire-reports\*.xml
Recording test results
[INFO] Rat check: Summary over all files. Unapproved: 0, unknown: 0, generated: 0, approved: 12 licenses.
[INFO] 
[INFO] --- maven-remote-resources-plugin:1.5:process (process-resource-bundles) @ wagon-webdav-jackrabbit ---
[INFO] 
[INFO] --- maven-resources-plugin:3.1.0:resources (default-resources) @ wagon-webdav-jackrabbit ---
[INFO] Using 'UTF-8' encoding to copy filtered resources.
[INFO] Copying 1 resource
[INFO] Copying 3 resources
[INFO] 
[INFO] --- maven-compiler-plugin:3.7.0:compile (default-compile) @ wagon-webdav-jackrabbit ---
[INFO] Changes detected - recompiling the module!
[INFO] Compiling 4 source files to F:\jenkins\jenkins-slave\workspace\maven-box_maven-wagon_WAGON-552\m\wagon-providers\wagon-webdav-jackrabbit\target\classes
[INFO] /F:/jenkins/jenkins-slave/workspace/maven-box_maven-wagon_WAGON-552/m/wagon-providers/wagon-webdav-jackrabbit/src/main/java/org/apache/maven/wagon/providers/webdav/WebDavWagon.java: F:\jenkins\jenkins-slave\workspace\maven-box_maven-wagon_WAGON-552\m\wagon-providers\wagon-webdav-jackrabbit\src\main\java\org\apache\maven\wagon\providers\webdav\WebDavWagon.java uses or overrides a deprecated API.
[INFO] /F:/jenkins/jenkins-slave/workspace/maven-box_maven-wagon_WAGON-552/m/wagon-providers/wagon-webdav-jackrabbit/src/main/java/org/apache/maven/wagon/providers/webdav/WebDavWagon.java: Recompile with -Xlint:deprecation for details.
[INFO] 
[INFO] --- plexus-component-metadata:1.7.1:generate-metadata (generate) @ wagon-webdav-jackrabbit ---
[INFO] Discovered 1 component descriptors(s)
[INFO] 
[INFO] --- animal-sniffer-maven-plugin:1.15:check (check-java-1.7-compat) @ wagon-webdav-jackrabbit ---
[INFO] Checking unresolved references to org.codehaus.mojo.signature:java17:1.0
[withMaven] junitPublisher - Archive test results for Maven artifact org.apache.maven.wagon:wagon-tck-http:jar:3.3.2-SNAPSHOT generated by maven-surefire-plugin:test (default-test): m/wagon-tcks/wagon-tck-http/target/surefire-reports/*.xml
Recording test results
[withMaven] junitPublisher - Archive test results for Maven artifact org.apache.maven.wagon:wagon-http-shared:jar:3.3.2-SNAPSHOT generated by maven-surefire-plugin:test (default-test): m\wagon-providers\wagon-http-shared\target\surefire-reports\*.xml
Recording test results
[INFO] 
[INFO] --- maven-resources-plugin:3.1.0:testResources (default-testResources) @ wagon-webdav-jackrabbit ---
[INFO] Using 'UTF-8' encoding to copy filtered resources.
[INFO] Copying 2 resources
[INFO] Copying 3 resources
[INFO] 
[INFO] --- maven-compiler-plugin:3.7.0:testCompile (default-testCompile) @ wagon-webdav-jackrabbit ---
[INFO] Changes detected - recompiling the module!
[INFO] Compiling 4 source files to F:\jenkins\jenkins-slave\workspace\maven-box_maven-wagon_WAGON-552\m\wagon-providers\wagon-webdav-jackrabbit\target\test-classes
None of the test reports contained any result
[withMaven] junitPublisher - Archive test results for Maven artifact org.apache.maven.wagon:wagon-http:jar:3.3.2-SNAPSHOT generated by maven-surefire-plugin:test (default-test): m/wagon-providers/wagon-http/target/surefire-reports/*.xml
Recording test results
[withMaven] junitPublisher - Archive test results for Maven artifact org.apache.maven.wagon:wagon-tck-http:jar:3.3.2-SNAPSHOT generated by maven-surefire-plugin:test (default-test): m\wagon-tcks\wagon-tck-http\target\surefire-reports\*.xml
Recording test results
None of the test reports contained any result
[withMaven] junitPublisher - Archive test results for Maven artifact org.apache.maven.wagon:wagon-http:jar:3.3.2-SNAPSHOT generated by maven-surefire-plugin:test (default-test): m\wagon-providers\wagon-http\target\surefire-reports\*.xml
Recording test results
[INFO] /F:/jenkins/jenkins-slave/workspace/maven-box_maven-wagon_WAGON-552/m/wagon-providers/wagon-webdav-jackrabbit/src/test/java/org/apache/maven/wagon/providers/webdav/HttpClientWagonTest.java: F:\jenkins\jenkins-slave\workspace\maven-box_maven-wagon_WAGON-552\m\wagon-providers\wagon-webdav-jackrabbit\src\test\java\org\apache\maven\wagon\providers\webdav\HttpClientWagonTest.java uses or overrides a deprecated API.
[INFO] /F:/jenkins/jenkins-slave/workspace/maven-box_maven-wagon_WAGON-552/m/wagon-providers/wagon-webdav-jackrabbit/src/test/java/org/apache/maven/wagon/providers/webdav/HttpClientWagonTest.java: Recompile with -Xlint:deprecation for details.
[INFO] 
[INFO] --- maven-surefire-plugin:2.20:test (default-test) @ wagon-webdav-jackrabbit ---
[INFO] 
[INFO] -------------------------------------------------------
[INFO]  T E S T S
[INFO] -------------------------------------------------------
[INFO] Running org.apache.maven.wagon.providers.webdav.HttpClientWagonTest
[INFO] Tests run: 6, Failures: 0, Errors: 0, Skipped: 0, Time elapsed: 1.05 s - in org.apache.maven.wagon.providers.webdav.HttpClientWagonTest
[INFO] Running org.apache.maven.wagon.providers.webdav.PathNavigatorTest
[INFO] Tests run: 1, Failures: 0, Errors: 0, Skipped: 0, Time elapsed: 0 s - in org.apache.maven.wagon.providers.webdav.PathNavigatorTest
[INFO] Running org.apache.maven.wagon.providers.webdav.WebDavsWagonTest
[withMaven] junitPublisher - Archive test results for Maven artifact org.apache.maven.wagon:wagon-http-lightweight:jar:3.3.2-SNAPSHOT generated by maven-surefire-plugin:test (default-test): m/wagon-providers/wagon-http-lightweight/target/surefire-reports/*.xml
Recording test results
[withMaven] junitPublisher - Archive test results for Maven artifact org.apache.maven.wagon:wagon-http-lightweight:jar:3.3.2-SNAPSHOT generated by maven-surefire-plugin:test (default-test): m\wagon-providers\wagon-http-lightweight\target\surefire-reports\*.xml
Recording test results
[withMaven] junitPublisher - Archive test results for Maven artifact org.apache.maven.wagon:wagon-scm:jar:3.3.2-SNAPSHOT generated by maven-surefire-plugin:test (default-test): m/wagon-providers/wagon-scm/target/surefire-reports/*.xml
Recording test results
[withMaven] junitPublisher - Archive test results for Maven artifact org.apache.maven.wagon:wagon-scm:jar:3.3.2-SNAPSHOT generated by maven-surefire-plugin:test (default-test): m\wagon-providers\wagon-scm\target\surefire-reports\*.xml
Recording test results
[withMaven] junitPublisher - Archive test results for Maven artifact org.apache.maven.wagon:wagon-ssh-common:jar:3.3.2-SNAPSHOT generated by maven-surefire-plugin:test (default-test): m/wagon-providers/wagon-ssh-common/target/surefire-reports/*.xml
Recording test results
[withMaven] junitPublisher - Archive test results for Maven artifact org.apache.maven.wagon:wagon-ssh-common:jar:3.3.2-SNAPSHOT generated by maven-surefire-plugin:test (default-test): m\wagon-providers\wagon-ssh-common\target\surefire-reports\*.xml
Recording test results
[withMaven] junitPublisher - Archive test results for Maven artifact org.apache.maven.wagon:wagon-ssh-common-test:jar:3.3.2-SNAPSHOT generated by maven-surefire-plugin:test (default-test): m/wagon-providers/wagon-ssh-common-test/target/surefire-reports/*.xml
Recording test results
[withMaven] junitPublisher - Archive test results for Maven artifact org.apache.maven.wagon:wagon-ssh-common-test:jar:3.3.2-SNAPSHOT generated by maven-surefire-plugin:test (default-test): m\wagon-providers\wagon-ssh-common-test\target\surefire-reports\*.xml
Recording test results
None of the test reports contained any result
[withMaven] junitPublisher - Archive test results for Maven artifact org.apache.maven.wagon:wagon-ssh-external:jar:3.3.2-SNAPSHOT generated by maven-surefire-plugin:test (default-test): m/wagon-providers/wagon-ssh-external/target/surefire-reports/*.xml
Recording test results
None of the test reports contained any result
[withMaven] junitPublisher - Archive test results for Maven artifact org.apache.maven.wagon:wagon-ssh-external:jar:3.3.2-SNAPSHOT generated by maven-surefire-plugin:test (default-test): m\wagon-providers\wagon-ssh-external\target\surefire-reports\*.xml
Recording test results
None of the test reports contained any result
[withMaven] junitPublisher - Archive test results for Maven artifact org.apache.maven.wagon:wagon-ssh:jar:3.3.2-SNAPSHOT generated by maven-surefire-plugin:test (default-test): m\wagon-providers\wagon-ssh\target\surefire-reports\*.xml
Recording test results
None of the test reports contained any result
[withMaven] junitPublisher - Archive test results for Maven artifact org.apache.maven.wagon:wagon-ssh:jar:3.3.2-SNAPSHOT generated by maven-surefire-plugin:test (default-test): m/wagon-providers/wagon-ssh/target/surefire-reports/*.xml
Recording test results
None of the test reports contained any result
[withMaven] junitPublisher - Archive test results for Maven artifact org.apache.maven.wagon:wagon-webdav-jackrabbit:jar:3.3.2-SNAPSHOT generated by maven-surefire-plugin:test (default-test): m\wagon-providers\wagon-webdav-jackrabbit\target\surefire-reports\*.xml
Recording test results
None of the test reports contained any result
[withMaven] junitPublisher - Archive test results for Maven artifact org.apache.maven.wagon:wagon-webdav-jackrabbit:jar:3.3.2-SNAPSHOT generated by maven-surefire-plugin:test (default-test): m/wagon-providers/wagon-webdav-jackrabbit/target/surefire-reports/*.xml
Recording test results
[withMaven] Publishers: Pipeline Graph Publisher: 8 ms, Junit Publisher: 19528 ms, Concordion Publisher: 1 ms, Dependencies Fingerprint Publisher: 740 ms, JGiven Publisher: 2 ms, SpotBugs Publisher: 1 ms
[Pipeline] // withMaven
[Pipeline] cleanWs
[WS-CLEANUP] Deleting project workspace...
[WS-CLEANUP] Deferred wipeout is used...
[WS-CLEANUP] done
[Pipeline] }
[Pipeline] // stage
[Pipeline] }
[Pipeline] // node
[Pipeline] }
[withMaven] openTasksPublisher - Scan Tasks for Maven artifact org.apache.maven.wagon:wagon-provider-api:jar:3.3.2-SNAPSHOT in source directory m/wagon-provider-api/src/main/java
[withMaven] openTasksPublisher - Scan Tasks for Maven artifact org.apache.maven.wagon:wagon-provider-test:jar:3.3.2-SNAPSHOT in source directory m/wagon-provider-test/src/main/java
[withMaven] openTasksPublisher - Scan Tasks for Maven artifact org.apache.maven.wagon:wagon-file:jar:3.3.2-SNAPSHOT in source directory m/wagon-providers/wagon-file/src/main/java
[withMaven] openTasksPublisher - Scan Tasks for Maven artifact org.apache.maven.wagon:wagon-ftp:jar:3.3.2-SNAPSHOT in source directory m/wagon-providers/wagon-ftp/src/main/java
[withMaven] openTasksPublisher - Scan Tasks for Maven artifact org.apache.maven.wagon:wagon-http-shared:jar:3.3.2-SNAPSHOT in source directory m/wagon-providers/wagon-http-shared/src/main/java
[withMaven] openTasksPublisher - Scan Tasks for Maven artifact org.apache.maven.wagon:wagon-tck-http:jar:3.3.2-SNAPSHOT in source directory m/wagon-tcks/wagon-tck-http/src/main/java
[withMaven] openTasksPublisher - Scan Tasks for Maven artifact org.apache.maven.wagon:wagon-http:jar:3.3.2-SNAPSHOT in source directory m/wagon-providers/wagon-http/src/main/java
[withMaven] openTasksPublisher - Scan Tasks for Maven artifact org.apache.maven.wagon:wagon-http-lightweight:jar:3.3.2-SNAPSHOT in source directory m/wagon-providers/wagon-http-lightweight/src/main/java
[withMaven] openTasksPublisher - Scan Tasks for Maven artifact org.apache.maven.wagon:wagon-scm:jar:3.3.2-SNAPSHOT in source directory m/wagon-providers/wagon-scm/src/main/java
[withMaven] openTasksPublisher - Scan Tasks for Maven artifact org.apache.maven.wagon:wagon-ssh-common:jar:3.3.2-SNAPSHOT in source directory m/wagon-providers/wagon-ssh-common/src/main/java
[withMaven] openTasksPublisher - Scan Tasks for Maven artifact org.apache.maven.wagon:wagon-ssh-common-test:jar:3.3.2-SNAPSHOT in source directory m/wagon-providers/wagon-ssh-common-test/src/main/java
[withMaven] openTasksPublisher - Scan Tasks for Maven artifact org.apache.maven.wagon:wagon-ssh-external:jar:3.3.2-SNAPSHOT in source directory m/wagon-providers/wagon-ssh-external/src/main/java
[withMaven] openTasksPublisher - Scan Tasks for Maven artifact org.apache.maven.wagon:wagon-ssh:jar:3.3.2-SNAPSHOT in source directory m/wagon-providers/wagon-ssh/src/main/java
[withMaven] openTasksPublisher - Scan Tasks for Maven artifact org.apache.maven.wagon:wagon-webdav-jackrabbit:jar:3.3.2-SNAPSHOT in source directory m/wagon-providers/wagon-webdav-jackrabbit/src/main/java
[TASKS] Scanning folder '/home/jenkins/jenkins-slave/workspace/maven-box_maven-wagon_WAGON-552' for files matching the pattern 'm/wagon-provider-api/src/main/java/**/*,m/wagon-provider-test/src/main/java/**/*,m/wagon-providers/wagon-file/src/main/java/**/*,m/wagon-providers/wagon-ftp/src/main/java/**/*,m/wagon-providers/wagon-http-shared/src/main/java/**/*,m/wagon-tcks/wagon-tck-http/src/main/java/**/*,m/wagon-providers/wagon-http/src/main/java/**/*,m/wagon-providers/wagon-http-lightweight/src/main/java/**/*,m/wagon-providers/wagon-scm/src/main/java/**/*,m/wagon-providers/wagon-ssh-common/src/main/java/**/*,m/wagon-providers/wagon-ssh-common-test/src/main/java/**/*,m/wagon-providers/wagon-ssh-external/src/main/java/**/*,m/wagon-providers/wagon-ssh/src/main/java/**/*,m/wagon-providers/wagon-webdav-jackrabbit/src/main/java/**/*' - excludes: null
[TASKS] Found 114 files to scan for tasks
[TASKS] Found 31 open tasks.
Skipping warnings blame since pipelines do not have an SCM link.%n
[withMaven] Publishers: Pipeline Graph Publisher: 12 ms, Generated Artifacts Publisher: 18081 ms, Invoker Publisher: 1 ms, Junit Publisher: 32219 ms, Concordion Publisher: 1 ms, Dependencies Fingerprint Publisher: 6839 ms, JGiven Publisher: 1 ms, Open Task Scanner Publisher: 8592 ms
[Pipeline] // withMaven
[Pipeline] cleanWs
[WS-CLEANUP] Deleting project workspace...
[WS-CLEANUP] Deferred wipeout is used...
[WS-CLEANUP] done
[Pipeline] }
[Pipeline] // stage
[Pipeline] }
[Pipeline] // node
[Pipeline] }
[INFO] Tests run: 69, Failures: 0, Errors: 0, Skipped: 0, Time elapsed: 33.742 s - in org.apache.maven.wagon.providers.webdav.WebDavsWagonTest
[INFO] Running org.apache.maven.wagon.providers.webdav.WebDavWagonTest
[INFO] Tests run: 69, Failures: 0, Errors: 0, Skipped: 0, Time elapsed: 26.863 s - in org.apache.maven.wagon.providers.webdav.WebDavWagonTest
[INFO] 
[INFO] Results:
[INFO] 
[INFO] Tests run: 145, Failures: 0, Errors: 0, Skipped: 0
[INFO] 
[INFO] 
[INFO] --- maven-jar-plugin:3.1.0:jar (default-jar) @ wagon-webdav-jackrabbit ---
[INFO] Building jar: F:\jenkins\jenkins-slave\workspace\maven-box_maven-wagon_WAGON-552\m\wagon-providers\wagon-webdav-jackrabbit\target\wagon-webdav-jackrabbit-3.3.2-SNAPSHOT.jar
[INFO] 
[INFO] --- maven-site-plugin:3.7.1:attach-descriptor (attach-descriptor) @ wagon-webdav-jackrabbit ---
[INFO] Skipping because packaging 'jar' is not pom.
[INFO] 
[INFO] --- maven-checkstyle-plugin:3.0.0:check (checkstyle-check) @ wagon-webdav-jackrabbit ---
[INFO] ------------------------------------------------------------------------
[INFO] Reactor Summary:
[INFO] 
[INFO] Apache Maven Wagon ................................. SUCCESS [ 48.940 s]
[INFO] Apache Maven Wagon :: API .......................... SUCCESS [ 16.774 s]
[INFO] Apache Maven Wagon :: Provider Test ................ SUCCESS [  6.296 s]
[INFO] Apache Maven Wagon :: Providers .................... SUCCESS [  2.175 s]
[INFO] Apache Maven Wagon :: Providers :: File Provider ... SUCCESS [  6.054 s]
[INFO] Apache Maven Wagon :: Providers :: FTP Provider .... SUCCESS [  9.334 s]
[INFO] Apache Maven Wagon :: Providers :: HTTP Shared Library SUCCESS [  6.442 s]
[INFO] Apache Maven Wagon :: Test Compatibility Kits ...... SUCCESS [  2.286 s]
[INFO] Apache Maven Wagon :: HTTP Test Compatibility Kit .. SUCCESS [  3.517 s]
[INFO] Apache Maven Wagon :: Providers :: HTTP Provider ... SUCCESS [05:03 min]
[INFO] Apache Maven Wagon :: Providers :: Lightweight HTTP Provider SUCCESS [02:17 min]
[INFO] Apache Maven Wagon :: Providers :: SCM Provider .... SUCCESS [01:31 min]
[INFO] Apache Maven Wagon :: Providers :: SSH Common Library SUCCESS [  4.461 s]
[INFO] Apache Maven Wagon :: Providers :: SSH Common Tests  SUCCESS [  4.572 s]
[INFO] Apache Maven Wagon :: Providers :: SSH External Provider SUCCESS [  2.717 s]
[INFO] Apache Maven Wagon :: Providers :: SSH Provider .... SUCCESS [  5.574 s]
[INFO] Apache Maven Wagon :: Providers :: WebDAV Provider . SUCCESS [01:06 min]
[INFO] ------------------------------------------------------------------------
[INFO] BUILD SUCCESS
[INFO] ------------------------------------------------------------------------
[INFO] Total time: 12:01 min
[INFO] Finished at: 2019-02-03T05:15:49-08:00
[INFO] Final Memory: 53M/395M
[INFO] ------------------------------------------------------------------------
[WARNING] The requested profile "run-its" could not be activated because it does not exist.
[INFO] [jenkins-event-spy] Generated F:\jenkins\jenkins-slave\workspace\maven-box_maven-wagon_WAGON-552@tmp\withMaven3a9b5061\maven-spy-20190203-050346-6622918193388840332910.log
Picked up JAVA_TOOL_OPTIONS: -Dmaven.ext.class.path="f:\jenkins\jenkins-slave\workspace\maven-box_maven-wagon_WAGON-552@tmp\withMaven3a9b5061\pipeline-maven-spy.jar" -Dorg.jenkinsci.plugins.pipeline.maven.reportsFolder="f:\jenkins\jenkins-slave\workspace\maven-box_maven-wagon_WAGON-552@tmp\withMaven3a9b5061" 
[Pipeline] }
[Pipeline] // dir
[Pipeline] }
[withMaven] junitPublisher - Archive test results for Maven artifact org.apache.maven.wagon:wagon-provider-api:jar:3.3.2-SNAPSHOT generated by maven-surefire-plugin:test (default-test): m\wagon-provider-api\target\surefire-reports\*.xml
Recording test results
[withMaven] junitPublisher - Archive test results for Maven artifact org.apache.maven.wagon:wagon-provider-test:jar:3.3.2-SNAPSHOT generated by maven-surefire-plugin:test (default-test): m\wagon-provider-test\target\surefire-reports\*.xml
Recording test results
None of the test reports contained any result
[withMaven] junitPublisher - Archive test results for Maven artifact org.apache.maven.wagon:wagon-file:jar:3.3.2-SNAPSHOT generated by maven-surefire-plugin:test (default-test): m\wagon-providers\wagon-file\target\surefire-reports\*.xml
Recording test results
[withMaven] junitPublisher - Archive test results for Maven artifact org.apache.maven.wagon:wagon-ftp:jar:3.3.2-SNAPSHOT generated by maven-surefire-plugin:test (default-test): m\wagon-providers\wagon-ftp\target\surefire-reports\*.xml
Recording test results
[withMaven] junitPublisher - Archive test results for Maven artifact org.apache.maven.wagon:wagon-http-shared:jar:3.3.2-SNAPSHOT generated by maven-surefire-plugin:test (default-test): m\wagon-providers\wagon-http-shared\target\surefire-reports\*.xml
Recording test results
[withMaven] junitPublisher - Archive test results for Maven artifact org.apache.maven.wagon:wagon-tck-http:jar:3.3.2-SNAPSHOT generated by maven-surefire-plugin:test (default-test): m\wagon-tcks\wagon-tck-http\target\surefire-reports\*.xml
Recording test results
None of the test reports contained any result
[withMaven] junitPublisher - Archive test results for Maven artifact org.apache.maven.wagon:wagon-http:jar:3.3.2-SNAPSHOT generated by maven-surefire-plugin:test (default-test): m\wagon-providers\wagon-http\target\surefire-reports\*.xml
Recording test results
[withMaven] junitPublisher - Archive test results for Maven artifact org.apache.maven.wagon:wagon-http-lightweight:jar:3.3.2-SNAPSHOT generated by maven-surefire-plugin:test (default-test): m\wagon-providers\wagon-http-lightweight\target\surefire-reports\*.xml
Recording test results
[withMaven] junitPublisher - Archive test results for Maven artifact org.apache.maven.wagon:wagon-scm:jar:3.3.2-SNAPSHOT generated by maven-surefire-plugin:test (default-test): m\wagon-providers\wagon-scm\target\surefire-reports\*.xml
Recording test results
[withMaven] junitPublisher - Archive test results for Maven artifact org.apache.maven.wagon:wagon-ssh-common:jar:3.3.2-SNAPSHOT generated by maven-surefire-plugin:test (default-test): m\wagon-providers\wagon-ssh-common\target\surefire-reports\*.xml
Recording test results
[withMaven] junitPublisher - Archive test results for Maven artifact org.apache.maven.wagon:wagon-ssh-common-test:jar:3.3.2-SNAPSHOT generated by maven-surefire-plugin:test (default-test): m\wagon-providers\wagon-ssh-common-test\target\surefire-reports\*.xml
Recording test results
None of the test reports contained any result
[withMaven] junitPublisher - Archive test results for Maven artifact org.apache.maven.wagon:wagon-ssh-external:jar:3.3.2-SNAPSHOT generated by maven-surefire-plugin:test (default-test): m\wagon-providers\wagon-ssh-external\target\surefire-reports\*.xml
Recording test results
None of the test reports contained any result
[withMaven] junitPublisher - Archive test results for Maven artifact org.apache.maven.wagon:wagon-ssh:jar:3.3.2-SNAPSHOT generated by maven-surefire-plugin:test (default-test): m\wagon-providers\wagon-ssh\target\surefire-reports\*.xml
Recording test results
None of the test reports contained any result
[withMaven] junitPublisher - Archive test results for Maven artifact org.apache.maven.wagon:wagon-webdav-jackrabbit:jar:3.3.2-SNAPSHOT generated by maven-surefire-plugin:test (default-test): m\wagon-providers\wagon-webdav-jackrabbit\target\surefire-reports\*.xml
Recording test results
[withMaven] Publishers: Pipeline Graph Publisher: 8 ms, Junit Publisher: 4915 ms, Concordion Publisher: 1 ms, Dependencies Fingerprint Publisher: 693 ms, JGiven Publisher: 1 ms, Jacoco Publisher: 1 ms
[Pipeline] // withMaven
[Pipeline] cleanWs
[WS-CLEANUP] Deleting project workspace...
[WS-CLEANUP] Deferred wipeout is used...
[WS-CLEANUP] done
[Pipeline] }
[Pipeline] // stage
[Pipeline] }
[Pipeline] // node
[Pipeline] }
[Pipeline] // parallel
[Pipeline] echo
[FAILURE-001] org.jenkinsci.plugins.scriptsecurity.sandbox.RejectedAccessException: Scripts not permitted to use method org.jenkinsci.plugins.workflow.support.steps.build.RunWrapper getRawBuild
[Pipeline] stage
[Pipeline] { (Notifications)
[Pipeline] echo
Build result: FAILURE
[Pipeline] jiraIssueSelector
[Pipeline] emailext
Mime
  • Unnamed multipart/mixed (inline, None, 0 bytes)
View raw message